<?xml version="1.0" encoding="UTF-8" standalone="no"?>
<svg
   xmlns:dc="http://purl.org/dc/elements/1.1/"
   xmlns:cc="http://creativecommons.org/ns#"
   xmlns:rdf="http://www.w3.org/1999/02/22-rdf-syntax-ns#"
   xmlns:svg="http://www.w3.org/2000/svg"
   xmlns="http://www.w3.org/2000/svg"
   xmlns:sodipodi="http://sodipodi.sourceforge.net/DTD/sodipodi-0.dtd"
   xmlns:inkscape="http://www.inkscape.org/namespaces/inkscape"
   id="svg2"
   version="1.1"
   inkscape:version="0.48.4 r9939"
   width="20"
   height="20"
   sodipodi:docname="suporte.svg">
  <metadata
     id="metadata10">
    <rdf:RDF>
      <cc:Work
         rdf:about="">
        <dc:format>image/svg+xml</dc:format>
        <dc:type
           rdf:resource="http://purl.org/dc/dcmitype/StillImage" />
        <dc:title></dc:title>
      </cc:Work>
    </rdf:RDF>
  </metadata>
  <defs
     id="defs8" />
  <sodipodi:namedview
     pagecolor="#ffffff"
     bordercolor="#666666"
     borderopacity="1"
     objecttolerance="10"
     gridtolerance="10"
     guidetolerance="10"
     inkscape:pageopacity="0"
     inkscape:pageshadow="2"
     inkscape:window-width="891"
     inkscape:window-height="595"
     id="namedview6"
     showgrid="false"
     inkscape:zoom="0.22425739"
     inkscape:cx="372.04724"
     inkscape:cy="526.18109"
     inkscape:window-x="0"
     inkscape:window-y="0"
     inkscape:window-maximized="0"
     inkscape:current-layer="svg2" />
  <path
     style="fill:#1B4F85;fill-opacity:1;stroke:none"
     d="M 10,1.7382813e-5 C 4.4770882,1.7382813e-5 0,4.4771174 0,10.000017 c 0,5.5229 4.4770882,10 10,10 5.522912,0 10,-4.4771 10,-10 C 20,4.4771174 15.522912,1.7382813e-5 10,1.7382813e-5 z M 10.91372,15.759617 H 9.0511903 v -1.7862 H 10.91372 v 1.7862 z m 0,-3.6934 v 0.5903 H 9.0511903 v -0.7272 c 0,-2.1948996 2.4975917,-2.5429996 2.4975917,-4.1027996 0,-0.7115 -0.63575,-1.2564 -1.468281,-1.2564 -0.8628046,0 -1.6196506,0.6358 -1.6196506,0.6358 l -1.0602724,-1.3176 c 0,0 1.0451355,-1.0899 2.846429,-1.0899 1.71116,0 3.299849,1.0596 3.299849,2.8457 6.88e-4,2.4989996 -2.633136,2.7872996 -2.633136,4.4220996 z"
     id="path4"
     inkscape:connector-curvature="0" />
</svg>
