"215568         ";"20120229";"20120229";"20120301";360;0
"215568         ";"20120229";"20120229";"20120301";0;27
"215602         ";"20120301";"20120301";"20120301";680;2
"215602         ";"20120301";"20120301";"20120301";544;0
"215608EXP      ";"20120228";"20120229";"20120301";392;0
"215665EXP      ";"20120229";"20120229";"20120301";540;0
"215665EXP      ";"20120301";"20120301";"20120301";540;0
"215698         ";"20120229";"20120229";"20120301";400;0
"215698         ";"20120229";"20120229";"20120301";200;0
"215700         ";"20120301";"20120301";"20120301";540;0
"270023         ";"20120229";"20120229";"20120301";2000;0
"270023         ";"20120229";"20120301";"20120301";2000;0
"270023         ";"20120301";"20120301";"20120301";5800;3
"F000AL2074     ";"20120225";"20120301";"20120301";15698;92
"212670         ";"20120301";"20120301";"20120301";152;0
"212674         ";"20120229";"20120229";"20120301";594;6
"212674         ";"20120301";"20120301";"20120301";594;6
"212674         ";"20120301";"20120301";"20120301";300;0
"212699         ";"20120229";"20120229";"20120301";7250;41
"215581         ";"20120229";"20120229";"20120301";4500;0
"215581         ";"20120301";"20120301";"20120301";4500;0
"215590         ";"20120301";"20120301";"20120301";570;0
"215590         ";"20120301";"20120301";"20120301";570;0
"215590         ";"20120301";"20120301";"20120301";570;0
"215603         ";"20120301";"20120301";"20120301";12000;15
"215616         ";"20120229";"20120301";"20120301";228;0
"215616         ";"20120301";"20120301";"20120301";266;0
"215616         ";"20120301";"20120301";"20120301";266;0
"215616         ";"20120301";"20120301";"20120301";487;9
"215698-1       ";"20120229";"20120229";"20120301";200;18
"F006N10039-1   ";"20120229";"20120229";"20120301";14500;0
"F006N10039-1   ";"20120301";"20120301";"20120301";28110;0
