"2154961EXP     ";"20130308";"20130309";"20130309";4600;0
"215714         ";"20130308";"20130308";"20130309";1096;0
"215714         ";"20130308";"20130308";"20130309";1680;48
"215714         ";"20130309";"20130309";"20130309";24;0
"215714         ";"20130309";"20130309";"20130309";410;0
