"1126610095     ";"20120707";"20120709";"20120709";6117;0
"1126610095     ";"20120709";"20120709";"20120709";91;0
"2154591EXP     ";"20120705";"20120705";"20120709";600;0
"215597EXP      ";"20120706";"20120706";"20120709";343;0
"215602         ";"20120709";"20120709";"20120709";272;15
"215602         ";"20120709";"20120709";"20120709";0;15
"215602         ";"20120709";"20120709";"20120709";408;0
"215602         ";"20120709";"20120709";"20120709";136;0
"215602         ";"20120709";"20120709";"20120709";0;13
"215602         ";"20120709";"20120709";"20120709";272;0
"215604         ";"20120709";"20120709";"20120709";1150;3
"215608EXP      ";"20120707";"20120707";"20120709";392;0
"215608EXP      ";"20120707";"20120709";"20120709";392;0
"215665EXP      ";"20120707";"20120707";"20120709";1188;1
"215665EXP      ";"20120706";"20120706";"20120709";864;0
"215665EXP      ";"20120706";"20120706";"20120709";16;0
"215665EXP      ";"20120706";"20120706";"20120709";92;0
"215698         ";"20120709";"20120709";"20120709";220;0
"215698         ";"20120709";"20120709";"20120709";220;0
"215698         ";"20120709";"20120709";"20120709";220;0
"215699         ";"20120709";"20120709";"20120709";322;0
"250004         ";"20120705";"20120706";"20120709";90;0
"260008         ";"20120709";"20120709";"20120709";500;3
"270006         ";"20120707";"20120709";"20120709";4069;0
"270022         ";"20120707";"20120707";"20120709";1290;0
"6992500381     ";"20120704";"20120709";"20120709";4400;0
"F000DR1064     ";"20120709";"20120709";"20120709";27000;643
"F000DR1068     ";"20120706";"20120706";"20120709";6266;0
"F006N10039     ";"20120709";"20120709";"20120709";12000;0
"212670         ";"20120709";"20120709";"20120709";570;0
"212670         ";"20120709";"20120709";"20120709";570;1
"212670         ";"20120709";"20120709";"20120709";570;1
"212670         ";"20120709";"20120709";"20120709";494;0
"212674         ";"20120709";"20120709";"20120709";300;0
"212674         ";"20120709";"20120709";"20120709";652;2
"215582         ";"20120707";"20120709";"20120709";4818;39
"215590         ";"20120709";"20120709";"20120709";570;1
"215597EXP-1    ";"20120706";"20120706";"20120709";343;7
"215597EXP-1    ";"20120709";"20120709";"20120709";0;27
"215608EXP-1    ";"20120707";"20120707";"20120709";392;16
"215608EXP-1    ";"20120707";"20120709";"20120709";392;12
"215616         ";"20120707";"20120707";"20120709";760;16
"215617         ";"20120707";"20120707";"20120709";754;30
"215696         ";"20120705";"20120707";"20120709";1080;3
"215698-1       ";"20120707";"20120707";"20120709";220;2
"215698-1       ";"20120707";"20120709";"20120709";220;0
"215698-1       ";"20120709";"20120709";"20120709";220;0
"F000DR1064-2   ";"20120709";"20120709";"20120709";19800;0
"F000DR1064-2   ";"20120709";"20120709";"20120709";19800;0
"F000DR1064-3   ";"20120706";"20120706";"20120709";8808;0
"F006N10039-1   ";"20120706";"20120707";"20120709";24000;0
"F006N10039-1   ";"20120706";"20120706";"20120709";17000;0
