"1000290008     ";"20120920";"20120921";"20120921";6750;0
"1000290009     ";"20120921";"20120921";"20120921";2880;30
"1126610125     ";"20120921";"20120921";"20120921";2000;0
"215597         ";"20120912";"20120913";"20120921";896;0
"215608EXP      ";"20120920";"20120920";"20120921";502;0
"215608EXP      ";"20120920";"20120921";"20120921";282;0
"215699         ";"20120920";"20120921";"20120921";882;0
"215699         ";"20120921";"20120921";"20120921";442;57
"215699         ";"20120921";"20120921";"20120921";0;6
"215714         ";"20120921";"20120921";"20120921";3080;10
"215714         ";"20120921";"20120921";"20120921";1680;6
"270006         ";"20120920";"20120921";"20120921";3400;24
"270006         ";"20120921";"20120921";"20120921";4080;0
"270006         ";"20120921";"20120921";"20120921";6120;0
"280001         ";"20120920";"20120920";"20120921";2000;0
"280001         ";"20120920";"20120921";"20120921";2000;0
"280001         ";"20120920";"20120921";"20120921";2000;0
"280001         ";"20120920";"20120921";"20120921";1400;0
"280004         ";"20120921";"20120921";"20120921";405;0
"280004         ";"20120921";"20120921";"20120921";9045;0
"3131323034     ";"20120920";"20120920";"20120921";6000;0
"9232081491     ";"20120921";"20120921";"20120921";9000;0
"F000DR1068     ";"20120921";"20120921";"20120921";14400;148
"F000DR1069     ";"20120919";"20120919";"20120921";7920;0
"F000DR1069     ";"20120921";"20120921";"20120921";7920;0
"F006S20435     ";"20120921";"20120921";"20120921";646;0
"212670         ";"20120921";"20120921";"20120921";570;1
"212670         ";"20120921";"20120921";"20120921";304;1
"215597-1       ";"20120921";"20120921";"20120921";481;0
"215608EXP-1    ";"20120920";"20120921";"20120921";403;2
"215608EXP-1    ";"20120921";"20120921";"20120921";381;0
"215696         ";"20120918";"20120921";"20120921";540;16
"215698-1       ";"20120920";"20120921";"20120921";440;4
"3131323034-1   ";"20120920";"20120921";"20120921";6000;0
"9401087410-7   ";"20120919";"20120919";"20120921";3321;0
"9401087410-8   ";"20120920";"20120921";"20120921";3321;0
"F000DR1069-2   ";"20120921";"20120921";"20120921";32560;0
"F000DR1069-2   ";"20120921";"20120921";"20120921";30748;0
"F000DR1069-2   ";"20120921";"20120921";"20120921";32560;0
"F000DR1069-2   ";"20120921";"20120921";"20120921";30748;0
"F006S20435-1   ";"20120921";"20120921";"20120921";646;0
