"2154591EXP     ";"20120424";"20120424";"20120425";600;0
"2154591EXP     ";"20120424";"20120424";"20120425";600;0
"2154591EXP     ";"20120424";"20120424";"20120425";646;0
"2154591EXP     ";"20120424";"20120424";"20120425";254;0
"2154591EXP     ";"20120425";"20120425";"20120425";2100;30
"215481         ";"20120425";"20120425";"20120425";604;0
"215481         ";"20120425";"20120425";"20120425";604;0
"215481         ";"20120425";"20120425";"20120425";0;95
"2155791        ";"20120425";"20120425";"20120425";180;1
"2155791        ";"20120425";"20120425";"20120425";25;0
"215602         ";"20120424";"20120425";"20120425";0;6
"215602         ";"20120425";"20120425";"20120425";408;5
"215602         ";"20120425";"20120425";"20120425";408;17
"215602         ";"20120425";"20120425";"20120425";408;0
"215608EXP      ";"20120424";"20120424";"20120425";392;0
"215698         ";"20120425";"20120425";"20120425";440;0
"215698         ";"20120425";"20120425";"20120425";220;0
"215698         ";"20120425";"20120425";"20120425";220;0
"215700         ";"20120425";"20120425";"20120425";2160;0
"215700         ";"20120425";"20120425";"20120425";540;0
"2253448C       ";"20120425";"20120425";"20120425";2588;0
"270001         ";"20120425";"20120425";"20120425";1099;0
"280001         ";"20120424";"20120424";"20120425";8400;0
"280001         ";"20120424";"20120424";"20120425";2100;0
"280001         ";"20120424";"20120425";"20120425";4500;0
"280001         ";"20120425";"20120425";"20120425";300;0
"280001         ";"20120425";"20120425";"20120425";2928;0
"F000DR1064     ";"20120424";"20120425";"20120425";36000;0
"F000DR1064     ";"20120425";"20120425";"20120425";13800;0
"F006MG1300     ";"20120425";"20120425";"20120425";12000;0
"F006MG1300     ";"20120425";"20120425";"20120425";8000;0
"F006MG1338     ";"20120423";"20120424";"20120425";5889;0
"F006MG1338     ";"20120424";"20120424";"20120425";18111;250
"F006MG1338     ";"20120424";"20120424";"20120425";1639;0
"F006MG1338     ";"20120424";"20120424";"20120425";10361;0
"F006N10039     ";"20120423";"20120423";"20120425";9785;102
"1191251001-1   ";"20120425";"20120425";"20120425";18000;0
"1191251001-1   ";"20120425";"20120425";"20120425";23600;0
"212670         ";"20120424";"20120424";"20120425";1026;0
"212689         ";"20120424";"20120424";"20120425";1840;0
"212689         ";"20120424";"20120424";"20120425";760;0
"215597EXP-1    ";"20120424";"20120425";"20120425";315;16
"215608EXP-1    ";"20120424";"20120424";"20120425";392;0
"215616         ";"20120424";"20120425";"20120425";400;0
"215616         ";"20120424";"20120424";"20120425";0;7
"215616         ";"20120425";"20120425";"20120425";228;29
"215616         ";"20120424";"20120424";"20120425";0;3
"215698-1       ";"20120424";"20120425";"20120425";440;2
"215698-1       ";"20120424";"20120425";"20120425";1;0
"215698-1       ";"20120425";"20120425";"20120425";220;3
"215698-1       ";"20120425";"20120425";"20120425";220;0
