"1126610126     ";"20120312";"20120312";"20120313";15000;0
"1126610126     ";"20120313";"20120313";"20120313";7500;0
"1126610126     ";"20120313";"20120313";"20120313";3699;0
"1126610126     ";"20120313";"20120313";"20120313";2051;0
"2126951EXP     ";"20120313";"20120313";"20120313";3600;0
"215597         ";"20120310";"20120312";"20120313";448;0
"215597EXP      ";"20120312";"20120313";"20120313";343;0
"215602         ";"20120313";"20120313";"20120313";816;6
"215602         ";"20120313";"20120313";"20120313";408;0
"215602         ";"20120313";"20120313";"20120313";544;0
"215604         ";"20120313";"20120313";"20120313";850;0
"215698         ";"20120312";"20120312";"20120313";200;0
"215710EXP      ";"20120313";"20120313";"20120313";540;0
"215710EXP      ";"20120313";"20120313";"20120313";324;0
"230001         ";"20120312";"20120312";"20120313";5200;224
"230001         ";"20120313";"20120313";"20120313";4680;104
"280004         ";"20120312";"20120312";"20120313";2160;0
"280004         ";"20120312";"20120312";"20120313";135;0
"280004         ";"20120312";"20120312";"20120313";672;41
"280004         ";"20120312";"20120312";"20120313";31;0
"280005         ";"20120313";"20120313";"20120313";12830;0
"9431081176     ";"20120313";"20120313";"20120313";3250;0
"F000DR1068-2   ";"20120313";"20120313";"20120313";10600;0
"F000DR1068-2   ";"20120313";"20120313";"20120313";11000;0
"F000DR1068-2   ";"20120313";"20120313";"20120313";10600;0
"F000DR1068-2   ";"20120313";"20120313";"20120313";11000;0
"F006MG1338     ";"20120313";"20120313";"20120313";3600;0
"F006N10039     ";"20120313";"20120313";"20120313";7098;160
"212677         ";"20120312";"20120312";"20120313";3520;270
"215597-1       ";"20120310";"20120312";"20120313";448;15
"215597EXP-1    ";"20120312";"20120313";"20120313";343;3
"215616         ";"20120312";"20120313";"20120313";532;3
"215616         ";"20120313";"20120313";"20120313";570;0
"215616         ";"20120313";"20120313";"20120313";342;2
"215616         ";"20120313";"20120313";"20120313";304;2
"215616         ";"20120313";"20120313";"20120313";76;0
"215696         ";"20120310";"20120313";"20120313";540;3
"215698-1       ";"20120312";"20120312";"20120313";200;6
"F000DR1064-1   ";"20120310";"20120312";"20120313";9000;140
"F000DR1064-1   ";"20120312";"20120312";"20120313";12600;0
"F000DR1064-1   ";"20120313";"20120313";"20120313";12600;0
"F000DR1064-2   ";"20120313";"20120313";"20120313";12600;0
"F000DR1064-2   ";"20120313";"20120313";"20120313";12600;0
"F000DR1064-2   ";"20120313";"20120313";"20120313";12600;0
"F000DR1064-2   ";"20120313";"20120313";"20120313";12600;0
"F000DR1064-2   ";"20120313";"20120313";"20120313";9000;0
"F000DR1068-1   ";"20120312";"20120313";"20120313";21600;2
"F000DR1068-1   ";"20120313";"20120313";"20120313";13098;0
"F000DR1068-1   ";"20120313";"20120313";"20120313";1302;0
"F000DR1068-1   ";"20120313";"20120313";"20120313";7200;1327
"F006N10039-2   ";"20130313";"20130313";"20120313";27753;0
