"1126610095     ";"20120227";"20120228";"20120228";26116;0
"215480         ";"20120227";"20120227";"20120228";825;0
"215480         ";"20120227";"20120227";"20120228";75;44
"215480         ";"20120227";"20120227";"20120228";79;0
"215589EXP      ";"20120228";"20120228";"20120228";984;0
"215598EXP      ";"20120227";"20120227";"20120228";588;0
"215598EXP      ";"20120228";"20120228";"20120228";420;0
"215598EXP      ";"20120228";"20120228";"20120228";84;0
"215602         ";"20120227";"20120227";"20120228";408;9
"215602         ";"20120228";"20120228";"20120228";816;0
"250004         ";"20120227";"20120227";"20120228";90;2
"250004         ";"20120227";"20120227";"20120228";90;0
"250004         ";"20120228";"20120228";"20120228";90;1
"270006         ";"20120227";"20120227";"20120228";5440;0
"270006         ";"20120227";"20120227";"20120228";680;0
"270006         ";"20120228";"20120228";"20120228";280;0
"270006         ";"20120228";"20120228";"20120228";3120;0
"9431081176     ";"20120228";"20120228";"20120228";1930;0
"F000DR1064     ";"20120228";"20120228";"20120228";9000;0
"F000DR1068-2   ";"20120228";"20120228";"20120228";59400;0
"F000DR1068-2   ";"20120228";"20120228";"20120228";26950;0
"F000DR1068-2   ";"20120228";"20120228";"20120228";32450;0
"F000LD1594EXP  ";"20120223";"20120223";"20120228";227;0
"212670         ";"20120228";"20120228";"20120228";114;0
"212677         ";"20120228";"20120228";"20120228";440;0
"212677         ";"20120228";"20120228";"20120228";440;242
"212689EXP      ";"20120223";"20120223";"20120228";4032;0
"212698         ";"20120228";"20120228";"20120228";240;0
"212698         ";"20120228";"20120228";"20120228";4560;0
"215582         ";"20120227";"20120227";"20120228";2623;0
"215590         ";"20120227";"20120227";"20120228";418;0
"215590         ";"20120228";"20120228";"20120228";570;0
"215590         ";"20120228";"20120228";"20120228";304;0
"215597EXP-1    ";"20120225";"20120225";"20120228";343;7
"215598EXP-1    ";"20120227";"20120227";"20120228";47;0
"215608EXP-1    ";"20120227";"20120227";"20120228";2;0
"215608EXP-1    ";"20120227";"20120228";"20120228";392;0
"215608EXP-1    ";"20120225";"20120227";"20120228";390;0
"215616         ";"20120227";"20120227";"20120228";304;19
"215616         ";"20120228";"20120228";"20120228";494;15
"215616         ";"20120228";"20120228";"20120228";190;0
"215698-1       ";"20120227";"20120227";"20120228";200;6
"260008-1       ";"20120222";"20120222";"20120228";5520;0
"F000DR1064-1   ";"20120227";"20120227";"20120228";12000;440
"F000DR1068-1   ";"20120224";"20120227";"20120228";28800;0
"F000DR1068-1   ";"20120228";"20120228";"20120228";9000;0
"F006N10039-1   ";"20120228";"20120228";"20120228";19500;0
