"212694         ";"20120802";"20120802";"20120803";3336;0
"212694         ";"20120802";"20120802";"20120803";7464;0
"2126951EXP     ";"20120802";"20120803";"20120803";13433;0
"215481         ";"20120803";"20120803";"20120803";604;0
"2155791EXP     ";"20120802";"20120802";"20120803";864;0
"2155791EXP     ";"20120803";"20120803";"20120803";216;0
"215598EXP      ";"20120802";"20120802";"20120803";504;0
"215598EXP      ";"20120802";"20120802";"20120803";168;0
"215598EXP      ";"20120803";"20120803";"20120803";588;0
"215598EXP      ";"20120803";"20120803";"20120803";336;0
"215602         ";"20120802";"20120802";"20120803";544;11
"215602         ";"20120803";"20120803";"20120803";408;0
"215602         ";"20120803";"20120803";"20120803";0;10
"215698         ";"20120803";"20120803";"20120803";660;0
"215698         ";"20120803";"20120803";"20120803";20;0
"215698         ";"20120803";"20120803";"20120803";200;0
"215699         ";"20120731";"20120802";"20120803";0;22
"215699         ";"20120802";"20120803";"20120803";1665;4
"215699         ";"20120803";"20120803";"20120803";383;0
"215700         ";"20120803";"20120803";"20120803";1080;0
"260007         ";"20120801";"20120801";"20120803";1050;0
"260007         ";"20120802";"20120802";"20120803";600;3
"260007         ";"20120802";"20120802";"20120803";290;0
"270001         ";"20120802";"20120802";"20120803";70;0
"270001         ";"20120802";"20120802";"20120803";0;1
"280001         ";"20120803";"20120803";"20120803";4200;0
"280001         ";"20120803";"20120803";"20120803";2100;0
"280001         ";"20120803";"20120803";"20120803";2100;0
"280004         ";"20120802";"20120803";"20120803";2835;24
"280004         ";"20120803";"20120803";"20120803";1485;2
"280004         ";"20120802";"20120803";"20120803";135;0
"280004         ";"20120803";"20120803";"20120803";1534;0
"3391095217     ";"20120802";"20120803";"20120803";15600;0
"F000AL2129     ";"20120803";"20120803";"20120803";2250;0
"F000CD1249     ";"20120802";"20120803";"20120803";120000;0
"F000DR1064     ";"20120803";"20120803";"20120803";30000;0
"F000DR1068-2   ";"20120802";"20120803";"20120803";82779;0
"F000DR1068-2   ";"20120802";"20120803";"20120803";82779;0
"F000DR1068-2   ";"20120803";"20120803";"20120803";46821;0
"F000DR1068-2   ";"20120803";"20120803";"20120803";46821;0
"F000DR1069     ";"20120802";"20120803";"20120803";29040;29
"F000ZS1266     ";"20120803";"20120803";"20120803";1200;0
"F006K10007     ";"20120802";"20120802";"20120803";1109;0
"F006MG1300     ";"20120802";"20120802";"20120803";0;573
"F006MG1300     ";"20120803";"20120803";"20120803";12000;0
"1126610125-1   ";"20120802";"20120803";"20120803";9713;0
"212670         ";"20120803";"20120803";"20120803";266;0
"212670         ";"20120803";"20120803";"20120803";266;3
"212670         ";"20120803";"20120803";"20120803";570;0
"215581         ";"20120803";"20120803";"20120803";3525;0
"215598EXP-1    ";"20120802";"20120802";"20120803";336;0
"215598EXP-1    ";"20120803";"20120803";"20120803";336;0
"215598EXP-1    ";"20120803";"20120803";"20120803";252;2
"215616         ";"20120802";"20120802";"20120803";1254;31
"215616         ";"20120803";"20120803";"20120803";684;9
"215696         ";"20120801";"20120802";"20120803";540;4
"215698-1       ";"20120802";"20120802";"20120803";313;3
"215698-1       ";"20120802";"20120802";"20120803";127;0
"215698-1       ";"20120802";"20120803";"20120803";440;0
"215698-1       ";"20120802";"20120803";"20120803";0;1
"F006K10007-3   ";"20120802";"20120802";"20120803";4000;0
"F006N10039-5   ";"20120802";"20120802";"20120803";20955;0
