"215568         ";"20120228";"20120228";"20120229";3240;0
"215598EXP      ";"20120228";"20120228";"20120229";84;0
"215602         ";"20120228";"20120228";"20120229";408;0
"215602         ";"20120229";"20120229";"20120229";272;0
"215608EXP      ";"20120228";"20120228";"20120229";388;0
"215608EXP      ";"20120228";"20120228";"20120229";4;0
"215665EXP      ";"20120228";"20120229";"20120229";972;0
"215698         ";"20120228";"20120228";"20120229";200;0
"250004         ";"20120228";"20120229";"20120229";90;6
"250004         ";"20120229";"20120229";"20120229";90;4
"270023         ";"20120229";"20120229";"20120229";2000;19
"270023         ";"20120229";"20120229";"20120229";2000;0
"3131323034     ";"20120229";"20120229";"20120229";12000;0
"F000AL2074     ";"20120229";"20120229";"20120229";4200;10
"F000AL2128     ";"20120224";"20120224";"20120229";1000;0
"F000DR1064     ";"20120229";"20120229";"20120229";18000;1789
"F000DR1068     ";"20120227";"20120228";"20120229";24000;0
"212670         ";"20120229";"20120229";"20120229";456;0
"212677         ";"20120229";"20120229";"20120229";5500;89
"212698         ";"20120228";"20120229";"20120229";4800;0
"212698         ";"20120229";"20120229";"20120229";2111;0
"212698         ";"20120229";"20120229";"20120229";2689;0
"212698         ";"20120229";"20120229";"20120229";3440;47
"212699         ";"20120228";"20120228";"20120229";9000;0
"212699         ";"20120229";"20120229";"20120229";3000;0
"215581         ";"20120229";"20120229";"20120229";9000;0
"215598EXP-1    ";"20120227";"20120227";"20120229";37;0
"215608EXP-1    ";"20120228";"20120228";"20120229";388;0
"215608EXP-1    ";"20120228";"20120228";"20120229";4;3
"215608EXP-1    ";"20120228";"20120228";"20120229";392;0
"215616         ";"20120229";"20120229";"20120229";190;0
"215616         ";"20120229";"20120229";"20120229";152;0
"215616         ";"20120229";"20120229";"20120229";456;0
"215696         ";"20120224";"20120228";"20120229";540;8
"215698-1       ";"20120227";"20120228";"20120229";400;5
"215698-1       ";"20120228";"20120229";"20120229";106;0
"215698-1       ";"20120229";"20120229";"20120229";94;14
"215713         ";"20120224";"20120224";"20120229";560;0
"3131323034-1   ";"20120229";"20120229";"20120229";946;0
"F006N10039-1   ";"20120228";"20120229";"20120229";31610;0
"F006N10039-1   ";"20120229";"20120229";"20120229";1240;0
"F006N10039-1   ";"20120229";"20120229";"20120229";150;0
"F006N10039-1   ";"20120229";"20120229";"20120229";6000;0
