1000290009     ,20120220,20120220,20120220,1080,0
1126610125     ,20120220,20120220,20120220,270,37
2155791        ,20120220,20120220,20120220,720,0
215597         ,20120217,20120218,20120220,1344,0
215602         ,20120218,20130220,20120220,680,1
215665EXP      ,20120220,20120220,20120220,108,0
215698         ,20120220,20120220,20120220,600,0
230001         ,20120218,20120218,20120220,5200,0
230001         ,20120220,20120220,20120220,5200,208
260007         ,20120216,20120220,20120220,1000,19
270001         ,20120218,20120218,20120220,1680,21
270001         ,20120220,20120220,20120220,1120,18
280001         ,20120218,20120218,20120220,3430,0
280003         ,20120220,20120220,20120220,5180,0
9232081491     ,20120218,20120218,20120220,14600,0
F000RS1059     ,20120220,20120220,20120220,12000,0
F000RS1067     ,20120218,20120220,20120220,20000,0
F000ZS1265     ,20120220,20120220,20120220,960,0
F006K10007     ,20120218,20120220,20120220,5200,0
1000290009-1A  ,20120218,20120220,20120220,10800,0
1000290009-1A  ,20120220,20120220,20120220,10800,0
212670         ,20120220,20120220,20120220,190,0
212670         ,20120220,20120220,20120220,570,0
215590         ,20120215,20120215,20120220,190,0
215590         ,20120206,20120206,20120220,224,0
215597-1       ,20120217,20120218,20120220,1344,5
215598EXP-1    ,20120217,20120218,20120220,168,1
215616         ,20120218,20120218,20120220,418,10
215616         ,20120220,20120220,20120220,570,0
215616         ,20120220,20120220,20120220,570,0
F000RS1059-1   ,20120218,20120218,20120220,6000,0
F000RS1059-1   ,20120220,20120220,20120220,6000,0
