"1000290008     ";"20120302";"20120302";"20120303";3500;0
"215567         ";"20120302";"20120302";"20120303";6800;0
"215602         ";"20120303";"20120303";"20120303";272;0
"215608EXP      ";"20120229";"20120229";"20120303";573;0
"215608EXP      ";"20120229";"20120303";"20120303";603;0
"215608EXP      ";"20120303";"20120303";"20120303";784;0
"215665EXP      ";"20120302";"20120302";"20120303";540;0
"215665EXP      ";"20120303";"20120303";"20120303";864;0
"230001         ";"20120302";"20120302";"20120303";5200;312
"230001         ";"20120303";"20120303";"20120303";5200;208
"250004         ";"20120302";"20120303";"20120303";270;1
"250004         ";"20120303";"20120303";"20120303";90;0
"270001         ";"20120303";"20120303";"20120303";1680;0
"270022         ";"20120302";"20120302";"20120303";3200;0
"270022         ";"20120302";"20120302";"20120303";2000;0
"3131322097     ";"20120303";"20120303";"20120303";6000;0
"3131322097     ";"20120303";"20120303";"20120303";12000;0
"3131323034     ";"20120302";"20120302";"20120303";10000;0
"3131323034     ";"20120303";"20120303";"20120303";95;0
"3131323034     ";"20120303";"20120303";"20120303";1905;0
"F000DR1064     ";"20120302";"20120303";"20120303";21600;0
"F000DR1064     ";"20120302";"20120303";"20120303";0;602
"F000DR1068     ";"20120303";"20120303";"20120303";2400;0
"F000DR1068-2   ";"20120303";"20120303";"20120303";2400;0
"F000DR1068-2   ";"20120303";"20120303";"20120303";2400;0
"F000LD1565     ";"20120303";"20120303";"20120303";3688;0
"212670         ";"20120303";"20120303";"20120303";152;0
"212670         ";"20120303";"20120303";"20120303";570;0
"212670         ";"20120303";"20120303";"20120303";570;0
"215608EXP-1    ";"20120228";"20120229";"20120303";781;0
"215608EXP-1    ";"20120229";"20120229";"20120303";3;21
"215608EXP-1    ";"20120229";"20120302";"20120303";784;0
"215616         ";"20120302";"20120302";"20120303";114;40
"215616         ";"20120303";"20120303";"20120303";570;0
"215616         ";"20120303";"20120303";"20120303";112;1
"215696         ";"20120302";"20120303";"20120303";540;2
"215698-1       ";"20120301";"20120303";"20120303";600;29
"3131323034-1   ";"20120303";"20120303";"20120303";95;0
"3131323034-1   ";"20120302";"20120303";"20120303";14000;0
"F000DR1068-1   ";"20120303";"20120303";"20120303";2400;0
