"215597EXP      ";"20130322";"20130323";"20130325";928;0
"215598EXP      ";"20130325";"20130325";"20130325";168;0
"260007         ";"20130320";"20130322";"20130325";4650;0
"260008         ";"20130323";"20130323";"20130325";1500;0
"260008         ";"20130325";"20130325";"20130325";500;0
"270001         ";"20130323";"20130323";"20130325";1246;19
"270001         ";"20130322";"20130322";"20130325";1834;0
"280004         ";"20130323";"20130323";"20130325";1350;0
"280004         ";"20130323";"20130323";"20130325";1792;0
"280004         ";"20130325";"20130325";"20130325";2912;0
"F000DR1064     ";"20130323";"20130323";"20130325";10800;379
"F000DR1069     ";"20130320";"20130322";"20130325";52800;1019
"F000DR1069     ";"20130322";"20130322";"20130325";0;346
"F000DR1069     ";"20130322";"20130322";"20130325";10560;0
"F000LD1565     ";"20130322";"20130322";"20130325";13500;0
"F000LD1565     ";"20130323";"20130323";"20130325";555;0
"212691         ";"20130322";"20130322";"20130325";10000;0
"212691         ";"20130322";"20130322";"20130325";3598;0
"215590         ";"20130322";"20130322";"20130325";950;1
"215597EXP-1    ";"20130322";"20130323";"20130325";1715;2
"215607TRAVA    ";"20130323";"20130323";"20130325";975;0
"260008-1       ";"20130325";"20130325";"20130325";12000;0
"F000DR1064-1   ";"20130323";"20130323";"20130325";18000;0
"F000DR1064-1   ";"20130325";"20130325";"20130325";9600;0
"F000DR1069-1   ";"20130322";"20130322";"20130325";0;1531
"F000DR1069-2   ";"20130323";"20130323";"20130325";2896;0
"F000DR1069-2   ";"20130323";"20130323";"20130325";2896;0
