"1126610126     ";"20120308";"20120308";"20120309";14000;0
"1126610126     ";"20120309";"20120309";"20120309";1000;0
"2154591EXP     ";"20120308";"20120308";"20120309";1500;16
"215597         ";"20120306";"20120309";"20120309";1344;0
"215602         ";"20120307";"20120307";"20120309";272;11
"215602         ";"20120308";"20120308";"20120309";544;7
"215602         ";"20120309";"20120309";"20120309";136;0
"215602         ";"20120309";"20120309";"20120309";136;2
"215608EXP      ";"20120308";"20120308";"20120309";392;0
"215698         ";"20120308";"20120309";"20120309";600;0
"215710EXP      ";"20120309";"20120309";"20120309";540;0
"260008         ";"20120307";"20120308";"20120309";2500;13
"260008         ";"20120309";"20120309";"20120309";600;0
"270001         ";"20120308";"20120308";"20120309";560;10
"270001         ";"20120308";"20120308";"20120309";1713;0
"270001         ";"20120308";"20120308";"20120309";2207;19
"270001         ";"20120309";"20120309";"20120309";840;0
"270001         ";"20120309";"20120309";"20120309";840;0
"270001         ";"20120309";"20120309";"20120309";1960;0
"270001         ";"20120309";"20120309";"20120309";560;0
"270026         ";"20120309";"20120309";"20120309";6000;50
"270027         ";"20120309";"20120309";"20120309";3000;154
"270031         ";"20120308";"20120308";"20120309";0;987
"270031         ";"20120309";"20120309";"20120309";21574;2
"F000DR1068     ";"20120308";"20120308";"20120309";18200;0
"F000DR1068     ";"20120308";"20120309";"20120309";65800;0
"F000DR1068-2   ";"20120309";"20120309";"20120309";7200;0
"F000DR1068-2   ";"20120309";"20120309";"20120309";7200;0
"F000DR1068-2   ";"20120309";"20120309";"20120309";9600;0
"F000DR1068-2   ";"20120309";"20120309";"20120309";9600;0
"F000DR1068-2   ";"20120309";"20120309";"20120309";9600;0
"F006N10039     ";"20120309";"20120309";"20120309";8000;0
"212670         ";"20120309";"20120309";"20120309";570;0
"215584         ";"20120308";"20120308";"20120309";24000;0
"215590         ";"20120308";"20120308";"20120309";1786;0
"215590         ";"20120309";"20120309";"20120309";456;0
"215591TRAVA    ";"20120308";"20120308";"20120309";18000;0
"215591TRAVA    ";"20120308";"20120309";"20120309";9000;0
"215591TRAVA    ";"20120309";"20120309";"20120309";17250;0
"215597-1       ";"20120306";"20120308";"20120309";896;16
"215597-1       ";"20120308";"20120309";"20120309";448;0
"215608EXP-1    ";"20120308";"20120308";"20120309";392;1
"215616         ";"20120308";"20120308";"20120309";76;26
"215616         ";"20120309";"20120309";"20120309";190;0
"215617         ";"20120308";"20120308";"20120309";8571;3
"215696         ";"20120307";"20120308";"20120309";1056;15
"215696         ";"20120309";"20120309";"20120309";24;0
"215698-1       ";"20120308";"20120309";"20120309";200;0
"215698-1       ";"20120308";"20120309";"20120309";0;17
"215698-1       ";"20120309";"20120309";"20120309";400;10
"3131323034-1   ";"20120308";"20120309";"20120309";28000;0
"F006N10039-2   ";"20120309";"20120309";"20120309";8000;0
