"1000290008     ";"20120913";"20120913";"20120914";7500;0
"1000290009     ";"20120914";"20120914";"20120914";1939;0
"1126610125     ";"20120914";"20120914";"20120914";1000;0
"1461904391     ";"20120914";"20120914";"20120914";600;0
"2154591EXP     ";"20120912";"20120912";"20120914";680;0
"215481         ";"20120914";"20120914";"20120914";1208;20
"215597EXP      ";"20120913";"20120914";"20120914";343;0
"215665EXP      ";"20120912";"20120912";"20120914";432;0
"215698         ";"20120914";"20120914";"20120914";220;0
"215699         ";"20120913";"20120914";"20120914";844;21
"215699         ";"20120913";"20120914";"20120914";0;2
"215700         ";"20120914";"20120914";"20120914";1620;0
"260007         ";"20120913";"20120913";"20120914";0;4
"260007         ";"20120913";"20120913";"20120914";0;3
"260007         ";"20120913";"20120913";"20120914";550;0
"260008         ";"20120911";"20120913";"20120914";0;20
"260008         ";"20120911";"20120913";"20120914";5200;0
"270005         ";"20120913";"20120914";"20120914";13480;0
"270026         ";"20120913";"20120913";"20120914";6000;0
"270031         ";"20120913";"20120914";"20120914";70000;0
"3131323034     ";"20120913";"20120913";"20120914";9530;160
"F000CD1249     ";"20120912";"20120913";"20120914";108000;0
"F006S20435     ";"20120913";"20120913";"20120914";70;10
"1461904391-4   ";"20120913";"20120914";"20120914";600;0
"212674         ";"20120914";"20120914";"20120914";900;6
"215582         ";"20120913";"20120913";"20120914";4416;0
"215590         ";"20120914";"20120914";"20120914";190;2
"215597EXP-1    ";"20120913";"20120913";"20120914";0;8
"215597EXP-1    ";"20120913";"20120914";"20120914";343;1
"215696         ";"20120913";"20120914";"20120914";540;1
"215696         ";"20120912";"20120914";"20120914";0;10
"215696         ";"20120913";"20120914";"20120914";0;4
"215698-1       ";"20120913";"20120914";"20120914";220;2
"9431081176-1   ";"20120913";"20120913";"20120914";232;0
"F000DR1064-2   ";"20120914";"20120914";"20120914";36000;0
"F000DR1064-2   ";"20120914";"20120914";"20120914";36000;0
"F000DR1064-3   ";"20120914";"20120914";"20120914";36000;0
"F000DR1069-1   ";"20120913";"20120913";"20120914";20240;0
"F006K20168-2   ";"20120914";"20120914";"20120914";17072;0
