"1000290009     ";"20120804";"20120804";"20120807";0;6
"2154591EXP     ";"20120807";"20120807";"20120807";3000;179
"215598EXP      ";"20120806";"20120806";"20120807";672;0
"215598EXP      ";"20120806";"20120807";"20120807";504;0
"215602         ";"20120807";"20120807";"20120807";272;0
"215665EXP      ";"20120806";"20120806";"20120807";465;0
"215665EXP      ";"20120806";"20120806";"20120807";615;1
"215698         ";"20120807";"20120807";"20120807";660;0
"215698         ";"20120807";"20120807";"20120807";220;0
"215699         ";"20120806";"20120806";"20120807";0;18
"215699         ";"20120807";"20120807";"20120807";0;2
"230001         ";"20120807";"20120807";"20120807";1040;0
"260007         ";"20120806";"20120806";"20120807";900;3
"280004         ";"20120807";"20120807";"20120807";3045;0
"3391095217     ";"20120803";"20120806";"20120807";10040;0
"F000AL2074     ";"20120806";"20120807";"20120807";20000;0
"F000CD1249     ";"20120804";"20120806";"20120807";46000;0
"F000DR1064     ";"20120806";"20120806";"20120807";710;0
"F000DR1064     ";"20120806";"20120806";"20120807";6427;0
"1000290008-1A  ";"20120806";"20120806";"20120807";9500;0
"1000290008-1A  ";"20120806";"20120806";"20120807";3750;0
"212670         ";"20120806";"20120806";"20120807";570;0
"212672         ";"20120807";"20120807";"20120807";18000;0
"215590         ";"20120806";"20120806";"20120807";1330;2
"215590         ";"20120807";"20120807";"20120807";304;0
"215598EXP-1    ";"20120803";"20120806";"20120807";2100;0
"215598EXP-1    ";"20120803";"20120806";"20120807";0;6
"215601         ";"20120806";"20120806";"20120807";76;0
"215601         ";"20120804";"20120804";"20120807";0;19
"215603         ";"20120806";"20120807";"20120807";14230;0
"215603         ";"20120806";"20120807";"20120807";7;0
"215608EXP-1    ";"20120806";"20120806";"20120807";784;8
"215610         ";"20120806";"20120806";"20120807";2277;26
"215616         ";"20120806";"20120806";"20120807";836;15
"215616         ";"20120807";"20120807";"20120807";1026;18
"215696         ";"20120804";"20120806";"20120807";309;13
"215696         ";"20120804";"20120806";"20120807";231;0
"215698-1       ";"20120806";"20120807";"20120807";440;3
"215698-1       ";"20120807";"20120807";"20120807";220;0
"9401087410-4   ";"20120807";"20120807";"20120807";3000;0
"9401087410-5   ";"20120807";"20120807";"20120807";3000;0
"F000DR1069-1   ";"20120807";"20120807";"20120807";16526;0
"F006N10039-2   ";"20120806";"20120806";"20120807";66928;0
