"1000290008     ";"20120323";"20120323";"20120323";250;0
"1126610125     ";"20120322";"20120322";"20120323";3500;0
"1126610126     ";"20120322";"20120323";"20120323";11250;0
"1126610126     ";"20120323";"20120323";"20120323";3750;0
"1126610126     ";"20120323";"20120323";"20120323";7500;0
"1126610126     ";"20120323";"20120323";"20120323";7500;0
"212694         ";"20120323";"20120323";"20120323";650;0
"212694         ";"20120323";"20120323";"20120323";230;0
"212694         ";"20120323";"20120323";"20120323";103;0
"2154591EXP     ";"20120315";"20120315";"20120323";243;0
"2154591EXP     ";"20120323";"20120323";"20120323";452;0
"2155791EXP     ";"20120323";"20120323";"20120323";648;0
"215597EXP      ";"20120320";"20120322";"20120323";412;0
"215597EXP      ";"20120322";"20120322";"20120323";274;0
"215602         ";"20120323";"20120323";"20120323";544;13
"215602         ";"20120323";"20120323";"20120323";136;5
"215602         ";"20120323";"20120323";"20120323";408;0
"215602         ";"20120323";"20120323";"20120323";680;0
"215602         ";"20120323";"20120323";"20120323";0;4
"215602         ";"20120323";"20120323";"20120323";544;0
"215698         ";"20120321";"20120321";"20120323";400;0
"215698         ";"20120322";"20120323";"20120323";200;0
"230001         ";"20120323";"20120323";"20120323";5200;520
"260007         ";"20120321";"20120322";"20120323";1900;11
"270001         ";"20120322";"20120322";"20120323";1400;9
"270001         ";"20120323";"20120323";"20120323";560;0
"270001         ";"20120323";"20120323";"20120323";1120;0
"270001         ";"20120323";"20120323";"20120323";2240;0
"270001         ";"20120323";"20120323";"20120323";4200;0
"280001         ";"20120322";"20120322";"20120323";0;1
"280001         ";"20120322";"20120322";"20120323";1200;0
"280002         ";"20120321";"20120322";"20120323";6000;0
"280002         ";"20120323";"20120323";"20120323";4000;0
"280002         ";"20120322";"20120322";"20120323";3189;0
"280003         ";"20120321";"20120322";"20120323";6000;0
"280003         ";"20120323";"20120323";"20120323";4000;0
"280003         ";"20120323";"20120323";"20120323";3189;0
"F000DR1064     ";"20120223";"20120223";"20120323";8400;0
"F000DR1068     ";"20120223";"20120223";"20120323";12000;0
"F000DR1068-2   ";"20120323";"20120323";"20120323";10500;0
"F000DR1068-2   ";"20120323";"20120323";"20120323";10500;0
"212670         ";"20120322";"20120322";"20120323";380;15
"212674         ";"20120322";"20120322";"20120323";300;0
"212674         ";"20120323";"20120323";"20120323";900;0
"212689         ";"20120323";"20120323";"20120323";695;0
"215590         ";"20120323";"20120323";"20120323";570;0
"215597EXP-1    ";"20120321";"20120322";"20120323";660;2
"215597EXP-1    ";"20120322";"20120322";"20120323";26;0
"215598EXP-1    ";"20120322";"20120323";"20120323";252;3
"215616         ";"20120322";"20120323";"20120323";430;0
"215616         ";"20120323";"20120323";"20120323";152;0
"215616         ";"20120323";"20120323";"20120323";76;0
"215616         ";"20120323";"20120323";"20120323";99;0
"215616         ";"20120323";"20120323";"20120323";15;0
"215616         ";"20120323";"20120323";"20120323";570;0
"215618         ";"20120323";"20120323";"20120323";12400;0
"215696         ";"20120322";"20120322";"20120323";540;3
"215698-1       ";"20120322";"20120322";"20120323";200;1
"215698-1       ";"20120322";"20120323";"20120323";200;14
"F000DR1064-2   ";"20120323";"20120323";"20120323";52200;0
"F000DR1064-2   ";"20120322";"20120323";"20120323";52200;0
"F000DR1064-3   ";"20120321";"20120323";"20120323";69473;0
"F000DR1064-3   ";"20120323";"20120323";"20120323";19927;0
"F000DR1068-1   ";"20120322";"20120323";"20120323";10500;180
