"1126610095     ";"20121023";"20121023";"20121023";3750;0
"1126610095     ";"20121023";"20121023";"20121023";3750;0
"1126610095     ";"20121023";"20121023";"20121023";3750;0
"1126610095     ";"20121023";"20121023";"20121023";3750;0
"1126610126     ";"20121022";"20121022";"20121023";11250;0
"2126951EXP     ";"20121023";"20121023";"20121023";7200;0
"2126951EXP     ";"20121023";"20121023";"20121023";3000;0
"2126951EXP     ";"20121023";"20121023";"20121023";3000;0
"2126951EXP     ";"20121023";"20121023";"20121023";3000;0
"2126951EXP     ";"20121023";"20121023";"20121023";0;156
"2126951EXP     ";"20121023";"20121023";"20121023";1000;0
"215597         ";"20121023";"20121023";"20121023";896;0
"215597EXP      ";"20121023";"20121023";"20121023";686;0
"215597EXP      ";"20121023";"20121023";"20121023";686;0
"260007         ";"20121019";"20121019";"20121023";550;0
"270001         ";"20121023";"20121023";"20121023";231;0
"270005         ";"20121022";"20121023";"20121023";1800;0
"270026         ";"20121023";"20121023";"20121023";2883;0
"270026         ";"20121023";"20121023";"20121023";0;144
"270027         ";"20121023";"20121023";"20121023";2883;383
"270027         ";"20121023";"20121023";"20121023";0;29
"270033         ";"20121022";"20121022";"20121023";40000;0
"270033         ";"20121022";"20121022";"20121023";5000;0
"280001         ";"20121023";"20121023";"20121023";0;191
"F000DR1064     ";"20121022";"20121023";"20121023";34800;600
"F000DR1064     ";"20121022";"20121023";"20121023";0;634
"F000DR1068-2   ";"20121022";"20121022";"20121023";96000;0
"F000DR1068-2   ";"20121022";"20121022";"20121023";77600;0
"F000DR1068-2   ";"20121022";"20121022";"20121023";18400;0
"F000DR1068-2   ";"20121022";"20121022";"20121023";18400;0
"F000DR1069     ";"20121022";"20121022";"20121023";26400;365
"212672         ";"20121022";"20121022";"20121023";14400;0
"212672         ";"20121022";"20121023";"20121023";10600;0
"212672         ";"20121023";"20121023";"20121023";500;0
"212691         ";"20121022";"20121022";"20121023";7114;0
"215580         ";"20121023";"20121023";"20121023";1000;0
"215580         ";"20121023";"20121023";"20121023";1000;0
"215580         ";"20121023";"20121023";"20121023";1000;0
"215580         ";"20121023";"20121023";"20121023";1000;0
"215580         ";"20121023";"20121023";"20121023";1000;0
"215580         ";"20121023";"20121023";"20121023";0;79
"215581         ";"20121022";"20121022";"20121023";1605;0
"215590         ";"20121022";"20121022";"20121023";1140;0
"215590         ";"20121022";"20121023";"20121023";570;0
"215590         ";"20121023";"20121023";"20121023";570;0
"215590         ";"20121023";"20121023";"20121023";570;0
"215590         ";"20121023";"20121023";"20121023";646;3
"215590         ";"20121023";"20121023";"20121023";570;0
"215597EXP-1    ";"20121022";"20121022";"20121023";343;10
"215597EXP-1    ";"20121022";"20121023";"20121023";343;0
"215597EXP-1    ";"20121023";"20121023";"20121023";0;6
"215597EXP-1    ";"20121023";"20121023";"20121023";343;0
"215608EXP-1    ";"20121022";"20121022";"20121023";0;6
"215608EXP-1    ";"20121022";"20121023";"20121023";392;5
"215608EXP-1    ";"20121023";"20121023";"20121023";0;9
"F000DR1069-2   ";"20121023";"20121023";"20121023";4400;0
"F000DR1069-2   ";"20121023";"20121023";"20121023";4400;0
