"1000290008     ";"20130624";"20130624";"20130624";750;0
"1126610125     ";"20130624";"20130624";"20130624";10750;0
"1126610125     ";"20130624";"20130624";"20130624";11000;0
"215597EXP      ";"20130621";"20130624";"20130624";343;0
"215597EXP      ";"20130624";"20130624";"20130624";343;0
"215608EXP      ";"20130620";"20130621";"20130624";392;0
"215710EXP      ";"20130624";"20130624";"20130624";324;0
"215710EXP      ";"20130624";"20130624";"20130624";756;0
"215714         ";"20130621";"20130621";"20130624";603;16
"260001         ";"20130624";"20130624";"20130624";2528;0
"260002         ";"20130624";"20130624";"20130624";2434;0
"260007         ";"20130621";"20130621";"20130624";1100;4
"260008         ";"20130621";"20130621";"20130624";0;3
"270006         ";"20130621";"20130621";"20130624";2720;0
"270006         ";"20130621";"20130621";"20130624";4760;0
"270006         ";"20130624";"20130624";"20130624";7480;0
"270006         ";"20130624";"20130624";"20130624";2348;0
"270006         ";"20130624";"20130624";"20130624";2720;0
"270025         ";"20130624";"20130624";"20130624";2363;0
"270025         ";"20130624";"20130624";"20130624";430;0
"280001         ";"20130624";"20130624";"20130624";3000;0
"280004         ";"20130624";"20130624";"20130624";2912;0
"280004         ";"20130624";"20130624";"20130624";1120;0
"280005         ";"20130621";"20130624";"20130624";15000;0
"F000AL2128     ";"20130621";"20130621";"20130624";1500;0
"F000DR1064     ";"20130621";"20130621";"20130624";7800;35
"F000DR1069     ";"20130621";"20130624";"20130624";6160;36
"1126610125-1   ";"20130621";"20130621";"20130624";7000;175
"215580         ";"20130624";"20130624";"20130624";3000;0
"215590         ";"20130624";"20130624";"20130624";570;2
"215590         ";"20130624";"20130624";"20130624";570;0
"215590         ";"20130624";"20130624";"20130624";570;0
"215590         ";"20130624";"20130624";"20130624";570;0
"215590         ";"20130624";"20130624";"20130624";570;0
"215597EXP-1    ";"20130621";"20130624";"20130624";343;2
"215597EXP-1    ";"20130624";"20130624";"20130624";343;0
"215597EXP-1    ";"20130624";"20130624";"20130624";0;3
"215608EXP-1    ";"20130620";"20130621";"20130624";392;3
"215613         ";"20130621";"20130624";"20130624";720;1
"F000AL2128-2   ";"20130624";"20130624";"20130624";0;3950
"F000DR1064-1   ";"20130620";"20130621";"20130624";40000;0
"F000DR1064-1   ";"20130624";"20130624";"20130624";200;0
"F000DR1064-2   ";"20130620";"20130624";"20130624";36000;0
"F000DR1064-2   ";"20130620";"20130624";"20130624";36000;0
"F000DR1064-3   ";"20130624";"20130624";"20130624";36000;0
"F006N10039-1   ";"20130621";"20130621";"20130624";30000;0
"F006N10039-2   ";"20130624";"20130624";"20130624";30000;0
"F006N10039-3   ";"20130624";"20130624";"20130624";84000;0
