"1126610095     ";"20121114";"20121114";"20121114";0;18239
"2154591EXP     ";"20121114";"20121114";"20121114";600;23
"2155791        ";"20121114";"20121114";"20121114";900;1
"2155791        ";"20121114";"20121114";"20121114";40;0
"2155791        ";"20121114";"20121114";"20121114";180;0
"215608EXP      ";"20121113";"20121113";"20121114";1568;0
"215608EXP      ";"20121114";"20121114";"20121114";784;0
"215698         ";"20121113";"20121113";"20121114";660;0
"215699         ";"20121110";"20121113";"20121114";0;15
"215700         ";"20121114";"20121114";"20121114";1620;0
"260004         ";"20121113";"20121113";"20121114";1572;0
"270005         ";"20121114";"20121114";"20121114";1800;0
"280001         ";"20121113";"20121113";"20121114";1000;0
"280001         ";"20121113";"20121113";"20121114";1000;0
"280001         ";"20121113";"20121113";"20121114";1000;0
"280001         ";"20121113";"20121113";"20121114";1000;0
"280001         ";"20121114";"20121114";"20121114";1000;0
"280001         ";"20121114";"20121114";"20121114";1000;65
"280001         ";"20121114";"20121114";"20121114";8000;0
"280001         ";"20121114";"20121114";"20121114";1000;0
"280001         ";"20121114";"20121114";"20121114";1000;0
"280001         ";"20121114";"20121114";"20121114";1000;0
"280001         ";"20121114";"20121114";"20121114";1000;0
"280001         ";"20121114";"20121114";"20121114";1000;0
"280001         ";"20121114";"20121114";"20121114";1000;63
"280004         ";"20121113";"20121113";"20121114";2565;0
"280004         ";"20121114";"20121114";"20121114";540;46
"280004         ";"20121114";"20121114";"20121114";224;0
"280004         ";"20121114";"20121114";"20121114";224;0
"280004         ";"20121114";"20121114";"20121114";224;0
"280004         ";"20121114";"20121114";"20121114";224;0
"280004         ";"20121114";"20121114";"20121114";224;0
"280004         ";"20121114";"20121114";"20121114";224;0
"280004         ";"20121114";"20121114";"20121114";3360;0
"280004         ";"20121114";"20121114";"20121114";224;0
"280004         ";"20121114";"20121114";"20121114";224;0
"280004         ";"20121114";"20121114";"20121114";224;0
"280004         ";"20121114";"20121114";"20121114";224;0
"280004         ";"20121114";"20121114";"20121114";224;0
"280004         ";"20121114";"20121114";"20121114";224;0
"F000CD1249     ";"20121112";"20121113";"20121114";120000;0
"F000DR1064     ";"20121114";"20121114";"20121114";23247;647
"F000DR1064     ";"20121114";"20121114";"20121114";12753;600
"F000DR1064     ";"20121114";"20121114";"20121114";0;600
"F000DR1064     ";"20121114";"20121114";"20121114";0;600
"F006N10039     ";"20121113";"20121114";"20121114";13500;0
"F006S20435     ";"20121114";"20121114";"20121114";4200;0
"1000290008-1A  ";"20121113";"20121114";"20121114";8430;0
"212674         ";"20121112";"20121113";"20121114";1800;6
"212676         ";"20121114";"20121114";"20121114";0;197
"212676         ";"20121114";"20121114";"20121114";1750;0
"215583         ";"20121113";"20121113";"20121114";1750;0
"215583         ";"20121113";"20121113";"20121114";1750;0
"215583         ";"20121113";"20121113";"20121114";1750;0
"215583         ";"20121113";"20121114";"20121114";1750;0
"215583         ";"20121113";"20121114";"20121114";234;0
"215597EXP-1    ";"20121114";"20121114";"20121114";216;0
"215597EXP-1    ";"20121114";"20121114";"20121114";127;3
"215608EXP-1    ";"20121105";"20121105";"20121114";0;4
"215608EXP-1    ";"20121105";"20121105";"20121114";0;3
"215613         ";"20121114";"20121114";"20121114";720;1
"215613         ";"20121114";"20121114";"20121114";720;0
"215696         ";"20121113";"20121114";"20121114";1620;1
"215696         ";"20121114";"20121114";"20121114";540;20
"215698-1       ";"20121113";"20121113";"20121114";220;0
"215698-1       ";"20121113";"20121113";"20121114";660;0
"215698-1       ";"20121113";"20121114";"20121114";220;6
"215698-1       ";"20121114";"20121114";"20121114";0;1
"215698-1       ";"20121114";"20121114";"20121114";220;7
"F000DR1069-1   ";"20121114";"20121114";"20121114";0;815
"F006S20435-1   ";"20121113";"20121114";"20121114";2400;0
