"1001290007     ";"20120823";"20120827";"20120828";82900;0
"2154961EXP     ";"20120828";"20120828";"20120828";3450;0
"215597         ";"20120828";"20120828";"20120828";448;0
"215608EXP      ";"20120827";"20120827";"20120828";784;0
"215698         ";"20120828";"20120828";"20120828";660;0
"215698         ";"20120828";"20120828";"20120828";220;0
"215699         ";"20120828";"20120828";"20120828";0;24
"215700         ";"20120828";"20120828";"20120828";1080;0
"215700         ";"20120828";"20120828";"20120828";1080;0
"215714         ";"20120827";"20120828";"20120828";3080;3
"215714         ";"20120828";"20120828";"20120828";1400;0
"215714         ";"20120828";"20120828";"20120828";1190;0
"215714         ";"20120828";"20120828";"20120828";490;0
"215714         ";"20120828";"20120828";"20120828";1120;0
"260007         ";"20120824";"20120824";"20120828";1900;73
"9232081491     ";"20120827";"20120827";"20120828";5213;0
"F000DR1064     ";"20120827";"20120828";"20120828";12000;99
"212670         ";"20120828";"20120828";"20120828";418;2
"212670         ";"20120828";"20120828";"20120828";1140;0
"212672         ";"20120827";"20120828";"20120828";3000;600
"212676         ";"20120827";"20120827";"20120828";1750;0
"212699         ";"20120828";"20120828";"20120828";2100;0
"215590         ";"20120828";"20120828";"20120828";190;0
"215590         ";"20120828";"20120828";"20120828";570;2
"215590         ";"20120828";"20120828";"20120828";570;0
"215590         ";"20120828";"20120828";"20120828";190;0
"215590         ";"20120828";"20120828";"20120828";380;0
"215590         ";"20120828";"20120828";"20120828";436;0
"215597-1       ";"20120828";"20120828";"20120828";448;12
"215608EXP-1    ";"20120822";"20120822";"20120828";319;0
"215608EXP-1    ";"20120826";"20120826";"20120828";75;0
"215696         ";"20120827";"20120828";"20120828";0;4
"215698-1       ";"20120827";"20120828";"20120828";548;0
"215698-1       ";"20120828";"20120828";"20120828";112;1
"215698-1       ";"20120828";"20120828";"20120828";220;2
"260008-1       ";"20120827";"20120827";"20120828";3000;0
"260008-1       ";"20120827";"20120827";"20120828";1837;0
"260008-1       ";"20120827";"20120827";"20120828";1163;0
"260008-1       ";"20120827";"20120827";"20120828";3000;0
"260008-1       ";"20120827";"20120827";"20120828";1540;0
"9232081491-1   ";"20120827";"20120827";"20120828";2813;0
"F000DR1064-2   ";"20120827";"20120828";"20120828";33600;0
"F000DR1064-2   ";"20120827";"20120828";"20120828";33600;0
"F000DR1064-3   ";"20120828";"20120828";"20120828";28800;0
"F000DR1064-3   ";"20120828";"20120828";"20120828";4800;0
"F000DR1069-1   ";"20120827";"20120827";"20120828";18000;0
"F000DR1069-1   ";"20120828";"20120828";"20120828";18000;0
"F000DR1069-1   ";"20120828";"20120828";"20120828";18000;0
