"1000290009     ";"20130405";"20130405";"20130405";600;0
"1126610095     ";"20130404";"20130404";"20130405";12000;0
"1126610095     ";"20130404";"20130404";"20130405";3000;0
"1126610125     ";"20130405";"20130405";"20130405";500;0
"215567         ";"20110404";"20130404";"20130405";0;10
"215567         ";"20130405";"20130405";"20130405";0;92
"215567         ";"20130405";"20130405";"20130405";102;0
"215567         ";"20130405";"20130405";"20130405";3298;0
"215597         ";"20130404";"20130405";"20130405";896;0
"215597EXP      ";"20130401";"20130404";"20130405";329;0
"215597EXP      ";"20130401";"20130404";"20130405";14;0
"215665EXP      ";"20130404";"20130404";"20130405";0;6
"215665EXP      ";"20130405";"20130405";"20130405";324;6
"215714         ";"20130404";"20130404";"20130405";3080;0
"215714         ";"20130404";"20130404";"20130405";1573;0
"260008         ";"20130404";"20130404";"20130405";1500;0
"3391095217     ";"20130403";"20130403";"20130405";658;0
"F000DR1064     ";"20130404";"20130704";"20130405";15000;142
"F000DR1069     ";"20130405";"20130405";"20130405";15840;970
"212691         ";"20130401";"20130401";"20130405";3618;0
"215580         ";"20130404";"20130405";"20130405";5000;0
"215580         ";"20130405";"20130405";"20130405";3000;0
"215580         ";"20130405";"20130405";"20130405";730;0
"215582         ";"20130404";"20130405";"20130405";4416;0
"215582         ";"20130405";"20300405";"20130405";697;0
"215590         ";"20130404";"20130405";"20130405";570;0
"215590         ";"20130405";"20130405";"20130405";570;0
"215590         ";"20130405";"20130405";"20130405";570;0
"215590         ";"20130405";"20130405";"20130405";570;0
"215597-1       ";"20130404";"20130405";"20130405";896;1
"215597EXP-1    ";"20130401";"20130404";"20130405";0;7
"215597EXP-1    ";"20130401";"20130404";"20130405";329;0
"215597EXP-1    ";"20130401";"20130404";"20130405";14;0
"215609         ";"20130404";"20130404";"20130405";2920;0
"215609         ";"20130404";"20130404";"20130405";2389;0
"215613         ";"20130404";"20130405";"20130405";720;0
"215613         ";"20130405";"20130405";"20130405";720;0
"240001-1       ";"20130404";"20130405";"20130405";18500;0
"F000DR1064-2   ";"20130401";"20130404";"20130405";35200;0
"F000DR1064-2   ";"20130401";"20130404";"20130405";35200;0
"F000DR1064-3   ";"20130404";"20130404";"20130405";35200;0
"F000DR1068-1   ";"20130403";"20130404";"20130405";12000;0
"F000DR1069-1   ";"20130404";"20130404";"20130405";29920;0
"F000DR1069-1   ";"20130405";"20130405";"20130405";13200;0
"F000DR1069-2   ";"20130405";"20130405";"20130405";14960;0
"F000DR1069-2   ";"20130405";"20130405";"20130405";14080;0
"F000DR1069-2   ";"20130405";"20130405";"20130405";14960;0
"F000DR1069-2   ";"20130405";"20130405";"20130405";14080;0
"F006K10007-2   ";"20130402";"20130404";"20130405";7200;0
"F006N10039-2   ";"20130405";"20130405";"20130405";42000;0
