"1000290008     ";"20120410";"20120410";"20120410";3750;0
"1461904391     ";"20120410";"20120410";"20120410";1200;0
"2154591EXP     ";"20120410";"20120410";"20120410";1500;112
"2154591EXP     ";"20120410";"20120410";"20120410";1200;0
"215587         ";"20120409";"20120409";"20120410";5250;0
"215587         ";"20120409";"20120409";"20120410";1900;0
"215588         ";"20120409";"20120409";"20120410";5250;0
"215588         ";"20120409";"20120409";"20120410";1900;9
"215602         ";"20120410";"20120410";"20120410";272;5
"215602         ";"20120410";"20120410";"20120410";680;4
"215602         ";"20120410";"20120410";"20120410";816;2
"215665EXP      ";"20120409";"20120410";"20120410";1188;5
"215698         ";"20120409";"20120409";"20120410";440;0
"260007         ";"20120409";"20120409";"20120410";1150;3
"270001         ";"20120409";"20120410";"20120410";1120;26
"270001         ";"20120410";"20120410";"20120410";175;0
"270001         ";"20120410";"20120410";"20120410";1271;8
"270005         ";"20120410";"20120410";"20120410";200;0
"270005         ";"20120410";"20120410";"20120410";1800;0
"280001         ";"20120409";"20120409";"20120410";1421;17
"280001         ";"20120409";"20120409";"20120410";929;0
"3130170016     ";"20120410";"20120410";"20120410";3330;0
"3130170016     ";"20120410";"20120410";"20120410";7170;450
"F000AL2129     ";"20120409";"20120410";"20120410";2500;0
"F000DR1068     ";"20120410";"20120410";"20120410";16800;19
"F000DR1068-2   ";"20120410";"20120410";"20120410";40;0
"F000DR1068-2   ";"20120410";"20120410";"20120410";40;0
"F000DR1068-2   ";"20120410";"20120410";"20120410";14360;0
"F000DR1068-2   ";"20120410";"20120410";"20120410";14360;0
"F000DR1068-2   ";"20120410";"20120410";"20120410";200;0
"F000DR1068-2   ";"20120410";"20120410";"20120410";200;0
"F000ZS1285     ";"20120409";"20120409";"20120410";15000;0
"F000ZS1285     ";"20120409";"20120409";"20120410";270;0
"1000290008-1A  ";"20120410";"20120410";"20120410";3750;0
"1461904391-2   ";"20120410";"20120410";"20120410";14919;0
"1461904391-3   ";"20120410";"20120410";"20120410";14919;0
"1461904391-4   ";"20120409";"20120410";"20120410";1800;0
"212670         ";"20120409";"20120409";"20120410";570;0
"212674         ";"20120410";"20120410";"20120410";300;0
"212675         ";"20120410";"20120410";"20120410";5600;0
"212698         ";"20120410";"20120410";"20120410";4800;0
"212699         ";"20120409";"20120409";"20120410";2450;0
"215582         ";"20120410";"20120410";"20120410";731;0
"215582         ";"20120110";"20120410";"20120410";1472;0
"215582         ";"20120410";"20120410";"20120410";1472;0
"215590         ";"20120409";"20120409";"20120410";798;2
"215616         ";"20120409";"20120410";"20120410";1038;51
"215616         ";"20120410";"20120410";"20120410";494;2
"215698-1       ";"20120409";"20120409";"20120410";440;0
"215698-1       ";"20120409";"20120410";"20120410";220;4
"F000AL2129-2   ";"20120330";"20120404";"20120410";4588;0
"F000DR1068-1   ";"20120410";"20120410";"20120410";14400;0
"F000DR1068-1   ";"20120410";"20120410";"20120410";200;0
"F000DR1068-1   ";"20120410";"20120410";"20120410";2800;0
"F000DR1068-1   ";"20120410";"20120410";"20120410";4800;0
