"1000290009     ";"20130107";"20130108";"20130108";6931;0
"215602         ";"20130108";"20130108";"20130108";408;0
"215608EXP      ";"20130108";"20130108";"20130108";392;0
"260007         ";"20130107";"20130107";"20130108";1750;11
"270001         ";"20130107";"20130107";"20130108";912;42
"280004         ";"20120108";"20120108";"20130108";4050;0
"280004         ";"20130108";"20130108";"20130108";1350;0
"280004         ";"20130107";"20130107";"20130108";405;25
"280004         ";"20130108";"20130108";"20130108";3105;0
"280006         ";"20121221";"20130108";"20130108";41400;0
"3131323031     ";"20130108";"20130108";"20130108";2000;0
"3131323034     ";"20130108";"20130108";"20130108";3907;93
"6992500380     ";"20130108";"20130108";"20130108";4800;0
"F000AL2129     ";"20130108";"20130108";"20130108";0;7
"F000LD1565     ";"20130107";"20130107";"20130108";13500;0
"F000LD1565     ";"20130107";"20130108";"20130108";6750;0
"215581         ";"20121227";"20121227";"20130108";7650;0
"215590         ";"20130107";"20130107";"20130108";570;0
"215590         ";"20130108";"20130108";"20130108";570;0
"215590         ";"20130108";"20130108";"20130108";570;0
"215590         ";"20130108";"20130108";"20130108";570;0
"215602-1       ";"20130107";"20130108";"20130108";544;12
"215608EXP-1    ";"20130108";"20130108";"20130108";392;5
"215616         ";"20130108";"20130108";"20130108";722;2
"215616         ";"20130107";"20130107";"20130108";190;1
"F006K20168-2   ";"20120108";"20130108";"20130108";6509;0
