"F006N10039     ";"20130701";"20130701";"20130701";21497;0
"F006N10039     ";"20130701";"20130701";"20130701";2961;0
"215590         ";"20130628";"20130701";"20130701";570;0
"215608EXP-1    ";"20130627";"20130701";"20130701";18;12
"215608EXP-1    ";"20130627";"20130701";"20130701";374;0
"215613         ";"20130701";"20130701";"20130701";720;0
"215613         ";"20130701";"20130701";"20130701";725;0
"240001-2       ";"20130628";"20130628";"20130701";20500;0
"F000AL2128-2   ";"20130701";"20130701";"20130701";4191;0
0701";1760;166
