"215618         ";"ABRACADEIRA VW249             ";"PI"
"1461902139-6   ";"ALAV. CORRECAO DOBRAR ABA     ";"PI"
"1461902139-5   ";"ALAV. CORRECAO ESTAMPAR FURO  ";"PI"
"1461902139     ";"ALAV. DE CORRECAO             ";"PA"
"1461902623     ";"ALAV. DE CORRECAO             ";"PA"
"1461902623-N   ";"ALAV. DE CORRECAO             ";"PI"
"1461902655     ";"ALAV. DE CORRECAO             ";"PA"
"1461902665     ";"ALAV. DE CORRECAO             ";"PA"
"1461902665-N   ";"ALAV. DE CORRECAO             ";"PI"
"1461902139-4   ";"ALAV. DE CORRECAO CALIBRAR    ";"PI"
"1461902623-4   ";"ALAV. DE CORRECAO CALIBRAR    ";"PI"
"1461902655-4   ";"ALAV. DE CORRECAO CALIBRAR    ";"PI"
"1461902655-N   ";"ALAV. DE CORRECAO CALIBRAR    ";"PI"
"1461902665-4   ";"ALAV. DE CORRECAO CALIBRAR    ";"PI"
"1461904391-4   ";"ALAV. DE CORRECAO CALIBRAR    ";"PI"
"1461902139-1   ";"ALAV. DE CORRECAO ESTAMPADO   ";"PI"
"1461902623-1   ";"ALAV. DE CORRECAO ESTAMPADO   ";"PI"
"1461902655-1   ";"ALAV. DE CORRECAO ESTAMPADO   ";"PI"
"1461902665-1   ";"ALAV. DE CORRECAO ESTAMPADO   ";"PI"
"1461904391-1   ";"ALAV. DE CORRECAO ESTAMPADO   ";"PI"
"1461902139-3   ";"ALAV. DE CORRECAO REBARBAR    ";"PI"
"1461902623-3   ";"ALAV. DE CORRECAO REBARBAR    ";"PI"
"1461902655-3   ";"ALAV. DE CORRECAO REBARBAR    ";"PI"
"1461902665-3   ";"ALAV. DE CORRECAO REBARBAR    ";"PI"
"1461904391-3   ";"ALAV. DE CORRECAO REBARBAR    ";"PI"
"1461902655-2   ";"ALAV. DE CORRECAO TRAT TERMICO";"PI"
"1461904391-2   ";"ALAV. DE CORRECAO TRAT TERMICO";"PI"
"1461902139-2   ";"ALAV. DE CORRECAO TRAT.TERMICO";"PI"
"1461902623-2   ";"ALAV. DE CORRECAO TRAT.TERMICO";"PI"
"1461902665-2   ";"ALAV. DE CORRECAO TRAT.TERMICO";"PI"
"1461902087     ";"ALAV. DE TENSAO               ";"PA"
"1461902088     ";"ALAV. DE TENSAO               ";"PA"
"1461902087-1   ";"ALAV. DE TENSAO ESTAMPADA     ";"PI"
"1461902088-1   ";"ALAV. DE TENSAO ESTAMPADO     ";"PI"
"1461902087-3   ";"ALAV. TENSAO DOBRAR ABA       ";"PI"
"1461902088-3   ";"ALAV. TENSAO DOBRAR ABA MENOR ";"PI"
"1461902087-2   ";"ALAV. TENSAO ESTAMPAR 02 FUROS";"PI"
"1461902088-2   ";"ALAV. TENSAO ESTAMPAR 02 FUROS";"PI"
"1461902087-4   ";"ALAV. TENSAO FAZER REBAIXO    ";"PI"
"1461902088-4   ";"ALAV. TENSAO FAZER REBAIXO    ";"PI"
"1461902087-N   ";"ALAV.TENSAO                   ";"PI"
"1461902087-5   ";"ALAV.TENSAO RECORTAR ABA MENOR";"PI"
"1461902088-5   ";"ALAV.TENSAO RECORTAR ABA MENOR";"PI"
"1461904391     ";"ALAVANCA DE CORRECAO          ";"PA"
"270023         ";"ALAVANCA DE DESTRAVE LD - 7200";"PA"
"270022         ";"ALAVANCA DE DESTRAVE LE - 7100";"PA"
"212694AMOSTRA  ";"AMOSTRA BUCHA DA TRAVA VW230GP";"PA"
"2000120002     ";"ANEL DE FIXACAO               ";"PA"
"F006N10048     ";"ANEL DE RETENCAO 048          ";"PA"
"F006N10120     ";"ANEL DE RETENCAO 048          ";"PA"
"F006N10048-2   ";"ANEL DE RETENCAO-AUSTEMPERA   ";"PI"
"F006N10048-1   ";"ANEL DE RETENCAO-ESTAMPAR     ";"PI"
"1390000008     ";"ARRUELA DE ENCOSTO            ";"PI"
"F000AL1118-1   ";"ARRUELA INTERM SCHULER CNC    ";"PI"
"F000AL1118     ";"ARRUELA INTERMEDIARIA         ";"PA"
"F000DR1068     ";"ARRUELA PRATO 068             ";"PA"
"F000DR1068-1   ";"ARRUELA PRATO 068             ";"PI"
"F000DR1068-2   ";"ARRUELA PRATO 068  TAMBO/LAVAR";"PA"
"F006N10039     ";"ARRUELA TRAVA 039             ";"PA"
"F006N10119     ";"ARRUELA TRAVA 039             ";"PA"
"F006N10039-3   ";"ARRUELA TRAVA 039 CIANETAR    ";"PI"
"F006N10039-1   ";"ARRUELA TRAVA 039 ESTAMPAR    ";"PI"
"F006N10039-5   ";"ARRUELA TRAVA 039 INSPECAO    ";"PI"
"F006N10039-2   ";"ARRUELA TRAVA 039 TAMBOREAR   ";"PI"
"F006N10039-4   ";"ARRUELA TRAVA 039 ZINCAR      ";"PI"
"3130170068     ";"ARRUELA TRAVA 068             ";"PA"
"3130170068-2   ";"ARRUELA TRAVA 068  AUSTEMPERA ";"PI"
"3130170068-1   ";"ARRUELA TRAVA 068  ESTAMPAR   ";"PI"
"2000500101     ";"Anel                          ";"PA"
"F000LD1513     ";"BARRA DE LIGA.  1121329000    ";"PA"
"F000AL2069     ";"BARRA DE LIGA. 1.001.090.02   ";"PA"
"F000AL2068     ";"BARRA DE LIGA. 1001090027     ";"PA"
"F000AL2070     ";"BARRA DE LIGA. 1001090028     ";"PA"
"F000AL2071     ";"BARRA DE LIGA. 1001090029     ";"PA"
"F000LD1511     ";"BARRA DE LIGA. 1121090046     ";"PA"
"F000LD1512     ";"BARRA DE LIGA. 1121090158     ";"PA"
"1001090025     ";"BARRA DE LIGACAO 1.001.090.025";"PA"
"1001090027     ";"BARRA DE LIGACAO 1.001.090.027";"PA"
"1001090028     ";"BARRA DE LIGACAO 1001090028   ";"PA"
"1001090029     ";"BARRA DE LIGACAO 1001090029   ";"PA"
"F000RS1059     ";"BARRA LIGACAO 1191335009      ";"PA"
"F000RS1059-REFO";"BARRA LIGACAO 1191335009      ";"PA"
"F000RS1059-1   ";"BARRA LIGACAO SCHULER CNC     ";"PI"
"F000ZS1285     ";"BASE   9.221.081.322          ";"PA"
"F000ZS1284     ";"BASE   9.221.087.173          ";"PA"
"215490         ";"BICO DE PATO PQ 24 506173     ";"PA"
"215496         ";"BICO DE PATO PQ 34            ";"PA"
"215615         ";"BICO DE PATO VW249            ";"PI"
"212677         ";"BIEGELASCHE                   ";"PI"
"230001         ";"BLANQUE DA TAMPA              ";"PA"
"230001-1       ";"BLANQUE DA TAMPA ESTAMPADO    ";"PI"
"270026         ";"BRACO ARTICULADO LD- 827333200";"PA"
"270027         ";"BRACO ARTICULADO LE- 827334300";"PA"
"250002         ";"BRIDE INFERIOR X90            ";"PI"
"250006         ";"BRIDE INFERIOR X90            ";"PA"
"250001         ";"BRIDE SUPERIOR X90            ";"PI"
"250001A        ";"BRIDE SUPERIOR X90            ";"PI"
"250005         ";"BRIDE SUPERIOR X90            ";"PA"
"212695         ";"BUCHA DA TRAVA                ";"PA"
"215695DBC      ";"BUCHA DA TRAVA                ";"PA"
"2126951EXP     ";"BUCHA DA TRAVA  EXP VA 315233 ";"PA"
"212695EXP      ";"BUCHA DA TRAVA  EXPORTACAO    ";"PA"
"212694         ";"BUCHA DA TRAVA VW230GP 729368C";"PA"
"2410422012-1   ";"BUCHA DE REGULAGEM RECORTAR   ";"PI"
"240001-1       ";"BUCHA REG. 410 / 012 ESTAMPADA";"PI"
"240001-2       ";"BUCHA REG. 410 / 012 TRAT.TERM";"PI"
"240001-7       ";"BUCHA REG. 410/012 CALIB+CHANF";"PI"
"9401087410-7   ";"BUCHA REG. 410/012 CALIB+CHANF";"PI"
"9401087410-N   ";"BUCHA REG. 410/012 DECAPAR    ";"PI"
"240001-8       ";"BUCHA REG. 410/012 ENCALC FORM";"PI"
"9401087410-8   ";"BUCHA REG. 410/012 ENCALC FORM";"PI"
"240001-5       ";"BUCHA REG. 410/012 RECORTE ABA";"PI"
"9401087410-5   ";"BUCHA REG. 410/012 RECORTE ABA";"PI"
"240001-6       ";"BUCHA REG. 410/012 T.T RECOZIM";"PI"
"9401087410-6   ";"BUCHA REG. 410/012 T.T RECOZIM";"PI"
"240001-4       ";"BUCHA REG. 410/012CORTAR COMPR";"PI"
"9401087410-4   ";"BUCHA REG. 410/012CORTAR COMPR";"PI"
"240001         ";"BUCHA REGULAGEM 410 / 012     ";"PI"
"240001-N       ";"BUCHA REGULAGEM 410 / 012     ";"PI"
"2410422012-7   ";"BUCHA REGULAGEM CALIBRAR      ";"PI"
"2410422012-4   ";"BUCHA REGULAGEM CORTAR COMPR  ";"PI"
"2410422012-8   ";"BUCHA REGULAGEM ENCALCAR      ";"PI"
"2410422012-2   ";"BUCHA REGULAGEM RECORTAR ABA  ";"PI"
"2410422012-5   ";"BUCHA REGULAGEM RECORTAR ABA  ";"PI"
"2410422012-3   ";"BUCHA REGULAGEM TRAT TERMICO  ";"PI"
"2410422012-6   ";"BUCHA REGULAGEM TRAT TERMICO  ";"PI"
"2225777C       ";"Bucha                         ";"PA"
"2410422012     ";"Bucha de Regulagem            ";"PA"
"2410422012-REFO";"Bucha de Regulagem            ";"PA"
"9401087410     ";"Bucha de regulagem            ";"PA"
"9401087410-REFO";"Bucha de regulagem            ";"PA"
"215665EXP      ";"C COMP FIAT 225MVLS EXP 604454";"PA"
"2155791EXP     ";"C COMP FIAT 310MVLS EXP 610648";"PA"
"215608EXP      ";"C GUIA FIAT 225MVLS EXP 604531";"PA"
"215597EXP      ";"C GUIA FIAT 310MVLS EXP 610639";"PA"
"215597-1EXP    ";"CAIXA GUIA FIAT 310 MVLS EXP  ";"PI"
"215597         ";"CAIXA GUIA FIAT 310MVLS 552751";"PA"
"215608EXP-1    ";"CAIXA GUIA SOLDA 225 MVLS EXP ";"PI"
"215597EXP-1    ";"CAIXA GUIA SOLDA 310 MVLS EXP ";"PI"
"215597-1       ";"CAIXA GUIA SOLDA FIAT 310 MVLS";"PI"
"F000RS1058     ";"CANT DE FIXACAO 1191334003    ";"PA"
"1231332006-1   ";"CANT. DE FIXACAO ESTAMPADO    ";"PI"
"1231332005-1A  ";"CANT.DE FIX SCHULER CNC       ";"PI"
"1231332005-1   ";"CANT.DE FIXACAO ESTAMPADA     ";"PI"
"F000461464-1   ";"CANTONEIRA  SCHULER CNC       ";"PI"
"F000461464-2   ";"CANTONEIRA  TAMBOREADOR       ";"PI"
"215584         ";"CANTONEIRA / BUGEL            ";"PI"
"1231332004     ";"CANTONEIRA DE FIXACAO         ";"PA"
"1231332005     ";"CANTONEIRA DE FIXACAO         ";"PA"
"1231332006     ";"CANTONEIRA DE FIXACAO         ";"PA"
"1231332004-1   ";"CANTONEIRA DE FIXACAO ESTAMPAD";"PI"
"1231332004-1A  ";"CANTONEIRA FIX SCHULER CNC    ";"PI"
"1231332006-1A  ";"CANTONEIRA FIX SCHULER CNC    ";"PI"
"215588         ";"CANTONEIRA PKO LD 523140      ";"PA"
"215587         ";"CANTONEIRA PKO LE 523139      ";"PA"
"215571         ";"CANTONEIRA PQ24 STLS LD 510767";"PA"
"215570         ";"CANTONEIRA PQ24 STLS LE 510766";"PA"
"215603         ";"CANTONEIRA VW230              ";"PI"
"215619         ";"CANTONEIRA VW249              ";"PI"
"1410500015-5   ";"CAPA AMORTEC CALIBRAR FURO    ";"PI"
"1410500015-3   ";"CAPA AMORTEC ESTAMPAR FURO    ";"PI"
"1410500015-4   ";"CAPA AMORTEC REBORDEAR        ";"PI"
"1410500015-6   ";"CAPA AMORTEC TAMBOREAR        ";"PI"
"1410500015-1   ";"CAPA AMORTECEDORA ESTAMPADO   ";"PI"
"1410500015-2   ";"CAPA AMORTECEDORA LAVADA      ";"PI"
"F000AL2235     ";"CAPSULA                       ";"PA"
"2410500009-5   ";"CAPSULA AMORT. CALIBRAR       ";"PI"
"2410500009-1   ";"CAPSULA AMORT. ESTAMPADO      ";"PI"
"2410500009-3   ";"CAPSULA AMORT. ESTAMPAR 8 FURO";"PI"
"2410500009-2   ";"CAPSULA AMORT. LAVAR          ";"PI"
"2410500009-6   ";"CAPSULA AMORT. REBARBAR       ";"PI"
"2410500009-4   ";"CAPSULA AMORT. REBORDEAR ABA  ";"PI"
"1280520377     ";"CARCACA                       ";"PA"
"F000DR1069     ";"CARCACA 069                   ";"PA"
"F000DR1069-1   ";"CARCACA 069                   ";"PI"
"F000DR1069-2   ";"CARCACA 069 TAMB/LAVAR        ";"PI"
"F000DR1050     ";"CARCACA 1280520377            ";"PA"
"280005         ";"CHAPA APOIO FIAT 326-40710363 ";"PA"
"270005         ";"CHAPA COBERTURA LOCK          ";"PA"
"215663         ";"CJTO FIAT 226 STLS            ";"PA"
"215698         ";"CJTO FUKA VW210 612581        ";"PA"
"215698-1       ";"CJTO FUKA VW210 SOLDADO       ";"PI"
"215700         ";"CJTO KONSOLE VW210 715937     ";"PA"
"215696         ";"CJTO KONSOLE VW210 SEM KTL    ";"PI"
"215699         ";"CJTO KRAGARM VW 210 685599    ";"PA"
"330011         ";"CONJ EMBALAGEM PQ24 STLS      ";"PI"
"215480         ";"CONJ GUIA SUP PQ24 MVLS 501294";"PA"
"215568         ";"CONJ GUIA SUP PQ24 STLS 510773";"PA"
"2154591EXP     ";"CONJ GUIA SUP PQ34 V.A. 504140";"PA"
"212697         ";"CONJ GUIA SUPERIOR B5 315232  ";"PA"
"2154801        ";"CONJ GUIA SUPERIOR PQ24 MVLS  ";"PA"
"215459         ";"CONJ GUIA SUPERIOR PQ34       ";"PA"
"2154591        ";"CONJ GUIA SUPERIOR PQ34       ";"PA"
"215662D        ";"CONJ MONTADO VW249 DEVOLVIDO  ";"PA"
"2155791        ";"CONS COMP FIAT 310MVLS 579489 ";"PA"
"215582         ";"CONSOLE / KONSOLE             ";"PI"
"215605EXP      ";"CONSOLE COMP FIAT 225 MVLS EXP";"PA"
"215666EXP      ";"CONSOLE COMP FIAT 225 MVLS EXP";"PA"
"2155792EXP     ";"CONSOLE COMP FIAT 310 MVLS EXP";"PA"
"215579EXP      ";"CONSOLE COMP FIAT 310 MVLS EXP";"PA"
"215710EXP      ";"CONSOLE COMP FIAT 323 MVLS EXP";"PA"
"215579         ";"CONSOLE COMPLETO FIAT 310 MVLS";"PA"
"2155792        ";"CONSOLE COMPLETO FIAT 310 MVLS";"PA"
"212699         ";"CONSOLE INFERIOR VW210        ";"PI"
"215600         ";"CONSOLE MAIOR FIAT 225 STLS   ";"PI"
"215578         ";"CONSOLE MAIOR FIAT 310 STLS   ";"PI"
"215599         ";"CONSOLE MENOR FIAT 225 STLS   ";"PI"
"215577         ";"CONSOLE MENOR FIAT 310 STLS   ";"PI"
"212698         ";"CONSOLE SUPERIOR VW210        ";"PI"
"215617         ";"CONSOLE VW249                 ";"PI"
"F000LD1557     ";"CORPO  REFRIGER. 9121080598   ";"PA"
"F000LD1556     ";"CORPO REFRIGER. 1125715347    ";"PA"
"F000LD1558     ";"CORPO REFRIGER. 9121080601    ";"PA"
"F000LD1560     ";"CORPO REFRIGER. 9122080001    ";"PA"
"F000LD1561     ";"CORPO REFRIGER. 9122080709    ";"PA"
"F000LD1562     ";"CORPO REFRIGER. 9122080951    ";"PA"
"F000LD1563     ";"CORPO REFRIGER. 9122080953    ";"PA"
"F000LD1564     ";"CORPO REFRIGER. 9123080132    ";"PA"
"F000LD1565     ";"CORPO REFRIGER. F00M144001    ";"PA"
"F000LD1565-REFO";"CORPO REFRIGER. F00M144001    ";"PA"
"F000LD1566     ";"CORPO REFRIGER. F00M144005    ";"PA"
"F000LD1594     ";"CORPO REGRIGER. F00M144010    ";"PA"
"F000LD1594EXP  ";"CORPO REGRIGER. F00M144010    ";"PA"
"F000461464     ";"Cantoneira                    ";"PA"
"1410500015     ";"Capa Amortecedora             ";"PA"
"2410500009     ";"Capsula Amortecedora          ";"PA"
"270033         ";"DESTRAVADOR REC - 8303342000  ";"PA"
"0378           ";"DISP CONTR 212672 VW 210      ";"PI"
"QUAL215698     ";"DISP CONTR CJ FUKA VW210 SOLDA";"PI"
"212672         ";"FIXADOR DE CABO VW210         ";"PI"
"2435703014     ";"FLANGE DE FIXACAO             ";"PA"
"2435703017     ";"FLANGE DE FIXACAO             ";"PA"
"9431081176     ";"FLANGE DE FIXACAO             ";"PA"
"9431081220     ";"FLANGE DE FIXACAO             ";"PA"
"9431081220-1   ";"FLANGE DE FIXACAO             ";"PI"
"2435703014-1   ";"FLANGE DE FIXACAO ESTAMPADO   ";"PI"
"2435703017-1   ";"FLANGE DE FIXACAO ESTAMPADO   ";"PI"
"2435703014-2   ";"FLANGE DE FIXACAO TAMBOREADO  ";"PI"
"2435703017-2   ";"FLANGE DE FIXACAO TAMBOREADO  ";"PI"
"9431081176-1   ";"FLANGE FIXACAO ESTAMPAGEM     ";"PI"
"9431081176-2   ";"FLANGE FIXACAO VIBRADOR       ";"PI"
"215608-1       ";"FUKA FIAT 225 MVLS SOLDADO    ";"PI"
"1261032203     ";"Fixador de SG                 ";"PA"
"001001         ";"GENERICO                      ";"PA"
"3131323034-00  ";"GUIA DA ESCOVA - TRY OUT      ";"PA"
"F000AL2073     ";"GUIA DE ESCOVA F000AL1049     ";"PA"
"F000AL2073-1   ";"GUIA DE ESCOVA F000AL1049     ";"PI"
"F000MM1463     ";"GUIA DE ESCOVA F006MM151R     ";"PA"
"3131323029     ";"Guia da Escova                ";"PA"
"3131323031     ";"Guia da Escova                ";"PA"
"3131323031-1   ";"Guia da Escova                ";"PI"
"3131323034     ";"Guia da Escova                ";"PA"
"3131323034-1   ";"Guia da Escova                ";"PI"
"3131323034-REFO";"Guia da Escova                ";"PA"
"212673         ";"KLEMMBLECH/PRENDEDOR VW210    ";"PI"
"215714         ";"KONSOLE VW230GP 703997D       ";"PA"
"215604-1       ";"KRAGARM - SEM PORCA           ";"PI"
"215604         ";"KRAGARM 579938                ";"PA"
"212676         ";"KRAGARM ESTAMPADO VW210       ";"PI"
"215697         ";"KRAGARM VW210                 ";"PI"
"212675         ";"KRAGARMFUHRUNG                ";"PI"
"212671         ";"LASCHE VW210                  ";"PI"
"212674         ";"LASCHE+PINO VW210             ";"PI"
"270029         ";"LATERAL INTERNA LD- 82733512  ";"PA"
"270028         ";"LATERAL INTERNA LE- 82733511  ";"PA"
"3131322097     ";"MANCAL                        ";"PA"
"3131322097-1   ";"MANCAL                        ";"PI"
"270034         ";"MANCAL - 822237883            ";"PA"
"215591         ";"MANCAL / ABSTUTZUNG           ";"PI"
"215591TRAVA    ";"MANCAL / ABSTUTZUNG           ";"PI"
"215591TRV      ";"MANCAL / ABSTUTZUNG           ";"PI"
"104109_MOD     ";"MODIFICAR FERRAMENTAS SUPORTE ";"PA"
"1191251001-3   ";"MOLA CONTATO F000RS1057 PRATA ";"PI"
"1191251001-1   ";"MOLA CONTATO F000RS1057SCHULER";"PI"
"1191251001-2   ";"MOLA CONTATO F000RS1057TAMBOR ";"PI"
"F000RS1057     ";"MOLA DE CONTATO 1191251001    ";"PA"
"1191251001     ";"MOLA DE CONTATO F000RS1057    ";"PA"
"F000RS1057-1   ";"MOLA DE CONTATO SCHULER CNC   ";"PI"
"9131081143     ";"Mancal                        ";"PA"
"F006MG1338     ";"Mancal                        ";"PA"
"F006MG1338-1   ";"Mancal                        ";"PI"
"F006MG1300     ";"Mancal (Item novo)            ";"PA"
"F006MG1300-1   ";"Mancal (Item novo)            ";"PI"
"9131451998     ";"Mancal Dianteiro              ";"PA"
"168002         ";"PARAFUSO CRAVAGEM M6X12       ";"PA"
"215609         ";"PERFIL U / OBERT FIAT 225 MVLS";"PI"
"215583         ";"PERFIL U / OBERT FIAT 310 MVLS";"PI"
"260005         ";"PLACA BASE 914318-103         ";"PA"
"260007         ";"PLACA BASE 934075-100         ";"PA"
"260007-1       ";"PLACA BASE ESTAMPADA          ";"PI"
"215610         ";"PLACA BASE/HUTPROFIL MVLS 225 ";"PI"
"215580         ";"PLACA BASE/HUTPROFIL MVLS 310 ";"PI"
"215713         ";"PLACA BASE/HUTPROFIL MVLS 323 ";"PI"
"F000LD1515-1   ";"PLACA DE COBERT SCHULLER CNC  ";"PI"
"F000LD1515     ";"PLACA DE COBERT. 9122080647   ";"PA"
"F000LD1516     ";"PLACA DE COBERT. 9122080650   ";"PA"
"F000LD1517     ";"PLACA DE COBERT. 9122080914   ";"PA"
"F000LD1516-1   ";"PLACA DE COBERT. SCHULER CNC  ";"PI"
"F000LD1517-1   ";"PLACA DE COBERT. SCHULER CNC  ";"PI"
"212691         ";"PLACA DE INTERLIGACAO         ";"PI"
"212691EXP      ";"PLACA DE INTERLIGACAO         ";"PI"
"F000AL1462     ";"PLACA ESCOVAS                 ";"PA"
"F000AL1625     ";"PLACA ESCOVAS                 ";"PA"
"F000AL2128-1   ";"PLACA ESCOVAS ESTAMPAGEM      ";"PI"
"F000AL2129-1   ";"PLACA ESCOVAS ESTAMPAGEM      ";"PI"
"F000AL2128     ";"PLACA ESCOVAS F000AL1462      ";"PA"
"F000AL2128-2   ";"PLACA ESCOVAS F000AL1462      ";"PI"
"F000AL2129     ";"PLACA ESCOVAS F000AL1625      ";"PA"
"F000AL2129-2   ";"PLACA ESCOVAS F000AL1625      ";"PI"
"290001         ";"PLACA FIXACAO JTEKT 6800003482";"PA"
"290001-1       ";"PLACA FIXACAO JTEKT ESTAMPADA ";"PI"
"215607         ";"PLACA INTERME DIR / ZWISCHENPL";"PI"
"215607TRAVA    ";"PLACA INTERME DIR / ZWISCHENPL";"PI"
"251607_FATURAR ";"PLACA INTERME DIR / ZWISCHENPL";"PA"
"215581         ";"PLACA INTERME ESQUERDA / ZWISC";"PI"
"215581TRAVA    ";"PLACA INTERME ESQUERDA / ZWISC";"PI"
"215581_FATURAR ";"PLACA INTERME ESQUERDA / ZWISC";"PA"
"F000RS1067     ";"PLACA REFRIGER. 9191087031    ";"PA"
"F000RS1067-REFO";"PLACA REFRIGER. 9191087031    ";"PA"
"F000AL2072     ";"PORTA ESCOVA 9.001.082.519    ";"PA"
"F000612029     ";"PORTA ESCOVA F000635163       ";"PA"
"1000290008     ";"PORTA IMA                     ";"PA"
"1000290008A    ";"PORTA IMA                     ";"PA"
"1000290009     ";"PORTA IMA                     ";"PA"
"1000290009A    ";"PORTA IMA                     ";"PA"
"1000290008-1A  ";"PORTA IMA ESTAMP WEINGARTEN   ";"PI"
"1000290009-1A  ";"PORTA IMA ESTAMP WEINGARTEN   ";"PI"
"1000290008-1   ";"PORTA IMA ESTAMPADO           ";"PI"
"1000290009-1   ";"PORTA IMA ESTAMPADO           ";"PI"
"F000CD1249     ";"PRESILHA                      ";"PA"
"F000CD1249-REFO";"PRESILHA                      ";"PA"
"215567         ";"PRESILHA ROMP PQ24 506670     ";"PA"
"2155861EXP     ";"PRESILHA ROMP PQ34 V.A. 521058";"PA"
"215589EXP      ";"PRESILHA ROMPIMENTO 1KN EXP   ";"PA"
"215567EXP      ";"PRESILHA ROMPIMENTO PQ24 EXP  ";"PA"
"215586         ";"PRESILHA ROMPIMENTO PQ34      ";"PA"
"12.11.1133     ";"PUNCAO DE CALIBRAR            ";"PI"
"104109-96      ";"PUNCAO DE CHANFRAR            ";"PA"
"1001290007     ";"Presilha                      ";"PA"
"1001290008     ";"Presilha                      ";"PA"
"2253448C       ";"RETENTOR                      ";"PA"
"3130170016     ";"RETENTOR  DA BUCHA 3130170016 ";"PA"
"3130170016-2   ";"RETENTOR BUCHA -  AUSTEMPERA  ";"PI"
"3130170016-1   ";"RETENTOR BUCHA -  ESTAMPAR    ";"PI"
"215612         ";"SCJ PLACA BASE+PLACAS INTER MV";"PI"
"215612TRAVA    ";"SCJ PLACA BASE+PLACAS INTER MV";"PI"
"215612TRV      ";"SCJ PLACA BASE+PLACAS INTER MV";"PI"
"215606         ";"SCJ PLACA INTER DIR FIAT MVLS ";"PI"
"215606TRAVA    ";"SCJ PLACA INTER DIR FIAT MVLS ";"PI"
"215606TRV      ";"SCJ PLACA INTER DIR FIAT MVLS ";"PI"
"215611         ";"SCJ PLACA INTER ESQ+BUGEL MVLS";"PI"
"215611TRAVA    ";"SCJ PLACA INTER ESQ+BUGEL MVLS";"PI"
"215611TRV      ";"SCJ PLACA INTER ESQ+BUGEL MVLS";"PI"
"260011-1       ";"SPTE INFERIOR DIANT LD ESTAMP ";"PI"
"260012-1       ";"SPTE INFERIOR DIANT LE ESTAMP ";"PI"
"260013-1       ";"SPTE INFERIOR TRAS LD ESTAMP  ";"PI"
"260014-1       ";"SPTE INFERIOR TRAS LE ESTAMP  ";"PI"
"215619-1       ";"SUB CJTO CANTONEIRA+PINO VW249";"PI"
"215594         ";"SUBCON PRATO DENTADO FIAT MVLS";"PI"
"212593TRAVA    ";"SUBCONJ  MANCAL ESQ FIAT MVLS ";"PA"
"215593         ";"SUBCONJ  MANCAL ESQ FIAT MVLS ";"PI"
"215593TRAVA    ";"SUBCONJ  MANCAL ESQ FIAT MVLS ";"PI"
"215593TRV      ";"SUBCONJ  MANCAL ESQ FIAT MVLS ";"PI"
"215592         ";"SUBCONJ. PLACA BASE MVLS 310  ";"PI"
"215712         ";"SUBCONJ. PLACA BASE MVLS 323  ";"PI"
"215595         ";"SUBCONJUNTO REBITADO MVLS 310 ";"PI"
"215711         ";"SUBCONJUNTO REBITADO MVLS 323 ";"PI"
"215569         ";"SUP CHAPEU PQ24 STLS 510765   ";"PA"
"215598         ";"SUP COLUNA FIAT 225STLS 580434";"PA"
"215575         ";"SUP COLUNA FIAT 310STLS 555076";"PA"
"2154971EXP     ";"SUP GUIA SUP PQ 34 VA 504147  ";"PA"
"2154961EXP     ";"SUP ROL BC PQ34 EX VA 501301  ";"PA"
"280001         ";"SUP. INT. FIAT 326-7-40710359 ";"PA"
"280002         ";"SUP.PIVOT LD FIAT 326-40710360";"PA"
"280003         ";"SUP.PIVOT LE FIAT 326-40710361";"PA"
"280004         ";"SUPORT REG.FIAT 326-7-40710362";"PA"
"F000ZS1265     ";"SUPORTE   9221081314          ";"PA"
"280006         ";"SUPORTE CAPA - 40710358A      ";"PA"
"215598EXP      ";"SUPORTE COLUNA FIAT 225 STLS  ";"PA"
"923081491-1    ";"SUPORTE DE CONTATO ESTAMPAGEM ";"PI"
"270024         ";"SUPORTE DO TRILHO             ";"PA"
"212690B5       ";"SUPORTE EXTERNO B5            ";"PI"
"212690B5 EXP   ";"SUPORTE EXTERNO B5 EXPORTACAO ";"PI"
"215504C5       ";"SUPORTE EXTERNO C5            ";"PI"
"215504         ";"SUPORTE EXTERNO PQ24 MVLS     ";"PI"
"215504EXP      ";"SUPORTE EXTERNO PQ24 MVLS  EXP";"PI"
"215574         ";"SUPORTE EXTERNO PQ24 STLS     ";"PI"
"212690         ";"SUPORTE EXTERNO PQ34 MVLS     ";"PI"
"212690EXP      ";"SUPORTE EXTERNO PQ34 MVLS     ";"PI"
"270004         ";"SUPORTE EXTINTOR RPU          ";"PA"
"260006         ";"SUPORTE FH 915615-100         ";"PA"
"260006-1       ";"SUPORTE FH 915615-100 ESTAMP. ";"PI"
"F000MT1205     ";"SUPORTE FIXACAO 1261332302    ";"PA"
"F000ZS1268     ";"SUPORTE FIXACAO 9221081301    ";"PA"
"F000ZS1267     ";"SUPORTE FIXACAO 9221081302    ";"PA"
"F000ZS1267-2   ";"SUPORTE FIXACAO 9221081302    ";"PI"
"F000ZS1266     ";"SUPORTE FIXACAO 9221081313    ";"PA"
"F000ZS1266-2   ";"SUPORTE FIXACAO 9221081313    ";"PI"
"F000ZS1266-1   ";"SUPORTE FIXACAO SCHULER CNC   ";"PI"
"F000ZS1267-1   ";"SUPORTE FIXACAO SCHULER CNC   ";"PI"
"215481         ";"SUPORTE GUIA SUP PQ 24 504140 ";"PA"
"215497         ";"SUPORTE GUIA SUPERIOR PQ 34   ";"PA"
"260011         ";"SUPORTE INF DIAN LD 939123-100";"PA"
"260018         ";"SUPORTE INF DIAN LD 939123-101";"PA"
"260018-1       ";"SUPORTE INF DIAN LD ESTAMPADO ";"PI"
"260012         ";"SUPORTE INF DIAN LE 939122-100";"PA"
"  260017       ";"SUPORTE INF DIAN LE 939122-101";"PA"
"260017         ";"SUPORTE INF DIAN LE 939122-101";"PA"
"260017-1       ";"SUPORTE INF DIAN LE ESTAMPADO ";"PI"
"260004         ";"SUPORTE INF DIR 914018-102    ";"PA"
"260003         ";"SUPORTE INF ESQ 914017-102    ";"PA"
"260013         ";"SUPORTE INF TRAS LD 939125-100";"PA"
"260020         ";"SUPORTE INF TRAS LD 939125-901";"PA"
"260020-1       ";"SUPORTE INF TRAS LD ESTAMPADO ";"PI"
"260014         ";"SUPORTE INF TRAS LE 939124-100";"PA"
"260019         ";"SUPORTE INF TRAS LE 939124-901";"PA"
"260019-1       ";"SUPORTE INF TRAS LE ESTAMPADO ";"PI"
"3391095217     ";"SUPORTE MOTOR 3391095217      ";"PA"
"260002         ";"SUPORTE SUP DIR 914016-103    ";"PA"
"260001         ";"SUPORTE SUP ESQ 914015-103    ";"PA"
"260009         ";"SUPORTE SUPERIOR LD 939121-100";"PA"
"260016         ";"SUPORTE SUPERIOR LD 939121-101";"PA"
"260009-1       ";"SUPORTE SUPERIOR LD ESTAMPADO ";"PI"
"260016-1       ";"SUPORTE SUPERIOR LD ESTAMPADO ";"PI"
"260010         ";"SUPORTE SUPERIOR LE 939120-100";"PA"
"260015         ";"SUPORTE SUPERIOR LE 939120-101";"PA"
"260010-1       ";"SUPORTE SUPERIOR LE ESTAMPADO ";"PI"
"260015-1       ";"SUPORTE SUPERIOR LE ESTAMPADO ";"PI"
"215585         ";"SUPT CABO / KABELANBINDUNG    ";"PI"
"212697EXP      ";"SUPT COLUNA DIRECAO B5 EXP    ";"PA"
"215480EXP      ";"SUPT COLUNA DIRECAO PQ24 EXP  ";"PA"
"215459EXP      ";"SUPT COLUNA DIRECAO PQ34 EXP  ";"PA"
"215598EXP-1    ";"SUPT COLUNA FIAT 225STLS EXP  ";"PI"
"215598-1       ";"SUPT COLUNA SOLDA FIAT 225STLS";"PI"
"215602-1       ";"SUPT COLUNA SOLDA VW 230      ";"PI"
"215662-1       ";"SUPT COLUNA SOLDA VW249       ";"PI"
"215602         ";"SUPT COLUNA VW 230 569639     ";"PA"
"215662         ";"SUPT COLUNA VW249 521262      ";"PA"
"250003         ";"SUPT COLUNA X90               ";"PA"
"250004         ";"SUPT COLUNA X90               ";"PA"
"F006S20331     ";"SUPT MOTOR BOSCH F006S20331   ";"PA"
"215490EXP      ";"SUPT ROLAM BICO PATO PQ24 EXP ";"PA"
"215496EXP      ";"SUPT ROLAM BICO PATO PQ34 EXP ";"PA"
"270031         ";"SUPTE EX FIX CAPA-8553314000  ";"PA"
"270030         ";"SUPTE FIXACAO CAPA-8543321000 ";"PA"
"9232081491     ";"Suporte de Contato            ";"PA"
"9232081491-1   ";"Suporte de Contato            ";"PI"
"1390520709     ";"TAMPA                         ";"PA"
"F006K20169     ";"TAMPA  9391456203             ";"PA"
"F000AL1530     ";"TAMPA  F000AL1530             ";"PA"
"F000AL2074     ";"TAMPA  F000AL1530             ";"PA"
"F000AL2074-1   ";"TAMPA  F000AL1530             ";"PI"
"F000AL2074-REFO";"TAMPA  F000AL1530             ";"PA"
"F000DR1064     ";"TAMPA 064                     ";"PA"
"F000DR1064-1   ";"TAMPA 064 ESTAMPAR            ";"PI"
"F000DR1064-3   ";"TAMPA 064 RECOZIMENTO         ";"PI"
"F000DR1064-2   ";"TAMPA 064 TAMBOREAR E LAVAR   ";"PI"
"F006K20168-3   ";"TAMPA 1390520706 - MONTAR ARRU";"PI"
"6992500381     ";"TAMPA 1390520706- PC 13742    ";"PA"
"F006K20168     ";"TAMPA 1390520709              ";"PA"
"F006K20168-1   ";"TAMPA 1390520709              ";"PI"
"F006K20168-2   ";"TAMPA 1390520709 - ZINCAR     ";"PI"
"6992500380     ";"TAMPA 1390520709- PC 13741    ";"PA"
"1390520706     ";"TAMPA COM ARRUELA             ";"PA"
"F006K10071-1   ";"TAMPA DO MANCAL - ESTAMPAR    ";"PI"
"F006K10071-2   ";"TAMPA DO MANCAL - RECOZER     ";"PI"
"F006K10071     ";"TAMPA DO MANCAL F006K10071    ";"PA"
"F006K10007-2   ";"TAMPA DO MOTOR - MANUAL       ";"PI"
"F00042100W-2   ";"TAMPA FECHAM-SCHUL MANUAL 1   ";"PI"
"F00042100X-2   ";"TAMPA FECHAM-SCHUL MANUAL 1   ";"PI"
"F00042100Y-2   ";"TAMPA FECHAM-SCHUL MANUAL 1   ";"PI"
"F00042100Z-2   ";"TAMPA FECHAM-SCHUL MANUAL 1   ";"PI"
"F00042100W-3   ";"TAMPA FECHAM-SCHUL MANUAL 2   ";"PI"
"F00042100X-3   ";"TAMPA FECHAM-SCHUL MANUAL 2   ";"PI"
"F00042100Y-3   ";"TAMPA FECHAM-SCHUL MANUAL 2   ";"PI"
"F00042100Z-3   ";"TAMPA FECHAM-SCHUL MANUAL 2   ";"PI"
"F00042100X-4   ";"TAMPA FECHAM-SCHUL MANUAL 3   ";"PI"
"F00042100Z-4   ";"TAMPA FECHAM-SCHUL MANUAL 3   ";"PI"
"F00042100X-5   ";"TAMPA FECHAM-SCHUL MANUAL 4   ";"PI"
"F00042100Z-5   ";"TAMPA FECHAM-SCHUL MANUAL 4   ";"PI"
"F00042100W-1   ";"TAMPA FECHAM-SCHULER CNC      ";"PI"
"F00042100X-1   ";"TAMPA FECHAM-SCHULER CNC      ";"PI"
"F00042100Y-1   ";"TAMPA FECHAM-SCHULER CNC      ";"PI"
"F00042100Z-1   ";"TAMPA FECHAM-SCHULER CNC      ";"PI"
"F006K10007-1   ";"TAMPA LADO MOTRIZ             ";"PI"
"F006K10007-3   ";"TAMPA LADO MOTRIZ - ZINCAR    ";"PI"
"F006K10007     ";"TAMPA LADO MOTRIZ F006K10007  ";"PA"
"270032         ";"TERM ACIONADOR - 82175830-3   ";"PA"
"F000LD1510     ";"TERMINAL PLANO 1124477095     ";"PA"
"F000LD1514     ";"TERMINAL PLANO 9122080384     ";"PA"
"260021         ";"TESTE                         ";"PA"
"260021-1       ";"TESTE -01                     ";"PA"
"2700022        ";"TRAVESSA DIANTEIRA827335200011";"PA"
"270006         ";"TRAVESSA DIANTEIRA827335200011";"PA"
"270025         ";"TRAVESSA INF DE ENCOSTO       ";"PA"
"270003         ";"TRAVESSA INFERIOR 822668923-11";"PA"
"270001         ";"TRAVESSA INFERIOR 8272301000  ";"PA"
"270002         ";"TRAVESSA SUPERIOR             ";"PA"
"260008         ";"TRILHO 934081-100             ";"PA"
"260008-1       ";"TRILHO 934081-XXX ESTAMPAR    ";"PI"
"980003         ";"TUBO D.46,6  X  1,8 X 286,6   ";"PA"
"152007-PA      ";"TUBO D.46,6 ESPECIAL ESTAMPADO";"PA"
"212670         ";"TUBO D.46.6X43X286.6 VW 210   ";"PI"
"215601         ";"TUBO FIAT 225 STLS            ";"PI"
"215664         ";"TUBO FIAT 226 STLS            ";"PA"
"215596         ";"TUBO FIAT 310 STLS            ";"PI"
"215590         ";"TUBO FIAT 310/225 MVLS        ";"PI"
"212689         ";"TUBO GUIA                     ";"PI"
"212689EXP      ";"TUBO GUIA                     ";"PI"
"215576         ";"TUBO PERFILADO FIAT STLS TUPER";"PI"
"215616         ";"TUBO VW249                    ";"PI"
"212616         ";"TUBO VW249 INSPECIONADO       ";"PI"
"215616-2       ";"TUBO VW249-EXPANDIDO          ";"PI"
"215616-1       ";"TUBO VW249-REBARBADO          ";"PI"
"9391456533     ";"Tampa                         ";"PA"
"F006K10065     ";"Tampa                         ";"PA"
"9391456532     ";"Tampa (c/arruela)             ";"PA"
"F00042100W     ";"Tampa de Fechamento           ";"PA"
"F00042100X     ";"Tampa de Fechamento           ";"PA"
"F00042100Y     ";"Tampa de Fechamento           ";"PA"
"F00042100Z     ";"Tampa de Fechamento           ";"PA"
"2253469        ";"VALVULA                       ";"PA"
"2253469-1      ";"VALVULA  SCHULER CNC          ";"PI"
"1126610095     ";"VENTOINHA "A"                 ";"PA"
"1126610115     ";"VENTOINHA "A"                 ";"PA"
"1126610125     ";"VENTOINHA "B"                 ";"PA"
"1126610125-1   ";"VENTOINHA "B"                 ";"PI"
"1126610126     ";"VENTOINHA "B"                 ";"PA"
"1126610126-1   ";"VENTOINHA "B"                 ";"PI"
"9123080008     ";"VENTOINHA "B"                 ";"PA"
"F00M132904     ";"Ventoinha                     ";"PA"
