"215567         ";"20120915";"20120915";"20120917";3359;0
"215567EXP      ";"20120912";"20120912";"20120917";14300;0
"215567EXP      ";"20120915";"20120915";"20120917";1920;94
"215567EXP      ";"20120915";"20120917";"20120917";8480;146
"215567EXP      ";"20120917";"20120917";"20120917";9100;0
"2155791        ";"20120917";"20120917";"20120917";60;0
"2155791EXP     ";"20120915";"20120917";"20120917";1080;1
"215698         ";"20120915";"20120915";"20120917";440;0
"215698         ";"20120917";"20120917";"20120917";440;0
"215699         ";"20120914";"20120915";"20120917";2048;28
"215699         ";"20120914";"20120915";"20120917";0;19
"215699         ";"20120917";"20120917";"20120917";0;12
"215700         ";"20120917";"20120917";"20120917";1080;0
"260007         ";"20120915";"20120915";"20120917";300;3
"270001         ";"20120917";"20120917";"20120917";2800;0
"270001         ";"20120917";"20120917";"20120917";840;0
"270001         ";"20120917";"20120917";"20120917";2240;18
"270001         ";"20120917";"20120917";"20120917";3920;0
"270026         ";"20120915";"20120915";"20120917";6000;0
"270026         ";"20120915";"20120915";"20120917";900;0
"270027         ";"20120915";"20120915";"20120917";6000;0
"270027         ";"20120915";"20120915";"20120917";900;0
"270028         ";"20120916";"20120916";"20120917";1000;67
"270028         ";"20120916";"20120916";"20120917";1000;0
"270029         ";"20120916";"20120916";"20120917";1000;67
"270029         ";"20120916";"20120916";"20120917";1000;0
"270031         ";"20120914";"20120917";"20120917";39220;0
"9401087410     ";"20120915";"20120915";"20120917";1000;0
"F000DR1064     ";"20120915";"20120917";"20120917";28800;29
"F000DR1068-2   ";"20120917";"20120917";"20120917";40000;0
"F000DR1068-2   ";"20120917";"20120917";"20120917";40000;0
"F000DR1069     ";"20120917";"20120917";"20120917";15840;0
"F000RS1067     ";"20120917";"20120917";"20120917";920;0
"1191251001-2   ";"20120915";"20120915";"20120917";215366;0
"1191251001-3   ";"20120917";"20120917";"20120917";214000;0
"212670         ";"20120917";"20120917";"20120917";456;6
"212670         ";"20120917";"20120917";"20120917";570;0
"212670         ";"20120917";"20120917";"20120917";22;0
"212670         ";"20120917";"20120917";"20120917";152;0
"212670         ";"20120917";"20120917";"20120917";570;0
"212670         ";"20120917";"20120917";"20120917";988;0
"212674         ";"20120917";"20120917";"20120917";1200;0
"215581         ";"20120917";"20120917";"20120917";9000;0
"215590         ";"20120914";"20120914";"20120917";76;0
"215590         ";"20120917";"20120917";"20120917";494;0
"215590         ";"20120917";"20120917";"20120917";570;0
"215590         ";"20120917";"20120917";"20120917";190;0
"215590         ";"20120917";"20120917";"20120917";950;0
"215608EXP-1    ";"20120910";"20120910";"20120917";0;2
"215698-1       ";"20120915";"20120917";"20120917";220;4
"F000DR1064-3   ";"20120915";"20120915";"20120917";27574;0
"F000DR1069-2   ";"20120915";"20120917";"20120917";22880;0
"F000DR1069-2   ";"20120915";"20120917";"20120917";22880;0
