"1126610126     ";"20121217";"20121217";"20121218";5000;0
"1126610126     ";"20121217";"20121217";"20121218";15000;0
"1126610126     ";"20121218";"20121218";"20121218";2500;0
"1126610126     ";"20121218";"20121218";"20121218";2750;0
"1126610126     ";"20121217";"20121217";"20121218";4750;0
"1126610126     ";"20121218";"20121218";"20121218";7500;0
"1126610126     ";"20121218";"20121218";"20121218";3750;0
"2155861EXP     ";"20121217";"20121217";"20121218";9750;14
"2155861EXP     ";"20121217";"20121217";"20121218";239;0
"215608EXP      ";"20121217";"20121217";"20121218";784;0
"215608EXP      ";"20121218";"20121218";"20121218";1176;0
"215608EXP      ";"20121218";"20121218";"20121218";392;0
"215714         ";"20121214";"20121214";"20121218";246;0
"260007         ";"20121218";"20121218";"20121218";0;6
"270005         ";"20121217";"20121217";"20121218";3600;0
"270006         ";"20121217";"20121217";"20121218";7480;0
"270006         ";"20121217";"20121217";"20121218";5440;0
"270006         ";"20121217";"20121217";"20121218";680;0
"270006         ";"20121218";"20121218";"20121218";4338;0
"270027         ";"20121214";"20121214";"20121218";9000;0
"270027         ";"20121214";"20121214";"20121218";15000;0
"270027         ";"20121214";"20121214";"20121218";6000;0
"270027         ";"20121214";"20121214";"20121218";1445;0
"270027         ";"20121214";"20121214";"20121218";4458;0
"3131323034     ";"20121218";"20121218";"20121218";2000;0
"215597-1       ";"20121218";"20121218";"20121218";395;2
"215613         ";"20121217";"20121217";"20121218";1015;0
"215613         ";"20121217";"20121217";"20121218";82;0
"260007-1       ";"20121218";"20121218";"20121218";3500;0
