"1126610115     ";"20130415";"20130415";"20130415";3750;0
"215490         ";"20130413";"20130415";"20130415";750;0
"215490         ";"20130415";"20130415";"20130415";400;0
"215490         ";"20130415";"20130415";"20130415";2800;0
"215490         ";"20130415";"20130415";"20130415";0;116
"215597         ";"20130412";"20130415";"20130415";448;0
"215665EXP      ";"20130415";"20130415";"20130415";540;0
"260008         ";"20130412";"20130413";"20130415";2900;0
"260008         ";"20130412";"20130412";"20130415";0;3
"260008         ";"20130415";"20130415";"20130415";376;6
"270006         ";"20130413";"20130413";"20130415";680;0
"270006         ";"20130415";"20130415";"20130415";2480;0
"270006         ";"20130415";"20130415";"20130415";240;0
"270006         ";"20130415";"20130415";"20130415";4060;0
"270026         ";"20130412";"20130412";"20130415";4050;0
"270027         ";"20130412";"20130412";"20130415";4050;0
"6992500381     ";"20130415";"20130415";"20130415";1323;3
"F000AL2073     ";"20130411";"20130411";"20130415";5450;0
"F000DR1064     ";"20130412";"20130412";"20130415";12000;10
"F000DR1068     ";"20130413";"20130413";"20130415";24000;26
"F000DR1068     ";"20130415";"20130415";"20130415";16800;132
"F000ZS1265     ";"20130413";"20130415";"20130415";7200;0
"F000ZS1265     ";"20130415";"20130415";"20130415";7200;111
"F000ZS1265     ";"20130415";"20130415";"20130415";2439;50
"F006N10039     ";"20130412";"20130412";"20130415";1003;0
"215580         ";"20130412";"20130412";"20130415";105;0
"215590         ";"20130415";"20130415";"20130415";1140;0
"215597-1       ";"20130412";"20130415";"20130415";448;0
"215610         ";"20130415";"20130415";"20130415";1000;0
"215613         ";"20130413";"20130415";"20130415";720;0
"215613         ";"20130415";"20130415";"20130415";720;0
"9232081491-1   ";"20130411";"20130413";"20130415";51000;0
"9232081491-1   ";"20130413";"20130415";"20130415";19329;0
"F000DR1064-1   ";"20130411";"20130412";"20130415";34132;668
"F000DR1064-1   ";"20130412";"20130412";"20130415";1868;0
"F000DR1064-1   ";"20130415";"20130415";"20130415";27000;590
"F006K20168-2   ";"20130415";"20130415";"20130415";0;8
"F006N10039-1   ";"20130412";"20130413";"20130415";15000;0
"F006N10039-5   ";"20130415";"20130415";"20130415";424;0
