"1000290009     ";"20121017";"20121018";"20121018";2290;0
"1126610125     ";"20121017";"20121017";"20121018";3750;0
"1126610126     ";"20121018";"20121018";"20121018";3750;0
"1461904391     ";"20121017";"20121017";"20121018";1200;0
"215597         ";"20121017";"20121017";"20121018";416;0
"215597         ";"20121017";"20121018";"20121018";480;0
"215700         ";"20121018";"20121018";"20121018";2160;0
"260007         ";"20121017";"20121018";"20121018";1500;12
"270001         ";"20121017";"20121018";"20121018";7280;20
"270001         ";"20121018";"20121018";"20121018";1960;3
"270026         ";"20121017";"20121017";"20121018";0;44
"270027         ";"20121017";"20121017";"20121018";0;40
"270028         ";"20121016";"20121016";"20121018";0;89
"270028         ";"20121016";"20121016";"20121018";710;0
"270029         ";"20121017";"20121017";"20121018";710;131
"3131323031     ";"20121018";"20121018";"20121018";6518;0
"F000CD1249     ";"20121018";"20121018";"20121018";8000;0
"F000DR1064     ";"20121018";"20121018";"20121018";13200;0
"F000DR1068     ";"20121017";"20121017";"20121018";26400;19
"F000RS1059     ";"20121008";"20121018";"20121018";322400;0
"F000RS1059     ";"20121008";"20121018";"20121018";1600;0
"F006S20435     ";"20121016";"20121018";"20121018";3600;0
"1461904391-4   ";"20121016";"20121017";"20121018";1200;0
"212674         ";"20121017";"20121017";"20121018";1402;3
"212674         ";"20121018";"20121018";"20121018";2094;6
"212675         ";"20121018";"20121018";"20121018";2800;0
"215597-1       ";"20121017";"20121017";"20121018";361;0
"215597-1       ";"20121017";"20121018";"20121018";535;7
"215597-1       ";"20121017";"20121018";"20121018";0;2
"215696         ";"20121017";"20121018";"20121018";1080;0
"215696         ";"20121018";"20121018";"20121018";540;3
"F000DR1064-2   ";"20121016";"20121016";"20121018";11801;0
"F000DR1064-2   ";"20121016";"20121016";"20121018";11801;0
"F000DR1064-3   ";"20121018";"20121018";"20121018";27938;0
"F000DR1064-3   ";"20121018";"20121018";"20121018";2662;0
"F000DR1068-1   ";"20121017";"20121017";"20121018";9600;0
"F000DR1069-1   ";"20121016";"20121018";"20121018";52800;0
"F000DR1069-2   ";"20121017";"20121018";"20121018";35200;0
"F000DR1069-2   ";"20121017";"20121018";"20121018";35200;0
"F006S20435-1   ";"20121016";"20121017";"20121018";5190;0
