"1126610126     ";"20121128";"20121128";"20121129";11250;0
"1126610126     ";"20121129";"20121129";"20121129";7500;0
"1126610126     ";"20121129";"20121129";"20121129";3750;0
"215598EXP      ";"20121128";"20121128";"20121129";336;0
"215598EXP      ";"20121129";"20121129";"20121129";84;0
"215598EXP      ";"20121129";"20121129";"20121129";252;0
"215698         ";"20121128";"20121128";"20121129";440;0
"215698         ";"20121129";"20121129";"20121129";220;0
"215698         ";"20121129";"20121129";"20121129";880;0
"270001         ";"20121128";"20121128";"20121129";4760;0
"270001         ";"20121129";"20121129";"20121129";3640;0
"270001         ";"20121129";"20121129";"20121129";280;7
"270001         ";"20121129";"20121129";"20121129";840;0
"270001         ";"20121129";"20121129";"20121129";210;0
"270001         ";"20121129";"20121129";"20121129";210;0
"270001         ";"20121129";"20121129";"20121129";210;0
"270005         ";"20121129";"20121129";"20121129";3600;0
"280002         ";"20121128";"20121128";"20121129";2870;23
"280002         ";"20121128";"20121128";"20121129";2000;127
"280002         ";"20121128";"20121128";"20121129";2000;0
"280002         ";"20121129";"20121129";"20121129";3000;0
"280002         ";"20121129";"20121129";"20121129";3000;0
"280002         ";"20121129";"20121129";"20121129";2000;0
"280002         ";"20121129";"20121129";"20121129";2000;0
"280002         ";"20121129";"20121129";"20121129";2000;0
"280002         ";"20121129";"20121129";"20121129";313;0
"280002         ";"20121129";"20121129";"20121129";1687;0
"280003         ";"20121128";"20121128";"20121129";2870;0
"280003         ";"20121128";"20121128";"20121129";2000;127
"280003         ";"20121128";"20121128";"20121129";2000;0
"280003         ";"20121128";"20121128";"20121129";0;23
"280003         ";"20121129";"20121129";"20121129";3000;0
"280003         ";"20121129";"20121129";"20121129";3000;0
"280003         ";"20121129";"20121129";"20121129";2000;0
"280003         ";"20121129";"20121129";"20121129";2000;0
"280003         ";"20121129";"20121129";"20121129";2000;0
"280003         ";"20121129";"20121129";"20121129";313;0
"280003         ";"20121129";"20121129";"20121129";1687;0
"F000DR1068     ";"20121128";"20121129";"20121129";48000;65
"F000DR1069     ";"20121129";"20121129";"20121129";16720;0
"215597-1       ";"20121127";"20121128";"20121129";641;3
"215597-1       ";"20121128";"20121129";"20121129";448;0
"215598EXP-1    ";"20121128";"20121128";"20121129";0;6
"215598EXP-1    ";"20121128";"20121129";"20121129";569;0
"215598EXP-1    ";"20121128";"20121128";"20121129";420;5
"215598EXP-1    ";"20121129";"20121129";"20121129";19;0
"215601         ";"20121129";"20121129";"20121129";570;0
"215601         ";"20121129";"20121129";"20121129";570;0
"215601         ";"20121129";"20121129";"20121129";570;0
"215601         ";"20121129";"20121129";"20121129";570;0
"215601         ";"20121129";"20121129";"20121129";570;0
"215601         ";"20121129";"20121129";"20121129";189;0
"215602-1       ";"20121129";"20121129";"20121129";272;7
"215609         ";"20121129";"20121129";"20121129";2400;0
"215609         ";"20121129";"20121129";"20121129";2400;0
"215609         ";"20121129";"20121129";"20121129";2400;0
"215616         ";"20121129";"20121129";"20121129";76;0
"215616         ";"20121129";"20121129";"20121129";76;5
"215616         ";"20121129";"20121129";"20121129";570;26
"215698-1       ";"20121128";"20121128";"20121129";220;0
"215698-1       ";"20121128";"20121129";"20121129";220;1
"215698-1       ";"20121129";"20121129";"20121129";220;2
"215698-1       ";"20121129";"20121129";"20121129";220;3
"2253469-1      ";"20121128";"20121129";"20121129";30000;0
"2253469-1      ";"20121129";"20121129";"20121129";4000;0
