1000290008     ,20120207,20120207,20120207,2500,0
1126610095     ,20120204,20120206,20120207,16500,600
215568         ,20120207,20120207,20120207,360,0
215568         ,20120207,20120207,20120207,360,0
215568         ,20120207,20120207,20120207,360,58
215598EXP      ,20120204,20120204,20120207,1764,0
215598EXP      ,20120205,20120205,20120207,168,0
215598EXP      ,20120207,20120207,20120207,252,0
215602         ,20110207,20120207,20120207,544,0
215602         ,20120207,20120207,20120207,408,0
215699         ,20120206,20120207,20120207,960,0
260003         ,20120206,20120206,20120207,1600,0
260003         ,20120206,20120206,20120207,6400,0
260003         ,20120206,20120207,20120207,11200,0
260004         ,20120206,20120206,20120207,1600,0
260004         ,20120206,20120206,20120207,6400,0
260004         ,20120206,20120207,20120207,11200,0
270026         ,20120202,20120204,20120207,6750,0
270027         ,20120204,20120204,20120207,200,0
3391095217     ,20120204,20120204,20120207,5200,0
3391095217     ,20120203,20120203,20120207,13000,0
3391095217     ,20120204,20120204,20120207,5000,0
F000DR1069     ,20120206,20120207,20120207,31680,0
F000ZS1285     ,20120204,20120205,20120207,5000,175
F000ZS1285     ,20120205,20120205,20120207,130,0
212670         ,20120130,20120206,20120207,798,3
212670         ,20120207,20120207,20120207,494,0
212670         ,20120207,20120207,20120207,76,0
215580         ,20120206,20120206,20120207,6000,38
215597-1       ,20120206,20120206,20120207,49,13
215597-1       ,20120131,20120202,20120207,560,10
215598EXP-1    ,20120204,20120207,20120207,1344,0
215598EXP-1    ,20120207,20120207,20120207,84,0
215608EXP-1    ,20120203,20120206,20120207,784,15
215616         ,20120206,20120206,20120207,861,33
F000DR1069-2   ,20120207,20120207,20120207,49840,0
F000DR1069-2   ,20120207,20120207,20120207,49840,0
