"1126610095     ";"20120926";"20120926";"20120926";7500;0
"215698         ";"20120926";"20120926";"20120926";440;0
"215699         ";"20120925";"20120926";"20120926";2048;6
"215700         ";"20120925";"20120925";"20120926";540;0
"215710EXP      ";"20120925";"20120925";"20120926";972;1
"215714         ";"20120925";"20120926";"20120926";3360;138
"215714         ";"20120926";"20120926";"20120926";1680;0
"215714         ";"20120926";"20120926";"20120926";2520;0
"215714         ";"20120926";"20120926";"20120926";280;0
"215714         ";"20120926";"20120926";"20120926";1680;0
"215714         ";"20120926";"20120926";"20120926";840;0
"260007         ";"20120920";"20120924";"20120926";1450;12
"260011         ";"20120925";"20120925";"20120926";1000;0
"260012         ";"20120925";"20120925";"20120926";1000;0
"260013         ";"20120925";"20120925";"20120926";860;140
"260014         ";"20120925";"20120925";"20120926";954;18
"270004         ";"20120925";"20120925";"20120926";6630;0
"270034         ";"20120925";"20120925";"20120926";8000;0
"3131323031     ";"20120926";"20120926";"20120926";2000;0
"F000CD1249     ";"20120913";"20120915";"20120926";85913;0
"F000DR1064     ";"20120925";"20120925";"20120926";36000;195
"F000DR1068-2   ";"20120926";"20120926";"20120926";33600;0
"F000DR1068-2   ";"20120926";"20120926";"20120926";33600;0
"F006S20435     ";"20120926";"20120926";"20120926";1687;18
"F006S20435     ";"20120926";"20120926";"20120926";139;0
"212670         ";"20120926";"20120926";"20120926";456;3
"212670         ";"20120926";"20120926";"20120926";570;0
"212670         ";"20120926";"20120926";"20120926";380;0
"212670         ";"20120926";"20120926";"20120926";190;0
"212670         ";"20120926";"20120926";"20120926";570;0
"212674         ";"20120925";"20120925";"20120926";2097;3
"212674         ";"20120926";"20120926";"20120926";900;0
"212689         ";"20120924";"20120924";"20120926";1095;0
"212698         ";"20120926";"20120926";"20120926";9600;0
"215696         ";"20120925";"20120925";"20120926";540;0
"215696         ";"20120925";"20120925";"20120926";0;1
"215698-1       ";"20120925";"20120925";"20120926";440;8
"215698-1       ";"20120925";"20120926";"20120926";220;2
"215698-1       ";"20120926";"20120926";"20120926";220;3
"260007-1       ";"20120925";"20120925";"20120926";3270;63
"260013-1       ";"20120924";"20120924";"20120926";1000;0
"260013-1       ";"20120924";"20120924";"20120926";1000;0
"260014-1       ";"20120924";"20120924";"20120926";1000;0
"260014-1       ";"20120924";"20120924";"20120926";1000;0
"270005-1       ";"20120925";"20120926";"20120926";18412;0
"F000DR1068-1   ";"20120924";"20120925";"20120926";33600;0
"F006K20168-2   ";"20120924";"20120924";"20120926";12867;0
"F006S20435-1   ";"20120926";"20120926";"20120926";1705;0
"F006S20435-1   ";"20120926";"20120926";"20120926";139;0
