module gitlab.com/infor-cloud/martian-cloud/phobos/phobos-plugin-sdk

go 1.20

require (
	github.com/fatih/color v1.16.0
	github.com/hashicorp/cli v1.1.6
	github.com/hashicorp/go-argmapper v0.2.4
	github.com/hashicorp/go-hclog v1.5.0
	github.com/hashicorp/go-plugin v1.4.9
	github.com/hashicorp/hcl/v2 v2.17.0
	github.com/hashicorp/opaqueany v0.0.0-20230114004030-81be31706b04
	github.com/hashicorp/protostructure v0.0.0-20220321173139-813f7b927cb7
	github.com/iancoleman/strcase v0.2.0
	github.com/mattn/go-colorable v0.1.13
	github.com/olekukonko/tablewriter v0.0.5
	github.com/stretchr/testify v1.8.4
	github.com/zclconf/go-cty v1.13.2
	google.golang.org/grpc v1.58.3
	google.golang.org/grpc/cmd/protoc-gen-go-grpc v1.3.0
	google.golang.org/protobuf v1.34.2
)

require (
	github.com/Masterminds/goutils v1.1.1 // indirect
	github.com/Masterminds/semver/v3 v3.2.0 // indirect
	github.com/Masterminds/sprig/v3 v3.2.3 // indirect
	github.com/agext/levenshtein v1.2.3 // indirect
	github.com/apparentlymart/go-textseg/v13 v13.0.0 // indirect
	github.com/armon/go-radix v1.0.0 // indirect
	github.com/bgentry/speakeasy v0.1.0 // indirect
	github.com/davecgh/go-spew v1.1.1 // indirect
	github.com/golang/protobuf v1.5.3 // indirect
	github.com/google/go-cmp v0.5.9 // indirect
	github.com/google/uuid v1.3.0 // indirect
	github.com/hashicorp/errwrap v1.1.0 // indirect
	github.com/hashicorp/go-multierror v1.1.1 // indirect
	github.com/hashicorp/yamux v0.1.1 // indirect
	github.com/huandu/xstrings v1.3.3 // indirect
	github.com/imdario/mergo v0.3.11 // indirect
	github.com/kr/pretty v0.3.1 // indirect
	github.com/mattn/go-isatty v0.0.20 // indirect
	github.com/mattn/go-runewidth v0.0.14 // indirect
	github.com/mitchellh/copystructure v1.0.0 // indirect
	github.com/mitchellh/go-testing-interface v1.14.1 // indirect
	github.com/mitchellh/go-wordwrap v1.0.1 // indirect
	github.com/mitchellh/reflectwalk v1.0.0 // indirect
	github.com/oklog/run v1.1.0 // indirect
	github.com/pmezard/go-difflib v1.0.0 // indirect
	github.com/posener/complete v1.2.3 // indirect
	github.com/rivo/uniseg v0.4.4 // indirect
	github.com/shopspring/decimal v1.2.0 // indirect
	github.com/spf13/cast v1.3.1 // indirect
	github.com/stretchr/objx v0.5.0 // indirect
	golang.org/x/crypto v0.32.0 // indirect
	golang.org/x/net v0.34.0 // indirect
	golang.org/x/sys v0.29.0 // indirect
	golang.org/x/text v0.21.0 // indirect
	google.golang.org/genproto/googleapis/rpc v0.0.0-20230711160842-782d3b101e98 // indirect
	gopkg.in/check.v1 v1.0.0-20201130134442-10cb98267c6c // indirect
	gopkg.in/yaml.v3 v3.0.1 // indirect
)
