module gitlab.com/infor-cloud/martian-cloud/phobos/phobos-plugin-docs

go 1.19

require (
	github.com/aws/smithy-go v1.8.0
	github.com/google/go-cmp v0.6.0
	github.com/hashicorp/cli v1.1.6
	github.com/hashicorp/copywrite v0.18.0
	github.com/mattn/go-colorable v0.1.13
	github.com/yuin/goldmark v1.7.0
	github.com/zclconf/go-cty v1.14.3
	gitlab.com/infor-cloud/martian-cloud/phobos/phobos-plugin-sdk v0.3.0
	golang.org/x/exp v0.0.0-20230626212559-97b1e661b5df
	golang.org/x/text v0.21.0
)

require (
	github.com/AlecAivazis/survey/v2 v2.3.6 // indirect
	github.com/Masterminds/goutils v1.1.1 // indirect
	github.com/Masterminds/semver/v3 v3.2.0 // indirect
	github.com/Masterminds/sprig/v3 v3.2.3 // indirect
	github.com/ProtonMail/go-crypto v0.0.0-20230217124315-7d5c6f04bbb8 // indirect
	github.com/agext/levenshtein v1.2.3 // indirect
	github.com/apparentlymart/go-textseg/v13 v13.0.0 // indirect
	github.com/apparentlymart/go-textseg/v15 v15.0.0 // indirect
	github.com/armon/go-radix v1.0.0 // indirect
	github.com/asaskevich/govalidator v0.0.0-20200907205600-7a23bdc65eef // indirect
	github.com/bgentry/speakeasy v0.1.0 // indirect
	github.com/bmatcuk/doublestar/v4 v4.6.0 // indirect
	github.com/bradleyfalzon/ghinstallation/v2 v2.5.0 // indirect
	github.com/cli/go-gh v1.2.1 // indirect
	github.com/cli/safeexec v1.0.0 // indirect
	github.com/cli/shurcooL-graphql v0.0.2 // indirect
	github.com/cloudflare/circl v1.3.3 // indirect
	github.com/fatih/color v1.16.0 // indirect
	github.com/fsnotify/fsnotify v1.5.4 // indirect
	github.com/go-openapi/errors v0.20.2 // indirect
	github.com/go-openapi/strfmt v0.21.3 // indirect
	github.com/golang-jwt/jwt/v4 v4.5.0 // indirect
	github.com/golang/protobuf v1.5.3 // indirect
	github.com/google/go-github/v45 v45.2.0 // indirect
	github.com/google/go-github/v53 v53.0.0 // indirect
	github.com/google/go-querystring v1.1.0 // indirect
	github.com/google/uuid v1.3.0 // indirect
	github.com/hashicorp/errwrap v1.1.0 // indirect
	github.com/hashicorp/go-hclog v1.5.0 // indirect
	github.com/hashicorp/go-multierror v1.1.1 // indirect
	github.com/hashicorp/hcl v1.0.0 // indirect
	github.com/hashicorp/hcl/v2 v2.17.0 // indirect
	github.com/henvic/httpretty v0.0.6 // indirect
	github.com/huandu/xstrings v1.3.3 // indirect
	github.com/imdario/mergo v0.3.15 // indirect
	github.com/inconshreveable/mousetrap v1.0.1 // indirect
	github.com/jedib0t/go-pretty v4.3.0+incompatible // indirect
	github.com/jedib0t/go-pretty/v6 v6.4.6 // indirect
	github.com/joho/godotenv v1.3.0 // indirect
	github.com/kballard/go-shellquote v0.0.0-20180428030007-95032a82bc51 // indirect
	github.com/knadh/koanf v1.5.0 // indirect
	github.com/lucasb-eyer/go-colorful v1.2.0 // indirect
	github.com/mattn/go-isatty v0.0.20 // indirect
	github.com/mattn/go-runewidth v0.0.14 // indirect
	github.com/mergestat/timediff v0.0.3 // indirect
	github.com/mgutz/ansi v0.0.0-20200706080929-d51e80ef957d // indirect
	github.com/mitchellh/copystructure v1.2.0 // indirect
	github.com/mitchellh/go-homedir v1.1.0 // indirect
	github.com/mitchellh/go-wordwrap v1.0.1 // indirect
	github.com/mitchellh/mapstructure v1.5.0 // indirect
	github.com/mitchellh/reflectwalk v1.0.2 // indirect
	github.com/muesli/termenv v0.12.0 // indirect
	github.com/oklog/ulid v1.3.1 // indirect
	github.com/posener/complete v1.2.3 // indirect
	github.com/rivo/uniseg v0.4.4 // indirect
	github.com/samber/lo v1.37.0 // indirect
	github.com/shopspring/decimal v1.3.1 // indirect
	github.com/spf13/cast v1.5.0 // indirect
	github.com/spf13/cobra v1.6.1 // indirect
	github.com/spf13/pflag v1.0.5 // indirect
	github.com/thanhpk/randstr v1.0.4 // indirect
	github.com/thlib/go-timezone-local v0.0.0-20210907160436-ef149e42d28e // indirect
	go.mongodb.org/mongo-driver v1.10.0 // indirect
	golang.org/x/crypto v0.32.0 // indirect
	golang.org/x/net v0.27.0 // indirect
	golang.org/x/oauth2 v0.10.0 // indirect
	golang.org/x/sync v0.10.0 // indirect
	golang.org/x/sys v0.29.0 // indirect
	golang.org/x/term v0.28.0 // indirect
	google.golang.org/appengine v1.6.7 // indirect
	google.golang.org/protobuf v1.34.2 // indirect
	gopkg.in/yaml.v3 v3.0.1 // indirect
)
