<svg xmlns="http://www.w3.org/2000/svg" width="30" height="30" viewBox="0 0 30 30">
  <g id="Group_983" data-name="Group 983" transform="translate(-317 -580)">
    <circle id="Ellipse_27" data-name="Ellipse 27" cx="15" cy="15" r="15" transform="translate(317 580)" fill="#ff0404"/>
    <g id="Group_981" data-name="Group 981" transform="translate(324.189 587.19)">
      <g id="Rectangle_3125" data-name="Rectangle 3125" transform="translate(-0.19 -0.19)" fill="none" stroke="#fff" stroke-width="2">
        <rect width="13" height="13" rx="1" stroke="none"/>
        <rect x="1" y="1" width="11" height="11" fill="none"/>
      </g>
      <g id="Path_1189" data-name="Path 1189" transform="translate(6.039 6.039)" fill="none">
        <path d="M8.428,4.15V0a1.2,1.2,0,0,1,1.2,1.2V8.428a1.2,1.2,0,0,1-1.2,1.2H1.2A1.2,1.2,0,0,1,0,8.428H6.851C9.1,8.344,8.308,5.761,8.428,4.15Z" stroke="none"/>
        <path d="M 8.427517890930176 -1.9073486328125e-06 C 9.092437744140625 -1.9073486328125e-06 9.631457328796387 0.5390176773071289 9.631457328796387 1.203927993774414 L 9.631457328796387 8.427517890930176 C 9.631457328796387 9.092437744140625 9.092437744140625 9.631457328796387 8.427517890930176 9.631457328796387 L 1.203927993774414 9.631457328796387 C 0.5390176773071289 9.631457328796387 -1.9073486328125e-06 9.092437744140625 -1.9073486328125e-06 8.427517890930176 L 6.85147762298584 8.427517890930176 C 9.102387428283691 8.343607902526855 8.308187484741211 5.761147499084473 8.427517890930176 4.149827480316162 L 8.427517890930176 -1.9073486328125e-06 Z" stroke="none" fill="#fff"/>
      </g>
    </g>
  </g>
</svg>
