{
  "defaultConnection": "default",
  "connections": {
    "default": {
      "connector": "strapi-hook-mongoose",
      "settings": {
        "uri": "mongodb://backend:VN2zLre6SNFgY1P3@autoponica-shard-00-00-osiup.mongodb.net:27017,autoponica-shard-00-01-osiup.mongodb.net:27017,autoponica-shard-00-02-osiup.mongodb.net:27017/test?ssl=true&replicaSet=Autoponica-shard-0&authSource=admin&retryWrites=true&w=majority",
        "database": "influencer"
      },
      "options": {}
    }
  }
}
