<?xml version="1.0" encoding="utf-8"?>
<!-- Generator: Adobe Illustrator 19.0.0, SVG Export Plug-In . SVG Version: 6.00 Build 0)  -->
<svg version="1.1" xmlns="http://www.w3.org/2000/svg" xmlns:xlink="http://www.w3.org/1999/xlink" x="0px" y="0px"
	 viewBox="0 0 750 500" style="enable-background:new 0 0 750 500;" xml:space="preserve">
<style type="text/css">
	.st0{fill:url(#SVGID_1_);}
	.st1{clip-path:url(#SVGID_3_);}
	.st2{fill:url(#SVGID_4_);}
	.st3{fill:url(#SVGID_5_);}
	.st4{fill:url(#SVGID_6_);}
	.st5{opacity:0.54;fill:url(#SVGID_7_);}
	.st6{fill:url(#SVGID_8_);}
	.st7{opacity:0.54;fill:url(#SVGID_9_);}
	.st8{opacity:0.54;fill:url(#SVGID_10_);}
	.st9{fill:url(#SVGID_11_);}
	.st10{fill:url(#SVGID_12_);}
	.st11{fill:url(#SVGID_13_);}
	.st12{fill:url(#SVGID_14_);}
	.st13{fill:url(#SVGID_15_);}
	.st14{fill:url(#SVGID_16_);}
	.st15{fill:url(#SVGID_17_);}
	.st16{fill:url(#SVGID_18_);}
	.st17{fill:url(#SVGID_19_);}
	.st18{opacity:0.54;fill:none;stroke:url(#SVGID_20_);stroke-width:2;stroke-miterlimit:10;}
	.st19{opacity:0.54;fill:none;stroke:url(#SVGID_21_);stroke-width:2;stroke-miterlimit:10;}
	.st20{opacity:0.54;fill:none;stroke:url(#SVGID_22_);stroke-width:2;stroke-miterlimit:10;}
	.st21{fill:url(#SVGID_23_);}
	.st22{fill:url(#SVGID_24_);}
	.st23{fill:url(#SVGID_25_);}
	.st24{fill:none;stroke:url(#SVGID_26_);stroke-width:2;stroke-miterlimit:10;}
	.st25{fill:none;stroke:url(#XMLID_73_);stroke-width:2;stroke-miterlimit:10;}
	.st26{opacity:0.54;fill:url(#SVGID_27_);}
	.st27{opacity:0.54;fill:url(#SVGID_28_);}
	.st28{fill:url(#SVGID_29_);}
	.st29{fill:url(#SVGID_30_);}
	.st30{fill:url(#SVGID_31_);}
	.st31{fill:url(#SVGID_32_);}
	.st32{fill:url(#SVGID_33_);}
	.st33{opacity:0.54;fill:url(#SVGID_34_);}
</style>
<g id="BACKGROUND">
	<radialGradient id="SVGID_1_" cx="410.739" cy="-20.133" r="712.2068" gradientUnits="userSpaceOnUse">
		<stop  offset="0" style="stop-color:#952889"/>
		<stop  offset="1" style="stop-color:#28235E"/>
	</radialGradient>
	<rect class="st0" width="750" height="500"/>
</g>
<g id="OBJECTS">
	<g id="XMLID_1_">
		<g id="XMLID_2_">
			<defs>
				<rect id="SVGID_2_" width="750" height="500"/>
			</defs>
			<clipPath id="SVGID_3_">
				<use xlink:href="#SVGID_2_"  style="overflow:visible;"/>
			</clipPath>
			<g id="XMLID_3_" class="st1">
				<radialGradient id="SVGID_4_" cx="397.4849" cy="533.5368" r="752.3572" gradientUnits="userSpaceOnUse">
					<stop  offset="0" style="stop-color:#952889"/>
					<stop  offset="1" style="stop-color:#28235E"/>
				</radialGradient>
				<path class="st2" d="M-159.5,551.1L-159.5,551.1c-45.7-45.7-45.7-119.7,0-165.4l520.1-520.1c45.7-45.7,119.7-45.7,165.4,0l0,0
					c45.7,45.7,45.7,119.7,0,165.4L5.8,551.1C-39.8,596.8-113.9,596.8-159.5,551.1z"/>
				<radialGradient id="SVGID_5_" cx="763.6525" cy="689.8691" r="281.1925" gradientUnits="userSpaceOnUse">
					<stop  offset="0" style="stop-color:#952889"/>
					<stop  offset="1" style="stop-color:#28235E"/>
				</radialGradient>
				<path class="st3" d="M160.5,915.3L160.5,915.3c-45.7-45.7-45.7-119.7,0-165.4l520.1-520.1c45.7-45.7,119.7-45.7,165.4,0l0,0
					c45.7,45.7,45.7,119.7,0,165.4L325.8,915.3C280.2,961,206.1,961,160.5,915.3z"/>
				<radialGradient id="SVGID_6_" cx="564.1138" cy="2.602090e-006" r="376.9521" gradientUnits="userSpaceOnUse">
					<stop  offset="0" style="stop-color:#952889"/>
					<stop  offset="1" style="stop-color:#28235E"/>
				</radialGradient>
				<path class="st4" d="M221.4,342.7L221.4,342.7c-45.7-45.7-45.7-119.7,0-165.4l520.1-520.1c45.7-45.7,119.7-45.7,165.4,0l0,0
					c45.7,45.7,45.7,119.7,0,165.4L386.8,342.7C341.1,388.4,267.1,388.4,221.4,342.7z"/>
				<linearGradient id="SVGID_7_" gradientUnits="userSpaceOnUse" x1="380.6464" y1="500" x2="1134.5507" y2="500">
					<stop  offset="0" style="stop-color:#DE1C2D"/>
					<stop  offset="0.5225" style="stop-color:#F16A3C"/>
					<stop  offset="1" style="stop-color:#F44F30"/>
				</linearGradient>
				<path class="st5" d="M414.9,842.7L414.9,842.7c-45.7-45.7-45.7-119.7,0-165.4l520.1-520.1c45.7-45.7,119.7-45.7,165.4,0l0,0
					c45.7,45.7,45.7,119.7,0,165.4L580.3,842.7C534.6,888.4,460.6,888.4,414.9,842.7z"/>
				<radialGradient id="SVGID_8_" cx="-185.1124" cy="423.0656" r="376.9521" gradientUnits="userSpaceOnUse">
					<stop  offset="0" style="stop-color:#952889"/>
					<stop  offset="1" style="stop-color:#28235E"/>
				</radialGradient>
				<path class="st6" d="M-527.8,765.8L-527.8,765.8c-45.7-45.7-45.7-119.7,0-165.4L-7.8,80.4c45.7-45.7,119.7-45.7,165.4,0l0,0
					c45.7,45.7,45.7,119.7,0,165.4l-520.1,520.1C-408.1,811.4-482.2,811.4-527.8,765.8z"/>
				<linearGradient id="SVGID_9_" gradientUnits="userSpaceOnUse" x1="209.3058" y1="354.0829" x2="374.9023" y2="167.7866">
					<stop  offset="0" style="stop-color:#DE1C2D"/>
					<stop  offset="0.5225" style="stop-color:#F16A3C"/>
					<stop  offset="1" style="stop-color:#F44F30"/>
				</linearGradient>
				<circle class="st7" cx="235.2" cy="325" r="35.6"/>
				
					<radialGradient id="SVGID_10_" cx="-216.8058" cy="746.1884" r="142.4839" gradientTransform="matrix(0.8429 0 0 0.8429 491.7202 -633.6838)" gradientUnits="userSpaceOnUse">
					<stop  offset="0.119" style="stop-color:#952889"/>
					<stop  offset="0.2678" style="stop-color:#78277D"/>
					<stop  offset="0.4763" style="stop-color:#552570"/>
					<stop  offset="0.6737" style="stop-color:#3C2466"/>
					<stop  offset="0.8536" style="stop-color:#2D2360"/>
					<stop  offset="1" style="stop-color:#28235E"/>
				</radialGradient>
				<circle class="st8" cx="292.9" cy="13.8" r="54.3"/>
				<g id="XMLID_4_">
					<radialGradient id="SVGID_11_" cx="-24.0755" cy="198.8628" r="544.1121" gradientUnits="userSpaceOnUse">
						<stop  offset="0" style="stop-color:#952889"/>
						<stop  offset="1" style="stop-color:#28235E"/>
					</radialGradient>
					<circle class="st9" cx="0" cy="499.8" r="191.8"/>
					<radialGradient id="SVGID_12_" cx="89.2451" cy="237.8606" r="703.0203" gradientUnits="userSpaceOnUse">
						<stop  offset="0" style="stop-color:#952889"/>
						<stop  offset="1" style="stop-color:#28235E"/>
					</radialGradient>
					<circle class="st10" cx="0" cy="499.8" r="155.5"/>
					
						<radialGradient id="SVGID_13_" cx="-88.6527" cy="928.4879" r="542.3454" gradientTransform="matrix(0.9724 0 0 0.9724 80.8018 -99.6146)" gradientUnits="userSpaceOnUse">
						<stop  offset="0" style="stop-color:#952889"/>
						<stop  offset="1" style="stop-color:#28235E"/>
					</radialGradient>
					<circle class="st11" cx="0" cy="499.8" r="151.2"/>
					<radialGradient id="SVGID_14_" cx="84.0504" cy="783.2999" r="861.5307" gradientUnits="userSpaceOnUse">
						<stop  offset="0" style="stop-color:#952889"/>
						<stop  offset="1" style="stop-color:#28235E"/>
					</radialGradient>
					<circle class="st12" cx="0" cy="499.8" r="99.6"/>
				</g>
				
					<radialGradient id="SVGID_15_" cx="-1284.4838" cy="1538.6123" r="265.0208" gradientTransform="matrix(0.7071 0 0 0.7071 830.1652 -1183.3004)" gradientUnits="userSpaceOnUse">
					<stop  offset="0" style="stop-color:#952889"/>
					<stop  offset="1" style="stop-color:#28235E"/>
				</radialGradient>
				<circle class="st13" cx="0" cy="0" r="89.5"/>
				<g>
					
						<radialGradient id="SVGID_16_" cx="5779.5679" cy="-8825.0146" r="544.0832" gradientTransform="matrix(-0.8252 0 0 -0.8252 5533.2563 -6743.9009)" gradientUnits="userSpaceOnUse">
						<stop  offset="0" style="stop-color:#952889"/>
						<stop  offset="1" style="stop-color:#28235E"/>
					</radialGradient>
					<circle class="st14" cx="744.1" cy="290.2" r="158.3"/>
					
						<radialGradient id="SVGID_17_" cx="5892.8823" cy="-8786.0195" r="702.9833" gradientTransform="matrix(-0.8252 0 0 -0.8252 5533.2563 -6743.9009)" gradientUnits="userSpaceOnUse">
						<stop  offset="0" style="stop-color:#952889"/>
						<stop  offset="1" style="stop-color:#28235E"/>
					</radialGradient>
					<circle class="st15" cx="744.1" cy="290.2" r="128.3"/>
					
						<radialGradient id="SVGID_18_" cx="5880.1504" cy="-8351.5566" r="542.3331" gradientTransform="matrix(-0.8024 0 0 -0.8024 5466.7832 -6661.499)" gradientUnits="userSpaceOnUse">
						<stop  offset="0" style="stop-color:#952889"/>
						<stop  offset="1" style="stop-color:#28235E"/>
					</radialGradient>
					<circle class="st16" cx="744.1" cy="290.2" r="124.7"/>
					
						<radialGradient id="SVGID_19_" cx="5887.6875" cy="-8240.6084" r="861.485" gradientTransform="matrix(-0.8252 0 0 -0.8252 5533.2563 -6743.9009)" gradientUnits="userSpaceOnUse">
						<stop  offset="0" style="stop-color:#952889"/>
						<stop  offset="1" style="stop-color:#28235E"/>
					</radialGradient>
					<circle class="st17" cx="744.1" cy="290.2" r="82.2"/>
				</g>
				<linearGradient id="SVGID_20_" gradientUnits="userSpaceOnUse" x1="307.3661" y1="86.0268" x2="637.4933" y2="86.0268">
					<stop  offset="0" style="stop-color:#DE1C2D"/>
					<stop  offset="0.5225" style="stop-color:#F16A3C"/>
					<stop  offset="1" style="stop-color:#F44F30"/>
				</linearGradient>
				<path class="st18" d="M315.7,242.8L315.7,242.8c-9.7-9.7-9.7-25.5,0-35.3L593.9-70.7c9.7-9.7,25.5-9.7,35.3,0l0,0
					c9.7,9.7,9.7,25.5,0,35.3L351,242.8C341.2,252.5,325.4,252.5,315.7,242.8z"/>
				
					<linearGradient id="SVGID_21_" gradientUnits="userSpaceOnUse" x1="-319.8883" y1="1028.5919" x2="10.2211" y2="1028.5919" gradientTransform="matrix(0.894 0 0 0.894 302.447 -354.9749)">
					<stop  offset="0" style="stop-color:#DE1C2D"/>
					<stop  offset="0.5225" style="stop-color:#F16A3C"/>
					<stop  offset="1" style="stop-color:#F44F30"/>
				</linearGradient>
				<path class="st19" d="M23.9,704.7L23.9,704.7c-8.7-8.7-8.7-22.8,0-31.6l248.7-248.7c8.7-8.7,22.8-8.7,31.6,0l0,0
					c8.7,8.7,8.7,22.8,0,31.6L55.4,704.7C46.7,713.4,32.6,713.4,23.9,704.7z"/>
				<linearGradient id="SVGID_22_" gradientUnits="userSpaceOnUse" x1="51.5193" y1="23.076" x2="381.6465" y2="23.076">
					<stop  offset="0" style="stop-color:#DE1C2D"/>
					<stop  offset="0.5225" style="stop-color:#F16A3C"/>
					<stop  offset="1" style="stop-color:#F44F30"/>
				</linearGradient>
				<path class="st20" d="M59.8,179.8L59.8,179.8c-9.7-9.7-9.7-25.5,0-35.3L338-133.7c9.7-9.7,25.5-9.7,35.3,0v0
					c9.7,9.7,9.7,25.5,0,35.3L95.1,179.8C85.4,189.6,69.6,189.6,59.8,179.8z"/>
				<linearGradient id="SVGID_23_" gradientUnits="userSpaceOnUse" x1="648.0794" y1="0" x2="851.9206" y2="0">
					<stop  offset="0" style="stop-color:#DE1C2D"/>
					<stop  offset="0.5225" style="stop-color:#F16A3C"/>
					<stop  offset="1" style="stop-color:#F44F30"/>
				</linearGradient>
				<path class="st21" d="M750-38.5c-21.2,0-38.5,17.3-38.5,38.5c0,21.2,17.3,38.5,38.5,38.5c21.2,0,38.5-17.3,38.5-38.5
					C788.5-21.2,771.2-38.5,750-38.5z M750,36.9c-20.4,0-36.9-16.6-36.9-36.9c0-20.4,16.6-36.9,36.9-36.9
					c20.4,0,36.9,16.6,36.9,36.9C786.9,20.4,770.4,36.9,750,36.9z M750-30.6c-16.9,0-30.6,13.7-30.6,30.6
					c0,16.9,13.7,30.6,30.6,30.6c16.9,0,30.6-13.7,30.6-30.6C780.6-16.9,766.9-30.6,750-30.6z M750,29c-16,0-29-13-29-29
					s13-29,29-29c16,0,29,13,29,29S766,29,750,29z M750-22.7c-12.5,0-22.7,10.2-22.7,22.7s10.2,22.7,22.7,22.7
					c12.5,0,22.7-10.2,22.7-22.7S762.5-22.7,750-22.7z M750,21.1c-11.6,0-21.1-9.5-21.1-21.1c0-11.6,9.5-21.1,21.1-21.1
					c11.6,0,21.1,9.5,21.1,21.1C771.1,11.6,761.6,21.1,750,21.1z M750-101.9c-56.2,0-101.9,45.7-101.9,101.9
					c0,56.2,45.7,101.9,101.9,101.9c56.2,0,101.9-45.7,101.9-101.9C851.9-56.2,806.2-101.9,750-101.9z M750,100.3
					c-55.3,0-100.3-45-100.3-100.3s45-100.3,100.3-100.3c55.3,0,100.3,45,100.3,100.3S805.3,100.3,750,100.3z M750-94
					c-51.8,0-94,42.2-94,94c0,51.8,42.2,94,94,94c51.8,0,94-42.2,94-94C844-51.8,801.8-94,750-94z M750,92.4
					c-51,0-92.4-41.5-92.4-92.4c0-51,41.5-92.4,92.4-92.4c51,0,92.4,41.5,92.4,92.4C842.4,51,801,92.4,750,92.4z M750-62.3
					c-34.3,0-62.3,27.9-62.3,62.3s27.9,62.3,62.3,62.3S812.3,34.3,812.3,0S784.3-62.3,750-62.3z M750,60.7
					c-33.5,0-60.7-27.2-60.7-60.7s27.2-60.7,60.7-60.7c33.5,0,60.7,27.2,60.7,60.7S783.5,60.7,750,60.7z M750-78.1
					c-43.1,0-78.1,35.1-78.1,78.1c0,43.1,35.1,78.1,78.1,78.1c43.1,0,78.1-35.1,78.1-78.1C828.1-43.1,793.1-78.1,750-78.1z
					 M750,76.6c-42.2,0-76.6-34.3-76.6-76.6c0-42.2,34.3-76.6,76.6-76.6c42.2,0,76.6,34.3,76.6,76.6C826.6,42.2,792.2,76.6,750,76.6
					z M750-70.2c-38.7,0-70.2,31.5-70.2,70.2c0,38.7,31.5,70.2,70.2,70.2c38.7,0,70.2-31.5,70.2-70.2
					C820.2-38.7,788.7-70.2,750-70.2z M750,68.6c-37.8,0-68.6-30.8-68.6-68.6c0-37.8,30.8-68.6,68.6-68.6
					c37.8,0,68.6,30.8,68.6,68.6C818.6,37.8,787.8,68.6,750,68.6z M750-86.1c-47.5,0-86.1,38.6-86.1,86.1
					c0,47.5,38.6,86.1,86.1,86.1S836.1,47.5,836.1,0C836.1-47.5,797.5-86.1,750-86.1z M750,84.5c-46.6,0-84.5-37.9-84.5-84.5
					s37.9-84.5,84.5-84.5c46.6,0,84.5,37.9,84.5,84.5S796.6,84.5,750,84.5z M750-54.4c-30,0-54.4,24.4-54.4,54.4
					c0,30,24.4,54.4,54.4,54.4c30,0,54.4-24.4,54.4-54.4C804.4-30,780-54.4,750-54.4z M750,52.8c-29.1,0-52.8-23.7-52.8-52.8
					c0-29.1,23.7-52.8,52.8-52.8c29.1,0,52.8,23.7,52.8,52.8C802.8,29.1,779.1,52.8,750,52.8z M750-46.4
					c-25.6,0-46.4,20.8-46.4,46.4c0,25.6,20.8,46.4,46.4,46.4c25.6,0,46.4-20.8,46.4-46.4C796.4-25.6,775.6-46.4,750-46.4z
					 M750,44.9c-24.7,0-44.9-20.1-44.9-44.9c0-24.7,20.1-44.9,44.9-44.9c24.7,0,44.9,20.1,44.9,44.9C794.9,24.7,774.7,44.9,750,44.9
					z"/>
				<radialGradient id="SVGID_24_" cx="347.3859" cy="563.2589" r="603.3817" gradientUnits="userSpaceOnUse">
					<stop  offset="0" style="stop-color:#952889"/>
					<stop  offset="1" style="stop-color:#28235E"/>
				</radialGradient>
				<path class="st22" d="M431.4,413.3L431.4,413.3c4.4,4.4,4.4,11.5,0,15.9L170.3,690.4c-4.4,4.4-11.5,4.4-15.9,0l0,0
					c-4.4-4.4-4.4-11.5,0-15.9l261.1-261.1C419.9,408.9,427,408.9,431.4,413.3z"/>
				<linearGradient id="SVGID_25_" gradientUnits="userSpaceOnUse" x1="341.7419" y1="480.4732" x2="609.287" y2="480.4732">
					<stop  offset="0" style="stop-color:#DE1C2D"/>
					<stop  offset="0.5225" style="stop-color:#F16A3C"/>
					<stop  offset="1" style="stop-color:#F44F30"/>
				</linearGradient>
				<path class="st23" d="M475.5,429.9c-27.9,0-50.6,22.7-50.6,50.6c0,27.9,22.7,50.6,50.6,50.6c27.9,0,50.6-22.7,50.6-50.6
					C526.1,452.6,503.4,429.9,475.5,429.9z M475.5,528.9c-26.7,0-48.5-21.7-48.5-48.5c0-26.7,21.7-48.5,48.5-48.5
					c26.7,0,48.5,21.7,48.5,48.5C524,507.2,502.2,528.9,475.5,528.9z M475.5,440.3c-22.1,0-40.2,18-40.2,40.2
					c0,22.1,18,40.2,40.2,40.2c22.1,0,40.2-18,40.2-40.2C515.7,458.3,497.7,440.3,475.5,440.3z M475.5,518.5
					c-21,0-38.1-17.1-38.1-38.1c0-21,17.1-38.1,38.1-38.1c21,0,38.1,17.1,38.1,38.1C513.6,501.5,496.5,518.5,475.5,518.5z
					 M475.5,450.7c-16.4,0-29.8,13.3-29.8,29.8c0,16.4,13.3,29.8,29.8,29.8c16.4,0,29.8-13.3,29.8-29.8
					C505.3,464.1,491.9,450.7,475.5,450.7z M475.5,508.1c-15.3,0-27.7-12.4-27.7-27.7c0-15.3,12.4-27.7,27.7-27.7
					c15.3,0,27.7,12.4,27.7,27.7C503.2,495.7,490.8,508.1,475.5,508.1z M475.5,346.7c-73.8,0-133.8,60-133.8,133.8
					s60,133.8,133.8,133.8s133.8-60,133.8-133.8S549.3,346.7,475.5,346.7z M475.5,612.2c-72.6,0-131.7-59.1-131.7-131.7
					c0-72.6,59.1-131.7,131.7-131.7c72.6,0,131.7,59.1,131.7,131.7C607.2,553.1,548.1,612.2,475.5,612.2z M475.5,357.1
					c-68,0-123.4,55.3-123.4,123.4c0,68,55.3,123.4,123.4,123.4c68,0,123.4-55.3,123.4-123.4C598.9,412.4,543.5,357.1,475.5,357.1z
					 M475.5,601.8c-66.9,0-121.3-54.4-121.3-121.3c0-66.9,54.4-121.3,121.3-121.3s121.3,54.4,121.3,121.3
					C596.8,547.4,542.4,601.8,475.5,601.8z M475.5,398.7c-45.1,0-81.8,36.7-81.8,81.8s36.7,81.8,81.8,81.8s81.8-36.7,81.8-81.8
					S520.6,398.7,475.5,398.7z M475.5,560.2c-43.9,0-79.7-35.7-79.7-79.7s35.7-79.7,79.7-79.7c43.9,0,79.7,35.7,79.7,79.7
					S519.5,560.2,475.5,560.2z M475.5,377.9c-56.6,0-102.6,46-102.6,102.6c0,56.6,46,102.6,102.6,102.6c56.6,0,102.6-46,102.6-102.6
					C578.1,423.9,532.1,377.9,475.5,377.9z M475.5,581C420.1,581,375,535.9,375,480.5c0-55.4,45.1-100.5,100.5-100.5
					c55.4,0,100.5,45.1,100.5,100.5C576,535.9,530.9,581,475.5,581z M475.5,388.3c-50.8,0-92.2,41.3-92.2,92.2
					c0,50.8,41.3,92.2,92.2,92.2c50.8,0,92.2-41.3,92.2-92.2C567.7,429.7,526.3,388.3,475.5,388.3z M475.5,570.6
					c-49.7,0-90.1-40.4-90.1-90.1c0-49.7,40.4-90.1,90.1-90.1s90.1,40.4,90.1,90.1C565.6,530.1,525.2,570.6,475.5,570.6z
					 M475.5,367.5c-62.3,0-113,50.7-113,113c0,62.3,50.7,113,113,113s113-50.7,113-113C588.5,418.2,537.8,367.5,475.5,367.5z
					 M475.5,591.4c-61.1,0-110.9-49.7-110.9-110.9s49.7-110.9,110.9-110.9s110.9,49.7,110.9,110.9S536.7,591.4,475.5,591.4z
					 M475.5,409.1c-39.3,0-71.4,32-71.4,71.4c0,39.3,32,71.4,71.4,71.4c39.3,0,71.4-32,71.4-71.4
					C546.9,441.1,514.9,409.1,475.5,409.1z M475.5,549.8c-38.2,0-69.3-31.1-69.3-69.3s31.1-69.3,69.3-69.3
					c38.2,0,69.3,31.1,69.3,69.3S513.7,549.8,475.5,549.8z M475.5,419.5c-33.6,0-61,27.3-61,61c0,33.6,27.3,61,61,61
					c33.6,0,61-27.3,61-61C536.5,446.9,509.1,419.5,475.5,419.5z M475.5,539.4c-32.5,0-58.9-26.4-58.9-58.9
					c0-32.5,26.4-58.9,58.9-58.9c32.5,0,58.9,26.4,58.9,58.9C534.4,512.9,508,539.4,475.5,539.4z"/>
				
					<linearGradient id="SVGID_26_" gradientUnits="userSpaceOnUse" x1="3930.5144" y1="1274.8418" x2="4166.3672" y2="1274.8418" gradientTransform="matrix(0.7071 0.7071 -0.7071 0.7071 -1605.7078 -3307.8474)">
					<stop  offset="0" style="stop-color:#DE1C2D"/>
					<stop  offset="0.5225" style="stop-color:#F16A3C"/>
					<stop  offset="1" style="stop-color:#F44F30"/>
				</linearGradient>
				<path class="st24" d="M12.8,799L12.8,799c-45.7-45.7-45.7-119.7,0-165.4l520.1-520.1c45.7-45.7,119.7-45.7,165.4,0l0,0
					c45.7,45.7,45.7,119.7,0,165.4L178.2,799C132.5,844.6,58.5,844.6,12.8,799z"/>
				
					<linearGradient id="XMLID_73_" gradientUnits="userSpaceOnUse" x1="3574.1582" y1="1394.5878" x2="3810.0107" y2="1394.5878" gradientTransform="matrix(0.7071 0.7071 -0.7071 0.7071 -1605.7078 -3307.8474)">
					<stop  offset="0" style="stop-color:#DE1C2D"/>
					<stop  offset="0.5225" style="stop-color:#F16A3C"/>
					<stop  offset="1" style="stop-color:#F44F30"/>
				</linearGradient>
				<path id="XMLID_5_" class="st25" d="M-323.9,631.6L-323.9,631.6c-45.7-45.7-45.7-119.7,0-165.4L196.2-53.8
					c45.7-45.7,119.7-45.7,165.4,0l0,0c45.7,45.7,45.7,119.7,0,165.4l-520.1,520.1C-204.2,677.3-278.2,677.3-323.9,631.6z"/>
				<linearGradient id="SVGID_27_" gradientUnits="userSpaceOnUse" x1="577.4419" y1="237.5421" x2="743.0384" y2="51.2458">
					<stop  offset="0" style="stop-color:#DE1C2D"/>
					<stop  offset="0.5225" style="stop-color:#F16A3C"/>
					<stop  offset="1" style="stop-color:#F44F30"/>
				</linearGradient>
				<circle class="st26" cx="603.3" cy="208.4" r="35.6"/>
				<linearGradient id="SVGID_28_" gradientUnits="userSpaceOnUse" x1="508.5215" y1="306.4625" x2="674.1179" y2="120.1662">
					<stop  offset="0" style="stop-color:#DE1C2D"/>
					<stop  offset="0.5225" style="stop-color:#F16A3C"/>
					<stop  offset="1" style="stop-color:#F44F30"/>
				</linearGradient>
				<circle class="st27" cx="534.4" cy="277.4" r="35.6"/>
				
					<linearGradient id="SVGID_29_" gradientUnits="userSpaceOnUse" x1="3727.8101" y1="1204.4268" x2="4421.4805" y2="424.0464" gradientTransform="matrix(0.7071 0.7071 -0.7071 0.7071 -2007.3424 -3087.8162)">
					<stop  offset="0" style="stop-color:#DE1C2D"/>
					<stop  offset="0.5225" style="stop-color:#F16A3C"/>
					<stop  offset="1" style="stop-color:#F44F30"/>
				</linearGradient>
				<path class="st28" d="M-198.7,528.7L-198.7,528.7c-4.4-4.4-4.4-11.5,0-15.9L62.4,251.7c4.4-4.4,11.5-4.4,15.9,0h0
					c4.4,4.4,4.4,11.5,0,15.9l-261.1,261.1C-187.2,533.1-194.3,533.1-198.7,528.7z"/>
				
					<linearGradient id="SVGID_30_" gradientUnits="userSpaceOnUse" x1="2550.7834" y1="-9178.2539" x2="3244.478" y2="-9958.6611" gradientTransform="matrix(-0.7071 -0.7071 0.7071 -0.7071 9237.0479 -4382.875)">
					<stop  offset="0" style="stop-color:#DE1C2D"/>
					<stop  offset="0.5225" style="stop-color:#F16A3C"/>
					<stop  offset="1" style="stop-color:#F44F30"/>
				</linearGradient>
				<path class="st29" d="M919.1,174.5L919.1,174.5c4.4,4.4,4.4,11.5,0,15.9L658,451.5c-4.4,4.4-11.5,4.4-15.9,0h0
					c-4.4-4.4-4.4-11.5,0-15.9l261.1-261.1C907.6,170.1,914.7,170.1,919.1,174.5z"/>
				<radialGradient id="SVGID_31_" cx="397.4852" cy="-168.7778" r="402.4322" gradientUnits="userSpaceOnUse">
					<stop  offset="0" style="stop-color:#952889"/>
					<stop  offset="1" style="stop-color:#28235E"/>
				</radialGradient>
				<path class="st30" d="M664.6-109.5L664.6-109.5c4.4,4.4,4.4,11.5,0,15.9L403.5,167.5c-4.4,4.4-11.5,4.4-15.9,0l0,0
					c-4.4-4.4-4.4-11.5,0-15.9l261.1-261.1C653.1-113.9,660.2-113.9,664.6-109.5z"/>
				
					<linearGradient id="SVGID_32_" gradientUnits="userSpaceOnUse" x1="2986.043" y1="-9049.1533" x2="3679.7373" y2="-9829.5615" gradientTransform="matrix(-0.7071 -0.7071 0.7071 -0.7071 9237.0479 -4382.875)">
					<stop  offset="0" style="stop-color:#DE1C2D"/>
					<stop  offset="0.5225" style="stop-color:#F16A3C"/>
					<stop  offset="1" style="stop-color:#F44F30"/>
				</linearGradient>
				<path class="st31" d="M702.6-224.6L702.6-224.6c4.4,4.4,4.4,11.5,0,15.9L441.5,52.5c-4.4,4.4-11.5,4.4-15.9,0l0,0
					c-4.4-4.4-4.4-11.5,0-15.9l261.1-261.1C691.1-229,698.2-229,702.6-224.6z"/>
				
					<linearGradient id="SVGID_33_" gradientUnits="userSpaceOnUse" x1="3259.8884" y1="-9314.0332" x2="3953.583" y2="-10094.4404" gradientTransform="matrix(-0.7071 -0.7071 0.7071 -0.7071 9237.0479 -4382.875)">
					<stop  offset="0" style="stop-color:#DE1C2D"/>
					<stop  offset="0.5225" style="stop-color:#F16A3C"/>
					<stop  offset="1" style="stop-color:#F44F30"/>
				</linearGradient>
				<path class="st32" d="M321.7-230.9L321.7-230.9c4.4,4.4,4.4,11.5,0,15.9L60.6,46.1c-4.4,4.4-11.5,4.4-15.9,0l0,0
					c-4.4-4.4-4.4-11.5,0-15.9l261.1-261.1C310.2-235.3,317.3-235.3,321.7-230.9z"/>
				<linearGradient id="SVGID_34_" gradientUnits="userSpaceOnUse" x1="136.8635" y1="426.5252" x2="302.4599" y2="240.229">
					<stop  offset="0" style="stop-color:#DE1C2D"/>
					<stop  offset="0.5225" style="stop-color:#F16A3C"/>
					<stop  offset="1" style="stop-color:#F44F30"/>
				</linearGradient>
				<circle class="st33" cx="162.7" cy="397.4" r="35.6"/>
			</g>
		</g>
	</g>
</g>
</svg>
