<?xml version="1.0" encoding="utf-8"?>
<!-- Generator: Adobe Illustrator 19.0.0, SVG Export Plug-In . SVG Version: 6.00 Build 0)  -->
<svg version="1.1" id="Layer_1" xmlns="http://www.w3.org/2000/svg" xmlns:xlink="http://www.w3.org/1999/xlink" x="0px" y="0px"
	 viewBox="0 0 24 24" style="enable-background:new 0 0 24 24;" xml:space="preserve">
<style type="text/css">
	.st0{fill:#FFFFFF;}
</style>
<g id="XMLID_74_">
	<g>
		<path class="st0" d="M18.9,14.8l-3.2-3.3l3.2-3.3c0.4-0.5,0.4-1.2,0-1.6l-1.8-1.7c-0.5-0.4-1.2-0.4-1.6,0l-3.1,3.2L9.2,4.9
			C8.8,4.4,8,4.4,7.6,4.9L5.8,6.6C5.3,7,5.3,7.8,5.8,8.2L9,11.5l-3.2,3.3c-0.4,0.5-0.4,1.2,0,1.6l1.8,1.7c0.5,0.4,1.2,0.4,1.6,0
			l3.2-3.2l3.2,3.2c0.4,0.5,1.2,0.5,1.6,0l1.8-1.7C19.4,15.9,19.4,15.2,18.9,14.8z"/>
	</g>
</g>
</svg>
