{
  "fields": [
    {
      "name": "kk",
      "type": "string"
    },
    {
      "name": "nik",
      "type": "string"
    },
    {
      "name": "name",
      "type": "string"
    },
    {
      "name": "jk",
      "type": "select",
      "options": {
        "1": "Laki - Laki",
        "2": "Perempuan"
      }
    },
    {
      "name": "agama",
      "type": "select",
      "options": {
        "1": "Islam",
        "2": "Kristen"
      }
    },
    {
      "name": "pekerjaan",
      "type": "string"
    },
    {
      "name": "alamat",
      "type": "text"
    },
    {
      "name": "agama",
      "type": "text"
    },
    {
      "name": "type",
      "type": "select",
      "options": {
        "1": "Kepala Keluarga",
        "2": "Istri"
      }
    },
    {
      "name": "tempar_lahir",
      "type": "string"
    },
    {
      "name": "desa",
      "type": "string"
    },
    {
      "name": "tgl_lahir",
      "type": "date"
    },
    {
      "name": "tgl_datang",
      "type": "date"
    },
    {
      "name": "rt",
      "type": "integer"
    },
    {
      "name": "rw",
      "type": "integer"
    }
  ],
  "foreign_keys": [
    {
      "column": "user_id",
      "references": "id",
      "on": "users",
      "onDelete": "cascade"
    }
  ],
  "relationships": [
    {
      "name": "user",
      "type": "belongsTo",
      "class": "App\\Models\\User"
    }
  ],
  "validations": [

  ]
}