{
  "identifier": "gu-basic",
  "name": "Gujarati Basic",
  "description": "Collection of Gujarati words sourced from Websites",
  "lang": "gu",
  "versions": [
    {
      "identifier": "gu-basic-1",
      "version": 1,
      "description": "Words with highest confidence",
      "size": 17035428
    },
    {
      "identifier": "gu-basic-2",
      "version": 2,
      "description": "Words with confidence lesser than 240",
      "size": 14791790
    },
    {
      "identifier": "gu-basic-3",
      "version": 3,
      "description": "Words with confidence around 1",
      "size": 3332756
    }
  ]
} 
