slug,name,description
agent-d-accueil,Agent d'accueil/CNFS,Peut gérer tous les bénéficiaires de sa structure avec des droits limités. Ne peut pas instruire de demande d'aide.
instructeur,Instructeur,"Peut gérer tous les bénéficiaires de sa structure, mais a des droits de suppression de donnée plus restreint."
referent,Référent,Peut uniquement gérer les bénéficiaires dont il est référent.
responsable-de-structure,Responsable de structure,"Peut gérer tous les bénéficiaires de sa structure. Peut gérer la structure, les types d'accompagnement qu'elle propose et ses agents."
travailleur-social,Travailleur social,Peut gérer tous les bénéficiaires de sa structure.
