[
  {
    "COMER": "975",
    "TNCC": 0,
    "NCC": "SAINT PIERRE ET MIQUELON",
    "NCCENR": "Saint-Pierre-et-Miquelon",
    "LIBELLE": "Saint-Pierre-et-Miquelon"
  },
  {
    "COMER": "977",
    "TNCC": 0,
    "NCC": "SAINT BARTHELEMY",
    "NCCENR": "Saint-Barthélemy",
    "LIBELLE": "Saint-Barthélemy"
  },
  {
    "COMER": "978",
    "TNCC": 0,
    "NCC": "SAINT MARTIN",
    "NCCENR": "Saint-Martin",
    "LIBELLE": "Saint-Martin"
  },
  {
    "COMER": "984",
    "TNCC": 4,
    "NCC": "TERRES AUSTRALES ET ANTARCTIQUES FRANCAISES",
    "NCCENR": "Terres australes et antarctiques françaises",
    "LIBELLE": "Terres australes et antarctiques françaises"
  },
  {
    "COMER": "986",
    "TNCC": 0,
    "NCC": "WALLIS ET FUTUNA",
    "NCCENR": "Wallis-et-Futuna",
    "LIBELLE": "Wallis-et-Futuna"
  },
  {
    "COMER": "987",
    "TNCC": 0,
    "NCC": "POLYNESIE FRANCAISE",
    "NCCENR": "Polynésie française",
    "LIBELLE": "Polynésie française"
  },
  {
    "COMER": "988",
    "TNCC": 0,
    "NCC": "NOUVELLE CALEDONIE",
    "NCCENR": "Nouvelle-Calédonie",
    "LIBELLE": "Nouvelle-Calédonie"
  },
  {
    "COMER": "989",
    "TNCC": 0,
    "NCC": "LA PASSION CLIPPERTON",
    "NCCENR": "La Passion-Clipperton",
    "LIBELLE": "La Passion-Clipperton"
  }
]
