{
	"dynamic": false,
	"properties": {
		"etablissement_id": { "type": "keyword" },
		"etablissement_creation_date": { "type": "date" },
		"etablissement_fermeture_date": { "type": "date" },
		"etablissement_effectif_type_id": { "type": "keyword" },
		"etablissement_effectif_ema": { "type": "long" },
		"etablissement_effectif_ema_date": { "type": "date" },
		"etablissement_effectif_ema_variation": { "type": "long" },
		"etablissement_siege": { "type": "boolean" },
		"etablissement_employeur": { "type": "boolean" },
		"etablissement_actif": { "type": "boolean" },
		"etablissement_naf_type_id": { "type": "keyword" },
		"etablissement_naf_revision_type_id": { "type": "keyword" },
		"etablissement_noms": { "type": "text" },

		"etablissement_predecesseurs": { "type": "keyword" },
		"etablissement_successeurs": { "type": "keyword" },

		"etablissement_subvention": { "type": "boolean" },
		"etablissement_subventions": {
			"type": "nested",
			"properties": {
				"convention_annee": { "type": "short" },
				"montant_total": { "type": "long" }
			}
		},

		"entreprise_id": { "type": "keyword" },
		"entreprise_categorie_type_id": { "type": "keyword" },
		"entreprise_categorie_juridique_2_type_id": { "type": "keyword" },
		"entreprise_categorie_juridique_3_type_id": { "type": "keyword" },
		"entreprise_noms": { "type": "text" },
		"entreprise_economie_sociale_solidaire": { "type": "boolean" },
		"entreprise_micro": { "type": "boolean" },
		"entreprise_procedure_collective": { "type": "boolean" },
		"entreprise_procedure_collective_dates": { "type": "date" },
		"entreprise_chiffre_d_affaires": { "type": "long" },
		"entreprise_exercice_cloture_date": { "type": "date" },
		"entreprise_chiffre_d_affaires_variation": { "type": "long" },
		"entreprise_participation_filiale_de": { "type": "keyword" },
		"entreprise_participation_detient": { "type": "keyword" },
		"entreprise_egapro_indice": { "type": "short" },
		"entreprise_egapro_cadres": { "type": "half_float" },
		"entreprise_egapro_instances": { "type": "half_float" },

		"territoire_commune_id": { "type": "keyword" },
		"territoire_metropole_id": { "type": "keyword" },
		"territoire_epci_id": { "type": "keyword" },
		"territoire_petr_id": { "type": "keyword" },
		"territoire_departement_id": { "type": "keyword" },
		"territoire_region_id": { "type": "keyword" },
		"territoire_zrr_type_id": { "type": "keyword" },
		"territoire_territoire_industrie_id": { "type": "keyword" },
		"territoire_acv": { "type": "boolean" },
		"territoire_pvd": { "type": "boolean" },
		"territoire_va": { "type": "boolean" },
		"territoire_afr": { "type": "boolean" },

		"adresse_numero": { "type": "keyword" },
		"adresse_voie_nom": { "type": "text" },
		"adresse_code_postal": { "type": "keyword" },
		"adresse_geolocalisation": { "type": "geo_point" },
		"adresse_qpv_2015_id": { "type": "keyword" },
		"adresse_qpv_2024_id": { "type": "keyword" },

		"mise_a_jour_date": { "type": "date" },
		"mise_a_jour_sirene_date": { "type": "date" },

		"equipes": {
			"type": "nested",
			"properties": {
				"equipe_id": { "type": "keyword" },
				"etiquettes": { "type": "long" },
				"contacts": { "type": "boolean" },
				"contacts_noms": { "type": "text" },
				"demandes": { "type": "keyword" },
				"favoris": { "type": "keyword" },
				"ancien_createur": { "type": "boolean" },
				"consultation_at": { "type": "date" },
				"consultation_str": { "type": "keyword" },
				"suivi_dates": { "type": "date" },
				"contribution": {
					"properties": {
						"enseigne": { "type": "text" },
						"cloture_date": { "type": "date" },
						"adresse_geolocalisation": { "type": "geo_point" }
					}
				},
				"adresse_qpv_2015_id": { "type": "keyword" },
				"adresse_qpv_2024_id": { "type": "keyword" }
			}
		}
	}
}
