naf_revision_type_id,id,nom,niveau,parent_naf_type_id
NAFRev2,01.11,"Culture de céréales (à l'exception du riz), de légumineuses et de graines oléagineuses",4,01.1
NAFRev2,01.12,Culture du riz,4,01.1
NAFRev2,01.13,"Culture de légumes, de melons, de racines et de tubercules",4,01.1
NAFRev2,01.14,Culture de la canne à sucre,4,01.1
NAFRev2,01.15,Culture du tabac,4,01.1
NAFRev2,01.16,Culture de plantes à fibres,4,01.1
NAFRev2,01.19,Autres cultures non permanentes,4,01.1
NAFRev2,01.21,Culture de la vigne,4,01.2
NAFRev2,01.22,Culture de fruits tropicaux et subtropicaux,4,01.2
NAFRev2,01.23,Culture d'agrumes,4,01.2
NAFRev2,01.24,Culture de fruits à pépins et à noyau,4,01.2
NAFRev2,01.25,Culture d'autres fruits d'arbres ou d'arbustes et de fruits à coque,4,01.2
NAFRev2,01.26,Culture de fruits oléagineux,4,01.2
NAFRev2,01.27,Culture de plantes à boissons,4,01.2
NAFRev2,01.28,"Culture de plantes à épices, aromatiques, médicinales et pharmaceutiques",4,01.2
NAFRev2,01.29,Autres cultures permanentes,4,01.2
NAFRev2,01.30,Reproduction de plantes,4,01.3
NAFRev2,01.41,Élevage de vaches laitières,4,01.4
NAFRev2,01.42,Élevage d'autres bovins et de buffles,4,01.4
NAFRev2,01.43,Élevage de chevaux et d'autres équidés,4,01.4
NAFRev2,01.44,Élevage de chameaux et d'autres camélidés,4,01.4
NAFRev2,01.45,Élevage d'ovins et de caprins,4,01.4
NAFRev2,01.46,Élevage de porcins,4,01.4
NAFRev2,01.47,Élevage de volailles,4,01.4
NAFRev2,01.49,Élevage d'autres animaux,4,01.4
NAFRev2,01.50,Culture et élevage associés,4,01.5
NAFRev2,01.61,Activités de soutien aux cultures,4,01.6
NAFRev2,01.62,Activités de soutien à la production animale,4,01.6
NAFRev2,01.63,Traitement primaire des récoltes,4,01.6
NAFRev2,01.64,Traitement des semences,4,01.6
NAFRev2,01.70,"Chasse, piégeage et services annexes",4,01.7
NAFRev2,02.10,Sylviculture et autres activités forestières,4,02.1
NAFRev2,02.20,Exploitation forestière,4,02.2
NAFRev2,02.30,Récolte de produits forestiers non ligneux poussant à l'état sauvage,4,02.3
NAFRev2,02.40,Services de soutien à l'exploitation forestière,4,02.4
NAFRev2,03.11,Pêche en mer,4,03.1
NAFRev2,03.12,Pêche en eau douce,4,03.1
NAFRev2,03.21,Aquaculture en mer,4,03.2
NAFRev2,03.22,Aquaculture en eau douce,4,03.2
NAFRev2,05.10,Extraction de houille,4,05.1
NAFRev2,05.20,Extraction de lignite,4,05.2
NAFRev2,06.10,Extraction de pétrole brut,4,06.1
NAFRev2,06.20,Extraction de gaz naturel,4,06.2
NAFRev2,07.10,Extraction de minerais de fer,4,07.1
NAFRev2,07.21,Extraction de minerais d'uranium et de thorium,4,07.2
NAFRev2,07.29,Extraction d'autres minerais de métaux non ferreux,4,07.2
NAFRev2,08.11,"Extraction de pierres ornementales et de construction, de calcaire industriel, de gypse, de craie et d'ardoise",4,08.1
NAFRev2,08.12,"Exploitation de gravières et sablières, extraction d'argiles et de kaolin",4,08.1
NAFRev2,08.91,Extraction des minéraux chimiques et d'engrais minéraux,4,08.9
NAFRev2,08.92,Extraction de tourbe,4,08.9
NAFRev2,08.93,Production de sel,4,08.9
NAFRev2,08.99,Autres activités extractives n.c.a.,4,08.9
NAFRev2,09.10,Activités de soutien à l'extraction d'hydrocarbures,4,09.1
NAFRev2,09.90,Activités de soutien aux autres industries extractives,4,09.9
NAFRev2,10.11,Transformation et conservation de la viande de boucherie,4,10.1
NAFRev2,10.12,Transformation et conservation de la viande de volaille,4,10.1
NAFRev2,10.13,Préparation de produits à base de viande,4,10.1
NAFRev2,10.20,"Transformation et conservation de poisson, de crustacés et de mollusques",4,10.2
NAFRev2,10.31,Transformation et conservation de pommes de terre,4,10.3
NAFRev2,10.32,Préparation de jus de fruits et légumes,4,10.3
NAFRev2,10.39,Autre transformation et conservation de fruits et légumes,4,10.3
NAFRev2,10.41,Fabrication d'huiles et graisses,4,10.4
NAFRev2,10.42,Fabrication de margarine et graisses comestibles similaires,4,10.4
NAFRev2,10.51,Exploitation de laiteries et fabrication de fromage,4,10.5
NAFRev2,10.52,Fabrication de glaces et sorbets,4,10.5
NAFRev2,10.61,Travail des grains,4,10.6
NAFRev2,10.62,Fabrication de produits amylacés,4,10.6
NAFRev2,10.71,Fabrication de pain et de pâtisserie fraîche,4,10.7
NAFRev2,10.72,"Fabrication de biscuits, biscottes et pâtisseries de conservation",4,10.7
NAFRev2,10.73,Fabrication de pâtes alimentaires,4,10.7
NAFRev2,10.81,Fabrication de sucre,4,10.8
NAFRev2,10.82,"Fabrication de cacao, chocolat et de produits de confiserie",4,10.8
NAFRev2,10.83,Transformation du thé et du café,4,10.8
NAFRev2,10.84,Fabrication de condiments et assaisonnements,4,10.8
NAFRev2,10.85,Fabrication de plats préparés,4,10.8
NAFRev2,10.86,Fabrication d'aliments homogénéisés et diététiques,4,10.8
NAFRev2,10.89,Fabrication d'autres produits alimentaires n.c.a.,4,10.8
NAFRev2,10.91,Fabrication d'aliments pour animaux de ferme,4,10.9
NAFRev2,10.92,Fabrication d'aliments pour animaux de compagnie,4,10.9
NAFRev2,11.01,Production de boissons alcooliques distillées,4,11.0
NAFRev2,11.02,Production de vin (de raisin),4,11.0
NAFRev2,11.03,Fabrication de cidre et de vins de fruits,4,11.0
NAFRev2,11.04,Production d'autres boissons fermentées non distillées,4,11.0
NAFRev2,11.05,Fabrication de bière,4,11.0
NAFRev2,11.06,Fabrication de malt,4,11.0
NAFRev2,11.07,Industrie des eaux minérales et autres eaux embouteillées et des boissons rafraîchissantes,4,11.0
NAFRev2,12.00,Fabrication de produits à base de tabac,4,12.0
NAFRev2,13.10,Préparation de fibres textiles et filature,4,13.1
NAFRev2,13.20,Tissage,4,13.2
NAFRev2,13.30,Ennoblissement textile,4,13.3
NAFRev2,13.91,Fabrication d'étoffes à mailles,4,13.9
NAFRev2,13.92,"Fabrication d'articles textiles, sauf habillement",4,13.9
NAFRev2,13.93,Fabrication de tapis et moquettes,4,13.9
NAFRev2,13.94,"Fabrication de ficelles, cordes et filets",4,13.9
NAFRev2,13.95,"Fabrication de non-tissés, sauf habillement",4,13.9
NAFRev2,13.96,Fabrication d'autres textiles techniques et industriels,4,13.9
NAFRev2,13.99,Fabrication d'autres textiles n.c.a.,4,13.9
NAFRev2,14.11,Fabrication de vêtements en cuir,4,14.1
NAFRev2,14.12,Fabrication de vêtements de travail,4,14.1
NAFRev2,14.13,Fabrication de vêtements de dessus,4,14.1
NAFRev2,14.14,Fabrication de vêtements de dessous,4,14.1
NAFRev2,14.19,Fabrication d'autres vêtements et accessoires,4,14.1
NAFRev2,14.20,Fabrication d'articles en fourrure,4,14.2
NAFRev2,14.31,Fabrication d'articles chaussants à mailles,4,14.3
NAFRev2,14.39,Fabrication d'autres articles à mailles,4,14.3
NAFRev2,15.11,Apprêt et tannage des cuirs ; préparation et teinture des fourrures,4,15.1
NAFRev2,15.12,"Fabrication d'articles de voyage, de maroquinerie et de sellerie",4,15.1
NAFRev2,15.20,Fabrication de chaussures,4,15.2
NAFRev2,16.10,Sciage et rabotage du bois,4,16.1
NAFRev2,16.21,Fabrication de placage et de panneaux de bois,4,16.2
NAFRev2,16.22,Fabrication de parquets assemblés,4,16.2
NAFRev2,16.23,Fabrication de charpentes et d'autres menuiseries,4,16.2
NAFRev2,16.24,Fabrication d'emballages en bois,4,16.2
NAFRev2,16.29,"Fabrication d'objets divers en bois ; fabrication d'objets en liège, vannerie et sparterie",4,16.2
NAFRev2,17.11,Fabrication de pâte à papier,4,17.1
NAFRev2,17.12,Fabrication de papier et de carton,4,17.1
NAFRev2,17.21,Fabrication de papier et carton ondulés et d'emballages en papier ou en carton,4,17.2
NAFRev2,17.22,Fabrication d'articles en papier à usage sanitaire ou domestique,4,17.2
NAFRev2,17.23,Fabrication d'articles de papeterie,4,17.2
NAFRev2,17.24,Fabrication de papiers peints,4,17.2
NAFRev2,17.29,Fabrication d'autres articles en papier ou en carton,4,17.2
NAFRev2,18.11,Imprimerie de journaux,4,18.1
NAFRev2,18.12,Autre imprimerie (labeur),4,18.1
NAFRev2,18.13,Activités de pré-presse,4,18.1
NAFRev2,18.14,Reliure et activités connexes,4,18.1
NAFRev2,18.20,Reproduction d'enregistrements,4,18.2
NAFRev2,19.10,Cokéfaction,4,19.1
NAFRev2,19.20,Raffinage du pétrole,4,19.2
NAFRev2,20.11,Fabrication de gaz industriels,4,20.1
NAFRev2,20.12,Fabrication de colorants et de pigments,4,20.1
NAFRev2,20.13,Fabrication d'autres produits chimiques inorganiques de base,4,20.1
NAFRev2,20.14,Fabrication d'autres produits chimiques organiques de base,4,20.1
NAFRev2,20.15,Fabrication de produits azotés et d'engrais,4,20.1
NAFRev2,20.16,Fabrication de matières plastiques de base,4,20.1
NAFRev2,20.17,Fabrication de caoutchouc synthétique,4,20.1
NAFRev2,20.20,Fabrication de pesticides et d'autres produits agrochimiques,4,20.2
NAFRev2,20.30,"Fabrication de peintures, vernis, encres et mastics",4,20.3
NAFRev2,20.41,"Fabrication de savons, détergents et produits d'entretien",4,20.4
NAFRev2,20.42,Fabrication de parfums et de produits pour la toilette,4,20.4
NAFRev2,20.51,Fabrication de produits explosifs,4,20.5
NAFRev2,20.52,Fabrication de colles,4,20.5
NAFRev2,20.53,Fabrication d'huiles essentielles,4,20.5
NAFRev2,20.59,Fabrication d'autres produits chimiques n.c.a.,4,20.5
NAFRev2,20.60,Fabrication de fibres artificielles ou synthétiques,4,20.6
NAFRev2,21.10,Fabrication de produits pharmaceutiques de base,4,21.1
NAFRev2,21.20,Fabrication de préparations pharmaceutiques,4,21.2
NAFRev2,22.11,Fabrication et rechapage de pneumatiques,4,22.1
NAFRev2,22.19,Fabrication d'autres articles en caoutchouc,4,22.1
NAFRev2,22.21,"Fabrication de plaques, feuilles, tubes et profilés en matières plastiques",4,22.2
NAFRev2,22.22,Fabrication d'emballages en matières plastiques,4,22.2
NAFRev2,22.23,Fabrication d'éléments en matières plastiques pour la construction,4,22.2
NAFRev2,22.29,Fabrication d'autres articles en matières plastiques,4,22.2
NAFRev2,23.11,Fabrication de verre plat,4,23.1
NAFRev2,23.12,Façonnage et transformation du verre plat,4,23.1
NAFRev2,23.13,Fabrication de verre creux,4,23.1
NAFRev2,23.14,Fabrication de fibres de verre,4,23.1
NAFRev2,23.19,"Fabrication et façonnage d'autres articles en verre, y compris verre technique",4,23.1
NAFRev2,23.20,Fabrication de produits réfractaires,4,23.2
NAFRev2,23.31,Fabrication de carreaux en céramique,4,23.3
NAFRev2,23.32,"Fabrication de briques, tuiles et produits de construction, en terre cuite",4,23.3
NAFRev2,23.41,Fabrication d'articles céramiques à usage domestique ou ornemental,4,23.4
NAFRev2,23.42,Fabrication d'appareils sanitaires en céramique,4,23.4
NAFRev2,23.43,Fabrication d'isolateurs et pièces isolantes en céramique,4,23.4
NAFRev2,23.44,Fabrication d'autres produits céramiques à usage technique,4,23.4
NAFRev2,23.49,Fabrication d'autres produits céramiques,4,23.4
NAFRev2,23.51,Fabrication de ciment,4,23.5
NAFRev2,23.52,Fabrication de chaux et plâtre,4,23.5
NAFRev2,23.61,Fabrication d'éléments en béton pour la construction,4,23.6
NAFRev2,23.62,Fabrication d'éléments en plâtre pour la construction,4,23.6
NAFRev2,23.63,Fabrication de béton prêt à l'emploi,4,23.6
NAFRev2,23.64,Fabrication de mortiers et bétons secs,4,23.6
NAFRev2,23.65,Fabrication d'ouvrages en fibre-ciment,4,23.6
NAFRev2,23.69,"Fabrication d'autres ouvrages en béton, en ciment ou en plâtre",4,23.6
NAFRev2,23.70,"Taille, façonnage et finissage de pierres",4,23.7
NAFRev2,23.91,Fabrication de produits abrasifs,4,23.9
NAFRev2,23.99,Fabrication d'autres produits minéraux non métalliques n.c.a.,4,23.9
NAFRev2,24.10,Sidérurgie,4,24.1
NAFRev2,24.20,"Fabrication de tubes, tuyaux, profilés creux et accessoires correspondants en acier",4,24.2
NAFRev2,24.31,Étirage à froid de barres,4,24.3
NAFRev2,24.32,Laminage à froid de feuillards,4,24.3
NAFRev2,24.33,Profilage à froid par formage ou pliage,4,24.3
NAFRev2,24.34,Tréfilage à froid,4,24.3
NAFRev2,24.41,Production de métaux précieux,4,24.4
NAFRev2,24.42,Métallurgie de l'aluminium,4,24.4
NAFRev2,24.43,"Métallurgie du plomb, du zinc ou de l'étain",4,24.4
NAFRev2,24.44,Métallurgie du cuivre,4,24.4
NAFRev2,24.45,Métallurgie des autres métaux non ferreux,4,24.4
NAFRev2,24.46,Élaboration et transformation de matières nucléaires,4,24.4
NAFRev2,24.51,Fonderie de fonte,4,24.5
NAFRev2,24.52,Fonderie d'acier,4,24.5
NAFRev2,24.53,Fonderie de métaux légers,4,24.5
NAFRev2,24.54,Fonderie d'autres métaux non ferreux,4,24.5
NAFRev2,25.11,Fabrication de structures métalliques et de parties de structures,4,25.1
NAFRev2,25.12,Fabrication de portes et fenêtres en métal,4,25.1
NAFRev2,25.21,Fabrication de radiateurs et de chaudières pour le chauffage central,4,25.2
NAFRev2,25.29,"Fabrication d'autres réservoirs, citernes et conteneurs métalliques",4,25.2
NAFRev2,25.30,"Fabrication de générateurs de vapeur, à l'exception des chaudières pour le chauffage central",4,25.3
NAFRev2,25.40,Fabrication d'armes et de munitions,4,25.4
NAFRev2,25.50,"Forge, emboutissage, estampage ; métallurgie des poudres",4,25.5
NAFRev2,25.61,Traitement et revêtement des métaux,4,25.6
NAFRev2,25.62,Usinage,4,25.6
NAFRev2,25.71,Fabrication de coutellerie,4,25.7
NAFRev2,25.72,Fabrication de serrures et de ferrures,4,25.7
NAFRev2,25.73,Fabrication d'outillage,4,25.7
NAFRev2,25.91,Fabrication de fûts et emballages métalliques similaires,4,25.9
NAFRev2,25.92,Fabrication d'emballages métalliques légers,4,25.9
NAFRev2,25.93,"Fabrication d'articles en fils métalliques, de chaînes et de ressorts",4,25.9
NAFRev2,25.94,Fabrication de vis et de boulons,4,25.9
NAFRev2,25.99,Fabrication d'autres produits métalliques n.c.a.,4,25.9
NAFRev2,26.11,Fabrication de composants électroniques,4,26.1
NAFRev2,26.12,Fabrication de cartes électroniques assemblées,4,26.1
NAFRev2,26.20,Fabrication d'ordinateurs et d'équipements périphériques,4,26.2
NAFRev2,26.30,Fabrication d'équipements de communication,4,26.3
NAFRev2,26.40,Fabrication de produits électroniques grand public,4,26.4
NAFRev2,26.51,"Fabrication d'instruments et d'appareils de mesure, d'essai et de navigation",4,26.5
NAFRev2,26.52,Horlogerie,4,26.5
NAFRev2,26.60,"Fabrication d'équipements d'irradiation médicale, d'équipements électromédicaux et électrothérapeutiques",4,26.6
NAFRev2,26.70,Fabrication de matériels optique et photographique,4,26.7
NAFRev2,26.80,Fabrication de supports magnétiques et optiques,4,26.8
NAFRev2,27.11,"Fabrication de moteurs, génératrices et transformateurs électriques",4,27.1
NAFRev2,27.12,Fabrication de matériel de distribution et de commande électrique,4,27.1
NAFRev2,27.20,Fabrication de piles et d'accumulateurs électriques,4,27.2
NAFRev2,27.31,Fabrication de câbles de fibres optiques,4,27.3
NAFRev2,27.32,Fabrication d'autres fils et câbles électroniques ou électriques,4,27.3
NAFRev2,27.33,Fabrication de matériel d'installation électrique,4,27.3
NAFRev2,27.40,Fabrication d'appareils d'éclairage électrique,4,27.4
NAFRev2,27.51,Fabrication d'appareils électroménagers,4,27.5
NAFRev2,27.52,Fabrication d'appareils ménagers non électriques,4,27.5
NAFRev2,27.90,Fabrication d'autres matériels électriques,4,27.9
NAFRev2,28.11,"Fabrication de moteurs et turbines, à l'exception des moteurs d'avions et de véhicules",4,28.1
NAFRev2,28.12,Fabrication d'équipements hydrauliques et pneumatiques,4,28.1
NAFRev2,28.13,Fabrication d'autres pompes et compresseurs,4,28.1
NAFRev2,28.14,Fabrication d'autres articles de robinetterie,4,28.1
NAFRev2,28.15,Fabrication d'engrenages et d'organes mécaniques de transmission,4,28.1
NAFRev2,28.21,Fabrication de fours et brûleurs,4,28.2
NAFRev2,28.22,Fabrication de matériel de levage et de manutention,4,28.2
NAFRev2,28.23,Fabrication de machines et d'équipements de bureau (à l'exception des ordinateurs et équipements périphériques),4,28.2
NAFRev2,28.24,Fabrication d'outillage portatif à moteur incorporé,4,28.2
NAFRev2,28.25,Fabrication d'équipements aérauliques et frigorifiques industriels,4,28.2
NAFRev2,28.29,Fabrication de machines diverses d'usage général,4,28.2
NAFRev2,28.30,Fabrication de machines agricoles et forestières,4,28.3
NAFRev2,28.41,Fabrication de machines de formage des métaux,4,28.4
NAFRev2,28.49,Fabrication d'autres machines-outils,4,28.4
NAFRev2,28.91,Fabrication de machines pour la métallurgie,4,28.9
NAFRev2,28.92,Fabrication de machines pour l'extraction ou la construction,4,28.9
NAFRev2,28.93,Fabrication de machines pour l'industrie agro-alimentaire,4,28.9
NAFRev2,28.94,Fabrication de machines pour les industries textiles,4,28.9
NAFRev2,28.95,Fabrication de machines pour les industries du papier et du carton,4,28.9
NAFRev2,28.96,Fabrication de machines pour le travail du caoutchouc ou des plastiques,4,28.9
NAFRev2,28.99,Fabrication d'autres machines d'usage spécifique n.c.a.,4,28.9
NAFRev2,29.10,Construction de véhicules automobiles,4,29.1
NAFRev2,29.20,Fabrication de carrosseries et remorques,4,29.2
NAFRev2,29.31,Fabrication d'équipements électriques et électroniques automobiles,4,29.3
NAFRev2,29.32,Fabrication d'autres équipements automobiles,4,29.3
NAFRev2,30.11,Construction de navires et de structures flottantes,4,30.1
NAFRev2,30.12,Construction de bateaux de plaisance,4,30.1
NAFRev2,30.20,Construction de locomotives et d'autre matériel ferroviaire roulant,4,30.2
NAFRev2,30.30,Construction aéronautique et spatiale,4,30.3
NAFRev2,30.40,Construction de véhicules militaires de combat,4,30.4
NAFRev2,30.91,Fabrication de motocycles,4,30.9
NAFRev2,30.92,Fabrication de bicyclettes et de véhicules pour invalides,4,30.9
NAFRev2,30.99,Fabrication d'autres équipements de transport n.c.a.,4,30.9
NAFRev2,31.01,Fabrication de meubles de bureau et de magasin,4,31.0
NAFRev2,31.02,Fabrication de meubles de cuisine,4,31.0
NAFRev2,31.03,Fabrication de matelas,4,31.0
NAFRev2,31.09,Fabrication d'autres meubles,4,31.0
NAFRev2,32.11,Frappe de monnaie,4,32.1
NAFRev2,32.12,Fabrication d'articles de joaillerie et bijouterie,4,32.1
NAFRev2,32.13,Fabrication d'articles de bijouterie fantaisie et articles similaires,4,32.1
NAFRev2,32.20,Fabrication d'instruments de musique,4,32.2
NAFRev2,32.30,Fabrication d'articles de sport,4,32.3
NAFRev2,32.40,Fabrication de jeux et jouets,4,32.4
NAFRev2,32.50,Fabrication d'instruments et de fournitures à usage médical et dentaire,4,32.5
NAFRev2,32.91,Fabrication d'articles de brosserie,4,32.9
NAFRev2,32.99,Autres activités manufacturières n.c.a.,4,32.9
NAFRev2,33.11,Réparation d'ouvrages en métaux,4,33.1
NAFRev2,33.12,Réparation de machines et équipements mécaniques,4,33.1
NAFRev2,33.13,Réparation de matériels électroniques et optiques,4,33.1
NAFRev2,33.14,Réparation d'équipements électriques,4,33.1
NAFRev2,33.15,Réparation et maintenance navale,4,33.1
NAFRev2,33.16,Réparation et maintenance d'aéronefs et d'engins spatiaux,4,33.1
NAFRev2,33.17,Réparation et maintenance d'autres équipements de transport,4,33.1
NAFRev2,33.19,Réparation d'autres équipements,4,33.1
NAFRev2,33.20,Installation de machines et d'équipements industriels,4,33.2
NAFRev2,35.11,Production d'électricité,4,35.1
NAFRev2,35.12,Transport d'électricité,4,35.1
NAFRev2,35.13,Distribution d'électricité,4,35.1
NAFRev2,35.14,Commerce d'électricité,4,35.1
NAFRev2,35.21,Production de combustibles gazeux,4,35.2
NAFRev2,35.22,Distribution de combustibles gazeux par conduites,4,35.2
NAFRev2,35.23,Commerce de combustibles gazeux par conduites,4,35.2
NAFRev2,35.30,Production et distribution de vapeur et d'air conditionné,4,35.3
NAFRev2,36.00,"Captage, traitement et distribution d'eau",4,36.0
NAFRev2,37.00,Collecte et traitement des eaux usées,4,37.0
NAFRev2,38.11,Collecte des déchets non dangereux,4,38.1
NAFRev2,38.12,Collecte des déchets dangereux,4,38.1
NAFRev2,38.21,Traitement et élimination des déchets non dangereux,4,38.2
NAFRev2,38.22,Traitement et élimination des déchets dangereux,4,38.2
NAFRev2,38.31,Démantèlement d'épaves,4,38.3
NAFRev2,38.32,Récupération de déchets triés,4,38.3
NAFRev2,39.00,Dépollution et autres services de gestion des déchets,4,39.0
NAFRev2,41.10,Promotion immobilière,4,41.1
NAFRev2,41.20,Construction de bâtiments résidentiels et non résidentiels,4,41.2
NAFRev2,42.11,Construction de routes et autoroutes,4,42.1
NAFRev2,42.12,Construction de voies ferrées de surface et souterraines,4,42.1
NAFRev2,42.13,Construction de ponts et tunnels,4,42.1
NAFRev2,42.21,Construction de réseaux pour fluides,4,42.2
NAFRev2,42.22,Construction de réseaux électriques et de télécommunications,4,42.2
NAFRev2,42.91,Construction d'ouvrages maritimes et fluviaux,4,42.9
NAFRev2,42.99,Construction d'autres ouvrages de génie civil n.c.a.,4,42.9
NAFRev2,43.11,Travaux de démolition,4,43.1
NAFRev2,43.12,Travaux de préparation des sites,4,43.1
NAFRev2,43.13,Forages et sondages,4,43.1
NAFRev2,43.21,Installation électrique,4,43.2
NAFRev2,43.22,Travaux de plomberie et installation de chauffage et de conditionnement d'air,4,43.2
NAFRev2,43.29,Autres travaux d'installation,4,43.2
NAFRev2,43.31,Travaux de plâtrerie,4,43.3
NAFRev2,43.32,Travaux de menuiserie,4,43.3
NAFRev2,43.33,Travaux de revêtement des sols et des murs,4,43.3
NAFRev2,43.34,Travaux de peinture et vitrerie,4,43.3
NAFRev2,43.39,Autres travaux de finition,4,43.3
NAFRev2,43.91,Travaux de couverture,4,43.9
NAFRev2,43.99,Autres travaux de construction spécialisés n.c.a.,4,43.9
NAFRev2,45.11,Commerce de voitures et de véhicules automobiles légers,4,45.1
NAFRev2,45.19,Commerce d'autres véhicules automobiles,4,45.1
NAFRev2,45.20,Entretien et réparation de véhicules automobiles,4,45.2
NAFRev2,45.31,Commerce de gros d'équipements automobiles,4,45.3
NAFRev2,45.32,Commerce de détail d'équipements automobiles,4,45.3
NAFRev2,45.40,Commerce et réparation de motocycles,4,45.4
NAFRev2,46.11,"Intermédiaires du commerce en matières premières agricoles, animaux vivants, matières premières textiles et produits semi-finis",4,46.1
NAFRev2,46.12,"Intermédiaires du commerce en combustibles, métaux, minéraux et produits chimiques",4,46.1
NAFRev2,46.13,Intermédiaires du commerce en bois et matériaux de construction,4,46.1
NAFRev2,46.14,"Intermédiaires du commerce en machines, équipements industriels, navires et avions",4,46.1
NAFRev2,46.15,"Intermédiaires du commerce en meubles, articles de ménage et quincaillerie",4,46.1
NAFRev2,46.16,"Intermédiaires du commerce en textiles, habillement, fourrures, chaussures et articles en cuir",4,46.1
NAFRev2,46.17,"Intermédiaires du commerce en denrées, boissons et tabac",4,46.1
NAFRev2,46.18,Intermédiaires spécialisés dans le commerce d'autres produits spécifiques,4,46.1
NAFRev2,46.19,Intermédiaires du commerce en produits divers,4,46.1
NAFRev2,46.21,"Commerce de gros de céréales, de tabac non manufacturé, de semences et d'aliments pour le bétail",4,46.2
NAFRev2,46.22,Commerce de gros de fleurs et plantes,4,46.2
NAFRev2,46.23,Commerce de gros d'animaux vivants,4,46.2
NAFRev2,46.24,Commerce de gros de cuirs et peaux,4,46.2
NAFRev2,46.31,Commerce de gros de fruits et légumes,4,46.3
NAFRev2,46.32,Commerce de gros de viandes et de produits à base de viande,4,46.3
NAFRev2,46.33,"Commerce de gros de produits laitiers, œufs, huiles et matières grasses comestibles",4,46.3
NAFRev2,46.34,Commerce de gros de boissons,4,46.3
NAFRev2,46.35,Commerce de gros de produits à base de tabac,4,46.3
NAFRev2,46.36,"Commerce de gros de sucre, chocolat et confiserie",4,46.3
NAFRev2,46.37,"Commerce de gros de café, thé, cacao et épices",4,46.3
NAFRev2,46.38,"Commerce de gros d'autres produits alimentaires, y compris poissons, crustacés et mollusques",4,46.3
NAFRev2,46.39,"Commerce de gros non spécialisé de denrées, boissons et tabac",4,46.3
NAFRev2,46.41,Commerce de gros de textiles,4,46.4
NAFRev2,46.42,Commerce de gros d'habillement et de chaussures,4,46.4
NAFRev2,46.43,Commerce de gros d'appareils électroménagers,4,46.4
NAFRev2,46.44,"Commerce de gros de vaisselle, verrerie et produits d'entretien",4,46.4
NAFRev2,46.45,Commerce de gros de parfumerie et de produits de beauté,4,46.4
NAFRev2,46.46,Commerce de gros de produits pharmaceutiques,4,46.4
NAFRev2,46.47,"Commerce de gros de meubles, de tapis et d'appareils d'éclairage",4,46.4
NAFRev2,46.48,Commerce de gros d'articles d'horlogerie et de bijouterie,4,46.4
NAFRev2,46.49,Commerce de gros d'autres biens domestiques,4,46.4
NAFRev2,46.51,"Commerce de gros d'ordinateurs, d'équipements informatiques périphériques et de logiciels",4,46.5
NAFRev2,46.52,Commerce de gros de composants et d'équipements électroniques et de télécommunication,4,46.5
NAFRev2,46.61,Commerce de gros de matériel agricole,4,46.6
NAFRev2,46.62,Commerce de gros de machines-outils,4,46.6
NAFRev2,46.63,"Commerce de gros de machines pour l'extraction, la construction et le génie civil",4,46.6
NAFRev2,46.64,Commerce de gros de machines pour l'industrie textile et l'habillement,4,46.6
NAFRev2,46.65,Commerce de gros de mobilier de bureau,4,46.6
NAFRev2,46.66,Commerce de gros d'autres machines et équipements de bureau,4,46.6
NAFRev2,46.69,Commerce de gros d'autres machines et équipements,4,46.6
NAFRev2,46.71,Commerce de gros de combustibles et de produits annexes,4,46.7
NAFRev2,46.72,Commerce de gros de minerais et métaux,4,46.7
NAFRev2,46.73,"Commerce de gros de bois, de matériaux de construction et d'appareils sanitaires",4,46.7
NAFRev2,46.74,Commerce de gros de quincaillerie et fournitures pour plomberie et chauffage,4,46.7
NAFRev2,46.75,Commerce de gros de produits chimiques,4,46.7
NAFRev2,46.76,Commerce de gros d'autres produits intermédiaires,4,46.7
NAFRev2,46.77,Commerce de gros de déchets et débris,4,46.7
NAFRev2,46.90,Commerce de gros non spécialisé,4,46.9
NAFRev2,47.11,Commerce de détail en magasin non spécialisé à prédominance alimentaire,4,47.1
NAFRev2,47.19,Autre commerce de détail en magasin non spécialisé,4,47.1
NAFRev2,47.21,Commerce de détail de fruits et légumes en magasin spécialisé,4,47.2
NAFRev2,47.22,Commerce de détail de viandes et de produits à base de viande en magasin spécialisé,4,47.2
NAFRev2,47.23,"Commerce de détail de poissons, crustacés et mollusques en magasin spécialisé",4,47.2
NAFRev2,47.24,"Commerce de détail de pain, pâtisserie et confiserie en magasin spécialisé",4,47.2
NAFRev2,47.25,Commerce de détail de boissons en magasin spécialisé,4,47.2
NAFRev2,47.26,Commerce de détail de produits à base de tabac en magasin spécialisé,4,47.2
NAFRev2,47.29,Autres commerces de détail alimentaires en magasin spécialisé,4,47.2
NAFRev2,47.30,Commerce de détail de carburants en magasin spécialisé,4,47.3
NAFRev2,47.41,"Commerce de détail d'ordinateurs, d'unités périphériques et de logiciels en magasin spécialisé",4,47.4
NAFRev2,47.42,Commerce de détail de matériels de télécommunication en magasin spécialisé,4,47.4
NAFRev2,47.43,Commerce de détail de matériels audio/vidéo en magasin spécialisé,4,47.4
NAFRev2,47.51,Commerce de détail de textiles en magasin spécialisé,4,47.5
NAFRev2,47.52,"Commerce de détail de quincaillerie, peintures et verres en magasin spécialisé",4,47.5
NAFRev2,47.53,"Commerce de détail de tapis, moquettes et revêtements de murs et de sols en magasin spécialisé",4,47.5
NAFRev2,47.54,Commerce de détail d'appareils électroménagers en magasin spécialisé,4,47.5
NAFRev2,47.59,"Commerce de détail de meubles, appareils d'éclairage et autres articles de ménage en magasin spécialisé",4,47.5
NAFRev2,47.61,Commerce de détail de livres en magasin spécialisé,4,47.6
NAFRev2,47.62,Commerce de détail de journaux et papeterie en magasin spécialisé,4,47.6
NAFRev2,47.63,Commerce de détail d'enregistrements musicaux et vidéo en magasin spécialisé,4,47.6
NAFRev2,47.64,Commerce de détail d'articles de sport en magasin spécialisé,4,47.6
NAFRev2,47.65,Commerce de détail de jeux et jouets en magasin spécialisé,4,47.6
NAFRev2,47.71,Commerce de détail d'habillement en magasin spécialisé,4,47.7
NAFRev2,47.72,Commerce de détail de chaussures et d'articles en cuir en magasin spécialisé,4,47.7
NAFRev2,47.73,Commerce de détail de produits pharmaceutiques en magasin spécialisé,4,47.7
NAFRev2,47.74,Commerce de détail d'articles médicaux et orthopédiques en magasin spécialisé,4,47.7
NAFRev2,47.75,Commerce de détail de parfumerie et de produits de beauté en magasin spécialisé,4,47.7
NAFRev2,47.76,"Commerce de détail de fleurs, plantes, graines, engrais, animaux de compagnie et aliments pour ces animaux en magasin spécialisé",4,47.7
NAFRev2,47.77,Commerce de détail d'articles d'horlogerie et de bijouterie en magasin spécialisé,4,47.7
NAFRev2,47.78,Autre commerce de détail de biens neufs en magasin spécialisé,4,47.7
NAFRev2,47.79,Commerce de détail de biens d'occasion en magasin,4,47.7
NAFRev2,47.81,Commerce de détail alimentaire sur éventaires et marchés,4,47.8
NAFRev2,47.82,"Commerce de détail de textiles, d'habillement et de chaussures sur éventaires et marchés",4,47.8
NAFRev2,47.89,Autres commerces de détail sur éventaires et marchés,4,47.8
NAFRev2,47.91,Vente à distance,4,47.9
NAFRev2,47.99,"Autres commerces de détail hors magasin, éventaires ou marchés",4,47.9
NAFRev2,49.10,Transport ferroviaire interurbain de voyageurs,4,49.1
NAFRev2,49.20,Transports ferroviaires de fret,4,49.2
NAFRev2,49.31,Transports urbains et suburbains de voyageurs,4,49.3
NAFRev2,49.32,Transports de voyageurs par taxis,4,49.3
NAFRev2,49.39,Autres transports terrestres de voyageurs n.c.a.,4,49.3
NAFRev2,49.41,Transports routiers de fret,4,49.4
NAFRev2,49.42,Services de déménagement,4,49.4
NAFRev2,49.50,Transports par conduites,4,49.5
NAFRev2,50.10,Transports maritimes et côtiers de passagers,4,50.1
NAFRev2,50.20,Transports maritimes et côtiers de fret,4,50.2
NAFRev2,50.30,Transports fluviaux de passagers,4,50.3
NAFRev2,50.40,Transports fluviaux de fret,4,50.4
NAFRev2,51.10,Transports aériens de passagers,4,51.1
NAFRev2,51.21,Transports aériens de fret,4,51.2
NAFRev2,51.22,Transports spatiaux,4,51.2
NAFRev2,52.10,Entreposage et stockage,4,52.1
NAFRev2,52.21,Services auxiliaires des transports terrestres,4,52.2
NAFRev2,52.22,Services auxiliaires des transports par eau,4,52.2
NAFRev2,52.23,Services auxiliaires des transports aériens,4,52.2
NAFRev2,52.24,Manutention,4,52.2
NAFRev2,52.29,Autres services auxiliaires des transports,4,52.2
NAFRev2,53.10,Activités de poste dans le cadre d'une obligation de service universel,4,53.1
NAFRev2,53.20,Autres activités de poste et de courrier,4,53.2
NAFRev2,55.10,Hôtels et hébergement similaire,4,55.1
NAFRev2,55.20,Hébergement touristique et autre hébergement de courte durée,4,55.2
NAFRev2,55.30,Terrains de camping et parcs pour caravanes ou véhicules de loisirs,4,55.3
NAFRev2,55.90,Autres hébergements,4,55.9
NAFRev2,56.10,Restaurants et services de restauration mobile,4,56.1
NAFRev2,56.21,Services des traiteurs,4,56.2
NAFRev2,56.29,Autres services de restauration,4,56.2
NAFRev2,56.30,Débits de boissons,4,56.3
NAFRev2,58.11,Édition de livres,4,58.1
NAFRev2,58.12,Édition de répertoires et de fichiers d'adresses,4,58.1
NAFRev2,58.13,Édition de journaux,4,58.1
NAFRev2,58.14,Édition de revues et périodiques,4,58.1
NAFRev2,58.19,Autres activités d'édition,4,58.1
NAFRev2,58.21,Édition de jeux électroniques,4,58.2
NAFRev2,58.29,Édition d'autres logiciels,4,58.2
NAFRev2,59.11,"Production de films cinématographiques, de vidéo et de programmes de télévision",4,59.1
NAFRev2,59.12,"Post-production de films cinématographiques, de vidéo et de programmes de télévision",4,59.1
NAFRev2,59.13,"Distribution de films cinématographiques, de vidéo et de programmes de télévision",4,59.1
NAFRev2,59.14,Projection de films cinématographiques,4,59.1
NAFRev2,59.20,Enregistrement sonore et édition musicale,4,59.2
NAFRev2,60.10,Édition et diffusion de programmes radio,4,60.1
NAFRev2,60.20,Programmation de télévision et télédiffusion,4,60.2
NAFRev2,61.10,Télécommunications filaires,4,61.1
NAFRev2,61.20,Télécommunications sans fil,4,61.2
NAFRev2,61.30,Télécommunications par satellite,4,61.3
NAFRev2,61.90,Autres activités de télécommunication,4,61.9
NAFRev2,62.01,Programmation informatique,4,62.0
NAFRev2,62.02,Conseil informatique,4,62.0
NAFRev2,62.03,Gestion d'installations informatiques,4,62.0
NAFRev2,62.09,Autres activités informatiques,4,62.0
NAFRev2,63.11,"Traitement de données, hébergement et activités connexes",4,63.1
NAFRev2,63.12,Portails Internet,4,63.1
NAFRev2,63.91,Activités des agences de presse,4,63.9
NAFRev2,63.99,Autres services d'information n.c.a.,4,63.9
NAFRev2,64.11,Activités de banque centrale,4,64.1
NAFRev2,64.19,Autres intermédiations monétaires,4,64.1
NAFRev2,64.20,Activités des sociétés holding,4,64.2
NAFRev2,64.30,Fonds de placement et entités financières similaires,4,64.3
NAFRev2,64.91,Crédit-bail,4,64.9
NAFRev2,64.92,Autre distribution de crédit,4,64.9
NAFRev2,64.99,"Autres activités des services financiers, hors assurance et caisses de retraite, n.c.a.",4,64.9
NAFRev2,65.11,Assurance vie,4,65.1
NAFRev2,65.12,Autres assurances,4,65.1
NAFRev2,65.20,Réassurance,4,65.2
NAFRev2,65.30,Caisses de retraite,4,65.3
NAFRev2,66.11,Administration de marchés financiers,4,66.1
NAFRev2,66.12,Courtage de valeurs mobilières et de marchandises,4,66.1
NAFRev2,66.19,"Autres activités auxiliaires de services financiers, hors assurance et caisses de retraite",4,66.1
NAFRev2,66.21,Évaluation des risques et dommages,4,66.2
NAFRev2,66.22,Activités des agents et courtiers d'assurances,4,66.2
NAFRev2,66.29,Autres activités auxiliaires d'assurance et de caisses de retraite,4,66.2
NAFRev2,66.30,Gestion de fonds,4,66.3
NAFRev2,68.10,Activités des marchands de biens immobiliers,4,68.1
NAFRev2,68.20,Location et exploitation de biens immobiliers propres ou loués,4,68.2
NAFRev2,68.31,Agences immobilières,4,68.3
NAFRev2,68.32,Administration de biens immobiliers,4,68.3
NAFRev2,69.10,Activités juridiques,4,69.1
NAFRev2,69.20,Activités comptables,4,69.2
NAFRev2,70.10,Activités des sièges sociaux,4,70.1
NAFRev2,70.21,Conseil en relations publiques et communication,4,70.2
NAFRev2,70.22,Conseil pour les affaires et autres conseils de gestion,4,70.2
NAFRev2,71.11,Activités d'architecture,4,71.1
NAFRev2,71.12,Activités d'ingénierie,4,71.1
NAFRev2,71.20,Activités de contrôle et analyses techniques,4,71.2
NAFRev2,72.11,Recherche-développement en biotechnologie,4,72.1
NAFRev2,72.19,Recherche-développement en autres sciences physiques et naturelles,4,72.1
NAFRev2,72.20,Recherche-développement en sciences humaines et sociales,4,72.2
NAFRev2,73.11,Activités des agences de publicité,4,73.1
NAFRev2,73.12,Régie publicitaire de médias,4,73.1
NAFRev2,73.20,Études de marché et sondages,4,73.2
NAFRev2,74.10,Activités spécialisées de design,4,74.1
NAFRev2,74.20,Activités photographiques,4,74.2
NAFRev2,74.30,Traduction et interprétation,4,74.3
NAFRev2,74.90,"Autres activités spécialisées, scientifiques et techniques n.c.a.",4,74.9
NAFRev2,75.00,Activités vétérinaires,4,75.0
NAFRev2,77.11,Location et location-bail de voitures et de véhicules automobiles légers,4,77.1
NAFRev2,77.12,Location et location-bail de camions,4,77.1
NAFRev2,77.21,Location et location-bail d'articles de loisirs et de sport,4,77.2
NAFRev2,77.22,Location de vidéocassettes et disques vidéo,4,77.2
NAFRev2,77.29,Location et location-bail d'autres biens personnels et domestiques,4,77.2
NAFRev2,77.31,Location et location-bail de machines et équipements agricoles,4,77.3
NAFRev2,77.32,Location et location-bail de machines et équipements pour la construction,4,77.3
NAFRev2,77.33,Location et location-bail de machines de bureau et de matériel informatique,4,77.3
NAFRev2,77.34,Location et location-bail de matériels de transport par eau,4,77.3
NAFRev2,77.35,Location et location-bail de matériels de transport aérien,4,77.3
NAFRev2,77.39,"Location et location-bail d'autres machines, équipements et biens matériels n.c.a.",4,77.3
NAFRev2,77.40,"Location-bail de propriété intellectuelle et de produits similaires, à l'exception des œuvres soumises à copyright",4,77.4
NAFRev2,78.10,Activités des agences de placement de main-d'œuvre,4,78.1
NAFRev2,78.20,Activités des agences de travail temporaire,4,78.2
NAFRev2,78.30,Autre mise à disposition de ressources humaines,4,78.3
NAFRev2,79.11,Activités des agences de voyage,4,79.1
NAFRev2,79.12,Activités des voyagistes,4,79.1
NAFRev2,79.90,Autres services de réservation et activités connexes,4,79.9
NAFRev2,80.10,Activités de sécurité privée,4,80.1
NAFRev2,80.20,Activités liées aux systèmes de sécurité,4,80.2
NAFRev2,80.30,Activités d'enquête,4,80.3
NAFRev2,81.10,Activités combinées de soutien lié aux bâtiments,4,81.1
NAFRev2,81.21,Nettoyage courant des bâtiments,4,81.2
NAFRev2,81.22,Autres activités de nettoyage des bâtiments et nettoyage industriel,4,81.2
NAFRev2,81.29,Autres activités de nettoyage,4,81.2
NAFRev2,81.30,Services d'aménagement paysager,4,81.3
NAFRev2,82.11,Services administratifs combinés de bureau,4,82.1
NAFRev2,82.19,"Photocopie, préparation de documents et autres activités spécialisées de soutien de bureau",4,82.1
NAFRev2,82.20,Activités de centres d'appels,4,82.2
NAFRev2,82.30,Organisation de salons professionnels et congrès,4,82.3
NAFRev2,82.91,Activités des agences de recouvrement de factures et des sociétés d'information financière sur la clientèle,4,82.9
NAFRev2,82.92,Activités de conditionnement,4,82.9
NAFRev2,82.99,Autres activités de soutien aux entreprises n.c.a.,4,82.9
NAFRev2,84.11,Administration publique générale,4,84.1
NAFRev2,84.12,"Administration publique (tutelle) de la santé, de la formation, de la culture et des services sociaux, autre que sécurité sociale",4,84.1
NAFRev2,84.13,Administration publique (tutelle) des activités économiques,4,84.1
NAFRev2,84.21,Affaires étrangères,4,84.2
NAFRev2,84.22,Défense,4,84.2
NAFRev2,84.23,Justice,4,84.2
NAFRev2,84.24,Activités d'ordre public et de sécurité,4,84.2
NAFRev2,84.25,Services du feu et de secours,4,84.2
NAFRev2,84.30,Sécurité sociale obligatoire,4,84.3
NAFRev2,85.10,Enseignement pré-primaire,4,85.1
NAFRev2,85.20,Enseignement primaire,4,85.2
NAFRev2,85.31,Enseignement secondaire général,4,85.3
NAFRev2,85.32,Enseignement secondaire technique ou professionnel,4,85.3
NAFRev2,85.41,Enseignement post-secondaire non supérieur,4,85.4
NAFRev2,85.42,Enseignement supérieur,4,85.4
NAFRev2,85.51,Enseignement de disciplines sportives et d'activités de loisirs,4,85.5
NAFRev2,85.52,Enseignement culturel,4,85.5
NAFRev2,85.53,Enseignement de la conduite,4,85.5
NAFRev2,85.59,Enseignements divers,4,85.5
NAFRev2,85.60,Activités de soutien à l'enseignement,4,85.6
NAFRev2,86.10,Activités hospitalières,4,86.1
NAFRev2,86.21,Activité des médecins généralistes,4,86.2
NAFRev2,86.22,Activité des médecins spécialistes,4,86.2
NAFRev2,86.23,Pratique dentaire,4,86.2
NAFRev2,86.90,Autres activités pour la santé humaine,4,86.9
NAFRev2,87.10,Hébergement médicalisé,4,87.1
NAFRev2,87.20,"Hébergement social pour personnes handicapées mentales, malades mentales et toxicomanes",4,87.2
NAFRev2,87.30,Hébergement social pour personnes âgées ou handicapées physiques,4,87.3
NAFRev2,87.90,Autres activités d'hébergement social,4,87.9
NAFRev2,88.10,Action sociale sans hébergement pour personnes âgées et pour personnes handicapées,4,88.1
NAFRev2,88.91,Action sociale sans hébergement pour jeunes enfants,4,88.9
NAFRev2,88.99,Autre action sociale sans hébergement n.c.a.,4,88.9
NAFRev2,90.01,Arts du spectacle vivant,4,90.0
NAFRev2,90.02,Activités de soutien au spectacle vivant,4,90.0
NAFRev2,90.03,Création artistique,4,90.0
NAFRev2,90.04,Gestion de salles de spectacles,4,90.0
NAFRev2,91.01,Gestion des bibliothèques et des archives,4,91.0
NAFRev2,91.02,Gestion des musées,4,91.0
NAFRev2,91.03,Gestion des sites et monuments historiques et des attractions touristiques similaires,4,91.0
NAFRev2,91.04,Gestion des jardins botaniques et zoologiques et des réserves naturelles,4,91.0
NAFRev2,92.00,Organisation de jeux de hasard et d'argent,4,92.0
NAFRev2,93.11,Gestion d'installations sportives,4,93.1
NAFRev2,93.12,Activités de clubs de sports,4,93.1
NAFRev2,93.13,Activités des centres de culture physique,4,93.1
NAFRev2,93.19,Autres activités liées au sport,4,93.1
NAFRev2,93.21,Activités des parcs d'attractions et parcs à thèmes,4,93.2
NAFRev2,93.29,Autres activités récréatives et de loisirs,4,93.2
NAFRev2,94.11,Activités des organisations patronales et consulaires,4,94.1
NAFRev2,94.12,Activités des organisations professionnelles,4,94.1
NAFRev2,94.20,Activités des syndicats de salariés,4,94.2
NAFRev2,94.91,Activités des organisations religieuses,4,94.9
NAFRev2,94.92,Activités des organisations politiques,4,94.9
NAFRev2,94.99,Activités des organisations associatives n.c.a.,4,94.9
NAFRev2,95.11,Réparation d'ordinateurs et d'équipements périphériques,4,95.1
NAFRev2,95.12,Réparation d'équipements de communication,4,95.1
NAFRev2,95.21,Réparation de produits électroniques grand public,4,95.2
NAFRev2,95.22,Réparation d'appareils électroménagers et d'équipements pour la maison et le jardin,4,95.2
NAFRev2,95.23,Réparation de chaussures et d'articles en cuir,4,95.2
NAFRev2,95.24,Réparation de meubles et d'équipements du foyer,4,95.2
NAFRev2,95.25,Réparation d'articles d'horlogerie et de bijouterie,4,95.2
NAFRev2,95.29,Réparation d'autres biens personnels et domestiques,4,95.2
NAFRev2,96.01,Blanchisserie-teinturerie,4,96.0
NAFRev2,96.02,Coiffure et soins de beauté,4,96.0
NAFRev2,96.03,Services funéraires,4,96.0
NAFRev2,96.04,Entretien corporel,4,96.0
NAFRev2,96.09,Autres services personnels n.c.a.,4,96.0
NAFRev2,97.00,Activités des ménages en tant qu'employeurs de personnel domestique,4,97.0
NAFRev2,98.10,Activités indifférenciées des ménages en tant que producteurs de biens pour usage propre,4,98.1
NAFRev2,98.20,Activités indifférenciées des ménages en tant que producteurs de services pour usage propre,4,98.2
NAFRev2,99.00,Activités des organisations et organismes extraterritoriaux,4,99.0
