id,creation_date,effectif_annee,effectif_type_id,entreprise_type_id,diffusible,categorie_entreprise_type_id,categorie_entreprise_annee,unite_purgee,nom
947854030,2023-01-02,,,P,t,,,,MOUSSA BENABBOU
948492061,2023-01-01,,,P,t,,,,DANIA SAOUD
947996641,2023-01-10,,,P,t,,,,SYLVAIN RAYMOND
922763438,2023-01-05,,,P,t,,,,WILLEM BIQUE
919983718,2022-09-29,,,M,t,,,,BERTO
947726824,2022-12-19,,,P,t,,,,ULRICH BOUDZOUMOU
884564311,2020-06-20,,,P,t,PME,2020,,AMINE BOUAZZA
921661328,2022-11-18,,,M,t,,,,STUDIO MAD
882456247,2020-02-24,,,P,t,PME,2020,,HICHEM SMAANI
913102406,2022-03-01,,,P,t,,,,BENJAMIN TARAU
948439807,2023-01-07,,,P,t,,,,ANTOINE BONNOT
922725205,2023-01-03,,,P,t,,,,SIRINE FARES
947788758,2023-01-01,,,P,t,,,,BLXCKSON SMITH BLACKSON
948360607,2023-01-15,,,P,t,,,,LIUDMILA CERNEI
948313325,2023-01-19,,,M,t,,,,SURIN
948268370,2023-01-20,,,M,t,,,,PERSISTY
948046073,2023-01-11,,,M,t,,,,SCI DES GLYCINES
920083839,2022-09-19,,,M,t,,,,ATHENA
948491022,2023-01-01,,,P,t,,,,MARINE PELTIER
922880000,2023-01-21,,,P,t,,,,MOUSSA DIOMANDE
269200408,1982-01-01,2020,21,M,t,PME,2020,,CCAS CENTRE COMMUNAL D'ACTION SOCIALE
948376207,2023-01-04,,,M,t,,,,MY LUXURY SERVICE
947912044,2022-12-28,,,P,t,,,,ABDELOUAHAB GORMI
889846994,2020-10-01,,,M,t,PME,2020,,EULYS SERVICES
948330402,2023-01-23,,,M,t,,,,LE GRANGU
343518767,1987-12-01,2020,02,M,t,PME,2020,,ALFORT'VOYAGES
404968521,1996-04-25,,NN,M,t,PME,2020,,LE PETIT DELICE
948396791,2023-02-01,,,M,t,,,,INNOVAI TEK
918483439,2022-08-10,,,M,t,,,,SAS TPMV
947891339,2023-01-05,,,P,t,,,,BASMA M'BAREK
948401740,2023-01-09,,,P,t,,,,EDWARD DE BLOCQUEL DE CROIX DE WISMES
411331770,1997-01-23,,NN,P,t,,,,CHARLES KOEHRER
948013743,2023-01-09,,,P,t,,,,MARIANNA WITTWER
947881058,2023-01-01,,,M,t,,,,PILUX SCI PILUX SCI
922633524,2022-12-22,,,P,t,,,,ANTHONY PETIT
947942090,2023-01-05,,,M,t,,,,PASSIV'BAT PASSIV'BAT
947853750,2023-01-01,,,M,t,,,,SARL DAK TM
948518576,2023-02-01,,,P,t,,,,NADINE BIKOMO MONTEIL
330337775,1984-05-15,,NN,M,t,,,,COMPAGNIE FINANCIERE DU FUTUR
948240627,2022-12-01,,,P,t,,,,SAMIRA BAKHABBAJ
922932132,2023-01-30,,,P,t,,,,ABDULLAH HAIDARI
948007794,2023-01-06,,,P,t,,,,MOHAMED MOUL ERRAGOUBA
922930706,2023-01-28,,,P,t,,,,ESTRELLA POUZOULET
948473368,2023-01-25,,,M,t,,,,ONE UP CONSEILS FORMATIONS
921117271,2022-11-07,,,P,t,,,,PAULINE TELERMANN
909964041,2022-02-01,,,M,t,,,,AI ASSURANCES
948341318,2023-01-03,,,P,t,,,,NARA ALVES CAETANO FAGUNDES
948454996,2023-02-01,,,P,t,,,,ABDESSALAM BOULAHDID
922102181,2022-12-05,,,M,t,,,,GRADZIELLA
948470869,2023-01-22,,,P,t,,,,OLIVIER DELMESTRE
920207271,2022-10-04,,,P,t,,,,EMMA ROSTAMNEJAD
948018817,2023-01-15,,,P,t,,,,ISSA MARIKO
922763081,2023-01-09,,,P,t,,,,JHON MONTANO NUMBELA
947981510,2022-12-30,,,M,t,,,,GIE IMAGERIE MEDICALE GOUIN
948039631,2023-02-01,,,M,t,,,,HT MOTORS HT MOTORS
921958245,2022-12-05,,,P,t,,,,ELSA NACHTIGAL
948417217,2023-02-01,,,M,t,,,,OULDJA PIONNERS ROAD
947980645,2023-01-05,,,P,t,,,,YANNIS AME
912119351,2022-04-01,,,P,t,,,,BENJAMIN CHATTON
947983771,2023-01-05,,,M,t,,,,KAIROS
947920641,2022-12-15,,,P,t,,,,TAFSIR SAKHO
884751033,2020-06-25,,,M,t,PME,2020,,HASHKEY SERVICES
922051479,2022-12-06,,,M,t,,,,BEN ENERGY
948436530,2023-01-23,,,M,t,,,,VUBUKA
948268180,2022-12-30,,,P,t,,,,SAMIA RAMOULI
038916193,1997-12-25,,NN,M,t,PME,2020,,SYNDICAT DE COPROPRIETE JEAN ALLEMANE
948459565,2023-02-01,,,M,t,,,,AXIOME CONSULTING
920704038,2022-10-11,,,M,t,,,,UMASHOP
919670109,2022-09-30,,,P,t,,,,MOHAMED ANWAR TANTAOUI
948007513,2022-08-02,,,P,t,,,,ERKIN ERDOGAN
947927729,2023-01-06,,,P,t,,,,DANIEL ABID
903713279,2021-09-13,,,P,t,,,,NOUR EL HOUDA AFIF
948427463,2023-01-25,,,P,t,,,,TANIM CHOWDHURY
948398375,2023-01-25,,,P,t,,,,SONIA FILALI
948451034,2023-01-19,,,M,t,,,,UPDYNAMIC
947848974,2022-12-30,,,M,t,,,,SCI ATIF
948266911,2023-01-18,,,M,t,,,,HUMAN IMPULSE
948406582,2023-01-24,,,M,t,,,,TOSCAROSE
918556101,2022-08-03,,,M,t,,,,ITSU FRANCE
947983417,2022-12-09,,,M,t,,,,E-CONSULTING
948277843,2023-01-20,,,M,t,,,,INDIVISION CORREIA / DOMINGUES
911422780,2022-03-14,,,P,t,,,,VALENTINE MORELL
310457635,1900-01-01,,NN,M,t,,,,YACHTING EXPRESS FRANCE
804169688,2014-09-01,2020,02,M,t,PME,2020,,CHIKHTEX
917427007,2022-07-08,,,P,t,,,,MARINA HARTER CRUZ
947979902,2023-01-09,,,M,t,,,,OZA NETTOYAGE
948395421,2023-01-20,,,M,t,,,,ADCAR LOCATION
922866447,2023-01-17,,,P,t,,,,YANN TCHEUKO BOMBA
882911399,2020-04-06,,,P,t,PME,2020,,ERWAN DE ROTALIER
948245675,2023-01-30,,,P,t,,,,PHILIPPE PHAM
269500088,1982-01-01,2020,42,M,t,ETI,2020,,CTRE HOSPITALIER SPECIALISE ROGER PREVOT
947971578,2023-01-09,,,M,t,,,,BRASSERIE DES TONTONS
411789142,1996-11-07,,NN,P,t,PME,2020,,DELIA COZZOLINO
344804745,1988-06-01,,,M,t,,,t,V ET L
948513114,2022-12-13,,,M,t,,,,PHILAE
948491923,2023-01-01,,,P,t,,,,AMINA BOUACHRA
398382713,1994-09-01,,NN,M,t,,,,CCIF CARBURANT ET COMBUSTIBLES ILE DE FRANCE
922899604,2023-01-22,,,P,t,,,,BILAL CHABBAR
922731716,2022-12-23,,,P,t,,,,WALID AIT MAAMAR
948266028,2023-01-20,,,P,t,,,,MAROUANE FELJA
948015185,2023-01-07,,,M,t,,,,NOLYAD CAR
904078367,2021-11-01,,,P,t,,,,ALAA AFIA
948311568,2023-01-23,,,M,t,,,,TIZI COUVERTURE
410481204,1996-12-18,,NN,M,t,,,,QQ001
922697461,2023-01-02,,,P,t,,,,CHRIST VEGI
399127893,1994-11-22,2020,01,P,t,PME,2020,,BRUNO HATCHERIAN
922004643,2022-12-01,,,M,t,,,,DJS MARKET
884216458,2020-06-09,,,M,t,PME,2020,,YSEO
922720438,2022-12-20,,,M,t,,,,ED LOGISTICS
410431753,1996-01-01,,NN,P,t,PME,2020,,CHRISTINE MADOYAN
947925046,2023-01-04,,,M,t,,,,TKL BATIMENT ET ENERGIES
948412986,2023-01-25,,,P,t,,,,VLADIMIR DERUN
404369464,1996-03-27,,,P,t,,,,AMINE NEGAB PLAY-NET
948544697,2023-01-23,,,M,t,,,,GRACJA BAT
922835640,2023-01-09,,,P,t,,,,NESRINE DAMOUH
899287999,2021-05-12,,,M,t,,,,SAPB AUTOLAVAGE
947982153,2023-01-03,,,M,t,,,,LIQUID H3
912193240,2022-04-04,,,P,t,,,,MOUNYA BENYAHYA
922758156,2022-07-10,,,P,t,,,,MYRIAM KAZED
910769553,2022-02-21,,,M,t,,,,UXTECH
948062856,2023-01-15,,,P,t,,,,CHAKIR BESSADI
948295084,2023-01-23,,,M,t,,,,TRANSPORTS SNLL
920697752,2022-10-12,,,P,t,,,,RAFAEL ORNIA BLANCO
947842373,2022-12-29,,,P,t,,,,LYDIA MENAOUEL
947890059,2023-01-02,,,M,t,,,,MD IT CONSULTING
922063474,2022-08-20,,,M,t,,,,SG RENOVATIONS
338750409,1986-08-28,2020,11,M,t,PME,2020,,SERSYS SOCIETE D'ETUDES ET DE REALISATION DE SYSTEMES DE SECURITE
878622380,2019-11-30,2020,02,M,t,PME,2020,,GROUPE STS
890305287,2020-11-01,,,M,t,PME,2020,,LEB DELICE
948492186,2023-01-29,,,M,t,,,,LMNP DAUGUEN TANGUY
947880464,2023-01-04,,,M,t,,,,WNL COIFFURE
948358502,2023-01-15,,,P,t,,,,EUGENIU GUTU
948416276,2023-02-13,,,M,t,,,,INDIRA
922789318,2022-10-17,,,M,t,,,,AM CONSTRUCTION
399491448,1995-01-23,,,P,t,PME,2020,,EMMANUELLE GALLOT
948460324,2023-01-27,,,M,t,,,,EL EVENT PROJET
922854591,2023-01-23,,,P,t,,,,MERESH KUMAR UTHAYAKUMAR
948340898,2022-12-31,,,P,t,,,,EDIANE ALVES CAETANO FAGUNDES
922009527,2022-11-22,,,M,t,,,,UBI SMART
948312012,2023-01-03,,,P,t,,,,DAVIDE GIOVINAZZO
948341466,2023-02-01,,,P,t,,,,BELKACEM SEDDI
948017751,2023-02-15,,,P,t,,,,CHRISTIAN VEYSSEYRE
948320528,2023-02-01,,,P,t,,,,EDDY DURAND CHEWA
327643854,1983-05-13,,NN,M,t,,,,SHELL
948246053,2023-01-19,,,M,t,,,,MIR CONSTRUCTION
347647349,1988-08-01,,,P,t,,,t,MICHAEL ULRICH
914884689,2022-06-14,,,M,t,,,,EXPERT ACADEMY
351317581,1989-05-01,,,M,t,,,t,S 2 M
903290880,2021-09-01,,,M,t,,,,BIGTECH
922790977,2023-01-01,,,P,t,,,,MARIANN RAMDEEN
948349972,2023-01-23,,,M,t,,,,VALERUS CONSULTING
920458379,2022-10-17,,,M,t,,,,ISG
948332440,2023-01-02,,,M,t,,,,ATM STRUCTURES
922799838,2023-01-02,,,P,t,,,,AXEL LOURDIN
948244447,2023-02-01,,,M,t,,,,DJ ALL G EVENTS
618118004,,,,P,t,,,t,BEN LAID
948355367,2023-01-15,,,P,t,,,,ARCADIE MAIMESCU
401564828,1995-06-01,,NN,P,t,PME,2020,,NATHALIE TEBEKA
948269253,2023-01-06,,,P,t,,,,WENDPOUIRE OUEDRAOGO
402469472,1995-09-11,,NN,P,t,PME,2020,,PHILIPPE VANESSCHE
920565751,2023-01-12,,,P,t,,,,JAVIER FORERO
922834775,2023-01-14,,,P,t,,,,ABDORRAHMANE JAA
948453535,2022-12-27,,,M,t,,,,IMMARS
922702824,2022-11-02,,,P,t,,,,MARIUS ROCHEFORT
922667647,2023-01-01,,,P,t,,,,PERRINE BRAJEUX
884255332,2020-06-15,,,P,t,PME,2020,,TAIEB BEN MOUSSA
404335952,1991-09-01,,NN,P,t,PME,2020,,GILLES MONGE
948448527,2023-01-25,,,M,t,,,,CLOTHES BY G
948420039,2023-04-01,,,M,t,,,,SPFPL RK
352256077,1989-09-27,,NN,P,t,,,,ANNIE THORET
378913933,1990-07-01,,NN,P,t,,,,CAROLE SARFATI
351468897,1989-06-01,,NN,P,t,,,,PHILIPPE LAMANT
921932836,2022-12-02,,,M,t,,,,CAB GUY
393920350,1994-02-07,,NN,M,t,,,,ATOLL'IN
922899687,2023-02-21,,,P,t,,,,THOMAS EUDES
922781661,2023-01-02,,,M,t,,,,SASSUBLIME
922694047,2023-01-03,,,M,t,,,,AB TRANSPORT
948543897,2023-02-01,,,P,t,,,,ANTHONY DRAY
392640785,1993-10-07,,NN,M,t,GE,2020,,ETG
947848644,2023-01-03,,,P,t,,,,MUAD ABUARKAB
948047378,2023-01-04,,,M,t,,,,OF CONSEILS
948422084,2023-01-16,,,M,t,,,,TRAVEL PRESTIGE
922705496,2022-11-18,,,P,t,,,,CELINA LOPES GOMES
947928503,2023-01-12,,,P,t,,,,LYES BOULAHRIK
948274121,2023-01-01,,,M,t,,,,ACTION 4 TRADE
948357918,2023-01-25,,,M,t,,,,WISETECH
900343518,2021-02-01,,,P,t,,,,MOURAD TOUMI
322273632,1981-06-04,,NN,M,t,,,,SCM DU 303 305 RUE D EPINAY
402722409,1995-10-04,,NN,P,t,PME,2020,,MICHEL LANDSBERG
948037346,2023-01-11,,,P,t,,,,YASSINE OUARID
402681357,1995-09-28,,NN,M,t,PME,2020,,PROPRIMO
947957619,2023-01-03,,,M,t,,,,KOETE CONSULTING
922645148,2022-12-29,,,P,t,,,,QUENTIN LECUYER
922672449,2023-01-01,,,P,t,,,,PAULINE RITTER
382866507,1991-09-01,,NN,M,t,,,,TWOTEAM
394786461,1994-04-21,,NN,M,t,,,,JANGIL
899312987,2021-05-06,,,P,t,,,,LIVIO ARMADORO RODRIGUEZ
900004599,2021-05-17,,,M,t,,,,PNEUMACY
329222673,1984-01-01,,,M,t,,,,REMOLOC
948028212,2023-01-02,,,M,t,,,,SCI PINGU
912882172,2022-04-27,,,P,t,,,,IHSSANE MOUH
527781975,2010-09-01,,NN,M,t,PME,2020,,CEMA
948281118,2023-01-19,,,P,t,,,,ANIS ZEDDINI
405260811,1996-01-01,2020,00,M,t,PME,2020,,UBIQUS FINANCE ET JURIDIQUE
948477328,2023-01-23,,,M,t,,,,AUDEAMUS
913633343,2022-06-01,,,P,t,,,,HICHAM EL AHMADI
922939046,1983-06-03,,,M,t,,,,EBBA EGLISE BIBLIQUE BAPTISTE D'ARGENTEUIL
402243919,1995-06-01,,NN,M,t,,,,CINEBANK
398975896,1994-06-01,,NN,P,t,PME,2020,,SAMI LANDOULSI
948542444,2023-01-16,,,M,t,,,,R-4MAX SECURITY SERVICES
947853610,2022-12-07,,,P,t,,,,PRISCILLIA VIGOUREUX
922783923,2023-01-09,,,M,t,,,,GTB
947906624,2023-01-01,,,M,t,,,,JASMIN CONSULTING
948462411,2022-08-26,,,M,t,,,,IRRMANN-TEZE & SMADI
948268578,2023-01-14,,,M,t,,,,MPSTP
947841656,2023-01-02,,,M,t,,,,489 HOUSE
948316195,2023-01-23,,,P,t,,,,MYRIAM MESSADEK
948010178,2023-01-05,,,M,t,,,,CMD AUTOMOBILE
922645171,2022-12-28,,,M,t,,,,SCI OUD IMMO
922893045,2023-02-01,,,P,t,,,,LOUISE NICOLAS
948004841,2023-01-10,,,P,t,,,,MILENA GONTARD
922875620,2023-01-17,,,P,t,,,,SOUMAILA KAMAGATE
900333881,2021-06-07,,,P,t,,,,SABRINA MOREIRA DA SILVA
947924148,2022-12-26,,,M,t,,,,52 PASSAGE
908798952,2022-01-13,,,P,t,,,,STEVEN ARULPRAGASAM
948304829,2023-02-13,,,P,t,,,,AFFOUA EDAN
909188781,2022-01-04,,,M,t,,,,APLYMO FINTECH
348610197,1988-09-20,,NN,M,t,,,,SCI CIBOIT CHANDON
922893144,2023-01-19,,,P,t,,,,THIERRY FABRICE JEAN GIRARD
832897755,2017-10-25,2020,01,M,t,PME,2020,,OKAN TRANSPORT
948458633,2023-01-02,,,M,t,,,,WICHMANN PARANCE
947890927,2023-01-03,,,M,t,,,,JAPIEROGI
905322533,2021-11-17,,,P,t,,,,KARINE CARABIN
948410683,2023-01-04,,,P,t,,,,VASILE UTA
922926175,2023-01-25,,,P,t,,,,HUGO HUGO QUIGNARD
922906201,2023-01-25,,,P,t,,,,SAID BENKHALYL
909218208,2022-01-17,,,P,t,,,,MASSINISSA OULARBI
922800461,2023-01-02,,,P,t,,,,BENEDICTE TRANSON
824446900,2016-12-13,,,M,t,PME,2020,,MAZZA FINANCE CONSEIL
378556443,1990-04-02,,NN,P,t,,,,JEAN-FELIX JACQUENET CENTRE HOSPITALIER D'ARGENTEUIL
920711553,2022-10-23,,,P,t,,,,MARIA MONTEIRO BORGES
948271242,2023-02-06,,,M,t,,,,FDS PROJECT
348007428,1988-09-06,,NN,P,t,,,,ETIENNE VAGUER EVER STAND
948397575,2023-01-04,,,M,t,,,,SCI NAT SCI NATURE
400366506,1995-03-17,,NN,M,t,,,,PMM PROPERTY MARKETING & MANAGEMENT
948457361,2023-01-02,,,P,t,,,,MARIE PIERRE
948043997,2023-01-11,,,M,t,,,,RAS VTC
947939591,2023-01-01,,,M,t,,,,AKCONSEIL
421471244,1998-12-01,,,M,t,,,,SASEB
948243415,2023-01-20,,,P,t,,,,NECERINE RAOURAOUA
947981437,2022-12-23,,,M,t,,,,CCURE-IT
882398241,2020-03-04,,,P,t,PME,2020,,ANDREA KEMTCHOUM
391568276,1993-07-05,,NN,M,t,PME,2020,,MFCT 100   CARTOUCHES
947582441,2023-01-01,,,P,t,,,,NIDHAL REZZEB
409880044,1996-11-15,2020,32,M,t,GE,2020,,INEO INDUSTRIE ET SERVICES IDF
948475819,2023-01-03,,,M,t,,,,ARMELLE DORE SAS
922926407,2023-01-24,,,P,t,,,,CINTHIA GOMIS
919796730,2022-06-27,,,M,t,,,,WM TECH
948432729,2023-01-19,,,M,t,,,,BRL SERVICE
922122346,2022-11-18,,,M,t,,,,ILLICO TRANSPORTS
920565298,2022-10-06,,,M,t,,,,ACP ASSURANCE ET EPARGNE
947858189,2022-10-19,,,P,t,,,,FRANCOIS FRAY
947587887,2022-11-24,,,P,t,,,,ABDELLAH BENBOUADI
947877114,2023-01-03,,,M,t,,,,GA2S GLOBAL ADVICE & SUPPLY SERVICES
901693663,2021-07-24,,,M,t,,,,THE CURRY CORP.
301013249,1974-01-01,,,M,t,PME,2020,,FERICO
922919469,2023-01-30,,,P,t,,,,SAMI SMAIL
914916382,2022-09-01,,,P,f,,,,""
892035577,2020-12-01,,,P,t,PME,2020,,KEVIN PANTEL
411201767,1997-03-01,,NN,M,t,,,,CAP EMBALLAGE
922926910,2023-01-25,,,P,t,,,,NACER BAY
922645601,2022-12-15,,,P,t,,,,CHERINE OUAKOUR
947958690,2023-01-30,,,P,t,,,,ALEXANDRE DELSAUX
948380316,2023-01-25,,,P,t,,,,CHUONG TTNG
891848855,2020-12-01,,,M,t,PME,2020,,BIKKART
349188540,1989-01-01,2020,11,M,t,PME,2020,,FB AXANTIS OFFICE SOLUTION
922634134,2022-12-27,,,M,t,,,,RADIOLOGIE EUROPE 92
948531850,2023-01-16,,,P,t,,,,KARIMA RECHID
947874400,2023-01-03,,,M,t,,,,DOMICAP
410589097,1997-01-03,,NN,P,t,,,,MICHEL BALLEY
948332101,2023-01-23,,,P,t,,,,MARWAN ELABED
922672662,2023-01-01,,,P,t,,,,Ediane Ediane Alves Caetano Fagundes
880155668,2019-12-26,,,M,t,,,,KLEBER 92
348500356,1988-10-11,,NN,P,t,,,,CHABANE ALLOUCHE
947988655,2023-03-01,,,P,t,,,,SARAH GUERFI
922949938,2022-12-01,,,P,t,,,,ERIC ANJARATIANA
948400429,2023-02-01,,,P,t,,,,HAILONG MIAO
899738553,2021-05-21,,,M,t,,,,ALIX CONSULTING
922941703,2023-01-01,,,P,t,,,,GUILLAUME HUI
947661443,2022-11-29,,,M,t,,,,JWS LTD
947935128,2022-12-28,,,M,t,,,,HOLDING TEAM
902246024,2021-07-10,,,M,t,,,,AJS
353065006,1990-01-02,,NN,P,t,,,,CLIGOIN PATRICIA
408621209,1996-07-31,,NN,M,t,,,,ELITES CONSULTING
947929188,2022-12-01,,,M,t,,,,SHALA VENTIL
948388244,2023-01-24,,,M,t,,,,JH DIGITAL
397457292,1994-07-01,,NN,M,t,,,,D P S-NETTOYAGE
948457155,2023-01-06,,,M,t,,,,LUXURY SERVICE CAR
947615423,2022-11-03,,,P,t,,,,CELINE MEHAULT
948524624,2023-01-24,,,M,t,,,,SCI SAMARCANDE
947729471,2023-01-01,,,M,t,,,,CHAUFFAGE CLIM PRO
948294491,2023-02-01,,,P,t,,,,SABRINA AOUADA
948264577,2021-12-11,,,M,t,,,,LAB14 INSTRUMENTS
947553863,2022-12-13,,,P,t,,,,DAVID MENGELLE MARTIN
948004221,2023-01-01,,,M,t,,,,ALS IMMO
393430723,1993-11-15,,NN,P,t,,,,NICOLAS BERNARD
411963358,1996-06-28,,NN,P,t,PME,2020,,BRUNO GARNIER
922824669,2022-12-29,,,P,t,,,,OUSMANE GASSAMA
922900980,2022-12-01,,,P,t,,,,MEGANE LEE
947937868,2023-01-04,,,M,t,,,,SCI INVEST
893067827,2020-12-29,,,M,t,PME,2020,,SDC COPR 48 RUE PIERRE CURIE 92700 COLOMBES
948051727,2023-02-06,,,P,t,,,,SEVSY SEVERIN LONTSI
947999264,2023-01-10,,,M,t,,,,ONE BUSINESS SCHOOL
947965224,2023-01-02,,,M,t,,,,HK LINE
947891099,2023-01-03,,,P,t,,,,JEAN CLAUDE RAGACHE
340471804,1986-12-30,,NN,M,t,PME,2020,,SCI SANCEDEL
328637335,1983-10-01,,,P,t,,,t,ABDELKADER DJOUADI
313251167,1978-01-01,,NN,P,t,,,,MICHEL CASCELL
948253281,2023-01-02,,,P,t,,,,RIAD SAHA
922754965,2023-01-09,,,P,t,,,,GABA GUISSI
921725693,2022-12-01,,,P,t,,,,BILEL NAOUALI
922670815,2022-12-26,,,M,t,,,,QUALITY BUSINESS
920178167,2022-10-06,,,P,t,,,,MARIE HARMAND
948392600,2022-12-27,,,M,t,,,,WEASY HOMES
948487210,2023-01-30,,,P,t,,,,BASHIR MOHAMAD
910467075,2022-02-01,,,P,t,,,,MUELA-ALEXIS KOLELA MUANA
947718227,2022-11-25,,,P,t,,,,ANAS BAICH
922672381,2022-12-30,,,P,t,,,,IBRAHIMA CAMARA
948359682,2023-01-16,,,P,t,,,,NICOLAE DARII
948441167,2023-01-27,,,P,t,,,,MOHAMED HASSANI
947815437,2022-11-23,,,P,t,,,,JULIEN DA CRUZ TOMAR
904141066,2021-10-11,,,M,t,,,,APPLIKOYA
947994430,2022-12-12,,,P,t,,,,MAX PRADOS
922946579,2022-04-21,,,P,t,,,,ALESIA MAINGAULT
948411772,2023-01-25,,,P,t,,,,VITALIE GALUSNIC
910722925,2022-03-01,,,M,t,,,,RED CAR
922929815,2023-01-01,,,P,t,,,,AAZDINE RHADOUI
947922662,2023-01-06,,,P,t,,,,JEANNE SERRY
922761366,2023-01-06,,,P,t,,,,RADOINE BACHARI
922838784,2023-01-15,,,P,t,,,,IRENE FOMB
947842498,2023-01-02,,,P,t,,,,PAUL BENAC
947982476,2023-01-04,,,M,t,,,,NYMS RENT
914792825,2022-06-17,,,P,t,,,,SOFIANE NADJI
920431483,2022-10-13,,,M,t,,,,RTC PRESTIGE
948355292,2023-01-16,,,M,t,,,,MCA INVESTMENT SOLUTIONS
948444989,2023-01-26,,,P,t,,,,KAWTHAR MEKOUAR
948335724,2023-02-01,,,M,t,,,,DAMAH
947908547,2023-01-04,,,P,t,,,,GREGORY CABIT
305652315,,,,P,t,,,t,JEAN MICAT
915253520,2022-07-04,,,M,t,,,,HINATA NS
948051578,2022-12-09,,,M,t,,,,DC INVEST
922772397,2023-01-15,,,P,t,,,,MAANUSHA RAMESH
914800263,2022-06-16,,,M,t,,,,PRIME ENERGY
301637047,1900-01-01,,,P,t,,,,BEN ADMAR
922111786,2022-12-01,,,M,t,,,,SASU RAMDANI
922866504,2022-01-17,,,P,t,,,,KEVIN BASTIAN
948324058,2023-02-01,,,P,t,,,,ABDERRAHMEN SNOUSSI
948265780,2023-02-01,,,M,t,,,,AMR
919752865,2022-09-22,,,M,t,,,,ROOTS
922651302,2022-12-20,,,M,t,,,,EXPERT RESOURSES
394794002,1994-04-15,,NN,M,t,PME,2020,,SCI CHAMPARONS-GUERLAIN
922866439,2022-12-01,,,P,t,,,,KEVIN FENG
948458260,2022-10-19,,,M,t,,,,TEI
919376814,2022-10-01,,,M,t,,,,BN DRIVE
922946926,2023-01-26,,,P,t,,,,GIOVANNI CESAR MILANDOU
947854170,2022-12-29,,,M,t,,,,KTA RECRUTEMENT ET CONSEIL
948370010,2023-01-25,,,P,t,,,,ZAMEER AHMADZAI
922867478,2023-02-01,,,P,t,,,,ASSIA BURKE
948063706,2023-01-16,,,M,t,,,,SOFIAK
922760749,2023-01-27,,,P,t,,,,PULIMTHANATHU VINU
947904603,2023-01-05,,,P,t,,,,AHMED HOUARI
948404280,2023-01-24,,,M,t,,,,TIPY
947912747,2023-01-05,,,M,t,,,,MISAKA
922941554,2023-01-25,,,P,t,,,,YASSIR EL MALHI
911353787,2022-03-01,,,M,t,,,,CREE CABINET CREE
948027578,2023-01-01,,,M,t,,,,INTI EVENT PARIS
922926969,2023-02-01,,,P,t,,,,REN ZHOU
921929048,2022-11-14,,,M,t,,,,GREEN ECO CONCEPT
394000004,1991-01-10,,NN,P,t,PME,2020,,PHILIPPE PISSOT
913352779,2022-04-05,,,M,t,,,,INEXT EXPERTISE
922046420,2022-12-05,,,M,t,,,,HOME CONNECT
388251381,1991-09-01,2020,01,P,t,PME,2020,,SOPHIE AYEL
904088143,2021-10-04,,,M,t,,,,JFRE CONSULTING
922673181,2023-01-31,,,P,t,,,,THIERRY DELVAUX
948423538,2023-01-26,,,P,t,,,,OMAR BOUNEHAR
948016506,2023-01-05,,,M,t,,,,AMGR GROUP
947989679,2023-01-09,,,P,t,,,,SOFIENE ZAABOUB
308348143,1980-05-05,,NN,M,t,,,,SCI CAFOPEL
948404173,2023-01-25,,,M,t,,,,AHSI HIMAYA
912488020,2022-03-21,,,M,t,,,,MPDEM SERVICES
947964003,2023-01-10,,,P,t,,,,GAYA TERZI
948400288,2023-01-01,,,M,t,,,,SASU PAPITA
408479418,1996-07-01,,NN,P,t,,,,BRUNO POTEL
947883450,2023-02-06,,,P,t,,,,ABDESSAMAD ELLOUK
441111606,2002-03-04,,NN,M,t,,,,MONDEGO
342006848,1987-07-21,,NN,M,t,,,,DIADEM MULTISERVICE
947758736,2022-11-01,,,M,t,,,,DT PALETTES SERVICES
917712333,2022-06-30,,,M,t,,,,LEA IMMO
409241718,1996-07-25,,,M,t,,,,SORALA
948361159,2023-03-01,,,P,t,,,,MOURAD ELAIHAR
948021969,2023-12-01,,,M,t,,,,ROAD TRIP DIGITAL CENTRE D'ACCOMPAGNEMENT DIGITAL
947613675,2022-12-05,,,P,t,,,,NOEMIE DUSSART
301639134,1981-03-25,,NN,M,t,,,,A PLUS
922732086,2023-01-01,,,M,t,,,,NEOSYNDIC HOLDING
921961793,2022-11-26,,,P,t,,,,ALAEDDINE SEBOUSSI
919804922,2022-09-29,,,M,t,,,,TMAS 92
895070480,2020-12-21,,,M,t,PME,2020,,SCAFF TRANSPORTS
344602222,1988-04-01,,NN,M,t,PME,2020,,COFISE UFFO
947756375,2022-12-21,,,P,t,,,,TAREK DAHMANI
910138924,2022-02-08,,,M,t,,,,LPZ SOLUTIONS
887546679,2020-08-01,2020,02,M,t,PME,2020,,MADWOOD
922669007,2022-12-30,,,P,t,,,,CLAUDE MAMCHE
948048756,2023-01-15,,,P,t,,,,MERIEM KHEBBACHE
918547589,2022-08-18,,,M,t,,,,MH CONSULTING
948002449,2023-01-11,,,M,t,,,,KOJAK TRANSPORTS
922790407,2023-01-10,,,P,t,,,,BABACAR GUEYE
922125125,2023-01-02,,,M,t,,,,NATHALIE RP
948498787,2023-01-26,,,M,t,,,,MGT
948356449,2023-01-15,,,P,t,,,,ION RUSU
340872977,1987-04-06,,,M,t,,,t,GARAGE MJ
910099720,2022-02-03,,,P,t,,,,ALEXANDRE MERCIER
948520648,2023-01-02,,,P,t,,,,BRAHIM HAMMADI
948338488,2023-01-23,,,M,t,,,,DOCE PUERTORICO
437739394,2001-05-15,,NN,M,t,PME,2020,,SARL MNE
947973657,2022-12-01,,,P,t,,,,JAOUAD BOUYADMOUMA
947857520,2023-02-01,,,P,t,,,,MAIMOUNA COULIBALY
947969556,2023-01-08,,,M,t,,,,APPM AP PROJECT MANAGEMENT
382157527,1991-04-01,,,M,t,,,,ALAIN DUCASSE DIFFUSION
947831186,2023-01-02,,,M,t,,,,OMYX
948465653,2023-01-23,,,M,t,,,,PLAN CASH CORPORATION
892461385,2021-01-06,,,P,t,,,,AMRA MARMA
893115634,2021-01-01,,,M,t,,,,SINAPTEK
948361365,2023-01-24,,,M,t,,,,BROISSIA - 7PRONY LOT 1
947880050,2023-01-02,,,P,t,,,,MAKELA ENSE
948530902,2023-01-27,,,M,t,,,,BLUEBERRY
947619672,2022-12-01,,,P,t,,,,DENCIL MARIYADELSON
922866801,2023-01-04,,,P,t,,,,AYA AMANI
948057062,2023-01-16,,,P,t,,,,DOMINIK ZMUDA
922793609,2022-12-20,,,M,t,,,,MK MK PROPRETE
412323552,1997-04-04,,NN,P,t,,,,BRAHIM ZARAI
533383576,2011-06-01,,,M,t,PME,2020,,DRINKS CLUB
819909060,2016-04-15,,,P,t,,,,FANNY BERLY
922899273,2023-01-01,,,P,t,,,,LALLA FATOUMA SEIDNALY
331022764,1984-10-30,2020,11,M,t,PME,2020,,SBS SERGE BLANC SERVICE
947846549,2023-01-01,,,M,t,,,,922E VENTURES
947915963,2023-01-02,,,P,t,,,,ZINEB OUNOUGHI
922646856,2023-01-15,,,P,t,,,,YOUSSEF DOUIBI SABOUR
947910618,2022-12-29,,,P,t,,,,SIWAR AFFES
922838826,2023-01-12,,,P,t,,,,BERENICE BOUCHETARD
402880207,1995-10-01,,NN,P,t,PME,2020,,DOMINIQUE PHILIPPOT
948284443,2023-03-03,,,M,t,,,,EURO FORMATION
922657648,2022-01-03,,,P,t,,,,MOHAMED MEZAGUER
922705561,2023-02-15,,,P,t,,,,ABDESSAMAD NASSIRI
314809211,,,,P,t,,,t,RENE RENAUD
314444563,1978-01-01,,NN,P,t,,,,BOUSSAD ARAR RELAIS LOUIS ROCHE
948411160,2023-01-18,,,M,t,,,,DELANEAU SYSTEMES
784891897,,,,P,t,,,t,JOSEPH MACE
947983862,2022-12-09,,,P,t,,,,BUNNARA SOR
922212063,2022-12-07,,,M,t,,,,SARL HYPNOS
921745204,2022-12-25,,,P,t,,,,PIERRE RAZKALLAH
219500188,1983-03-16,2020,51,M,t,ETI,2020,,COMMUNE D ARGENTEUIL
948266390,2023-01-15,,,M,t,,,,LE PRESTIGE
915397095,2022-07-07,,,M,t,,,,MAISON HONORE CLICHY
902065291,2021-07-15,,,M,t,,,,SAINT-MICHEL
922784756,2022-09-01,,,M,t,,,,SPFPL DU DOCTEUR JEREMY KRIEF CHIRURGIEN DENTISTE
393490081,1994-01-17,2020,11,M,t,PME,2020,,GI GRAPH'IMAGE
948544366,2023-01-01,,,P,t,,,,NIDHAL HANNACHI
403713282,1995-11-01,,NN,P,t,PME,2020,,ALI BOUCHAKOUR LES 3 MARCHES
382428779,1991-06-01,2020,00,M,t,ETI,2020,,JULIE GUERLANDE
907990071,2021-12-01,,,M,t,,,,PRP SERVICES
948322128,2023-02-01,,,M,t,,,,VERIPROTECT
581003704,,,,P,t,,,t,GEORGES CORNAILLE
918351735,2022-08-03,,,M,t,,,,BIDCO GB
947989125,2022-12-09,,,P,t,,,,ELISABETH KIAKUIKAMA NSONA
922837760,2023-01-04,,,P,t,,,,ADELINE TCHAPDA YANOU
888589751,2020-09-07,,,P,t,PME,2020,,TIPHAINE LAVENANT
909585887,2022-01-25,,,P,t,,,,NGANE YACINE SAKHO
948013057,2022-12-01,,,M,t,,,,DELTA CONSTRUCTION
922658851,2022-01-01,,,P,t,,,,ANTOINE BOIS LEMARQUIS
895385169,2021-04-14,,,P,t,,,,ROXANE VEYRI
900838863,2021-04-22,,,M,t,,,,ALLIANCE DES SECOURISTES ET SAUVETEURS AQUATIQUES DES HAUTS DE SEINE
894058122,2021-02-15,,,P,t,,,,HELENE RAVAUX
947964920,2023-01-09,,,P,t,,,,FATIMA MEGUELLATI
922801303,2023-01-30,,,M,t,,,,PSYCH'EVOLUTION
890735574,2020-10-15,,,P,t,PME,2020,,BILAL BENMORKAT
947886552,2023-01-03,,,M,t,,,,LAM SCI
922930722,2023-01-24,,,P,t,,,,DALIA MOHRI
387552698,1992-04-22,2020,02,M,t,PME,2020,,DIACAR
401537535,1995-06-20,,NN,M,t,,,,INITIATIVE INTERNATIONAL
948017108,2023-01-02,,,P,t,,,,JAMAL BEN ADDI
948524343,2023-02-01,,,P,t,,,,AUNKUR BARUA
947765335,2022-12-22,,,P,t,,,,HOUMA LOUBEN NJIEMOUN
922932454,2023-01-26,,,P,t,,,,VAMA KANATE
922648878,2023-01-02,,,M,t,,,,BUENO PRIMEURS
922702857,2022-11-08,,,P,t,,,,FABIEN CHAPELLE
948488325,2023-01-30,,,P,t,,,,NASSIM ZOUAOUI
382205425,1991-02-01,,NN,M,t,,,,GVDG PRODUCTIONS GERARD VAN DER GUCHT PRODUCTIONS
305378622,,,,M,t,,,t,LICOU
947928339,2023-01-01,,,P,t,,,,FASSA SOUMARE
922795455,2023-02-01,,,P,t,,,,STEPHANE ARMAND FIDE AKA
887707628,2020-08-01,,,M,t,PME,2020,,ABCO WORKING
947938684,2022-12-12,,,M,t,,,,LUS-EXPORT
948535232,2023-02-01,,,P,t,,,,GAETAN RINGEARD
918492182,2022-08-19,,,M,t,,,,AMBULANCES WAGRAM
337811368,1986-05-27,2020,01,P,t,PME,2020,,RICHARD ISOUL
401208806,1995-06-01,,NN,M,t,PME,2020,,A.C.M.FRANCE
327569778,1983-01-01,,NN,P,t,,,,LAHOUCINE FIDEL
922671870,2023-01-29,,,P,t,,,,BOCHRA ZAAK
330605460,1984-09-11,,NN,P,t,,,,ANNICK LUSSEAU AUX 1000 MAILLES
922698964,2022-12-23,,,M,t,,,,DAR'S BRANDS
948388509,2023-01-23,,,M,t,,,,MAISON DU PAIN TRADITIONNEL
919569087,2022-09-20,,,P,t,,,,NICOLAS GABON
922946785,2023-01-26,,,P,t,,,,BONNIE MENVIEL
948290754,2023-02-01,,,M,t,,,,M.LA
947999298,2023-01-10,,,M,t,,,,GREEN SCHOOL
907932420,2021-12-30,,,P,t,,,,CYRIL MARTINSKY
398239806,1994-09-05,2019,00,M,t,PME,2020,,EURO TP
948033782,2023-02-01,,,P,t,,,,HASILALAINA RAMELINA
947935904,2023-01-02,,,M,t,,,,SAFETY MOBILITE
391885514,1993-07-23,,NN,M,t,,,,MAINLAND
922650395,2022-12-31,,,M,t,,,,ENNEA DESIGN
922671458,2023-01-03,,,P,t,,,,VAIBHAVKUMAR RANA
948486048,2023-01-18,,,M,t,,,,BSC BLINDSPOT COVERAGE
892625476,2020-10-09,,,P,t,PME,2020,,ILIAS ABBOU
403031180,1995-11-15,,,M,t,,,,A (ACTIBAT)
911596815,2022-03-15,,,P,t,,,,WILLIAM DA VEIGA
948251756,2023-01-19,,,M,t,,,,V8 BARBER SHOP
947985016,2023-01-05,,,M,t,,,,PROCEDES DU 8
922785407,2022-12-15,,,M,t,,,,RMI RAMEDINVEST
898397930,2021-05-03,,,P,t,,,,CLEMENCE SAUNIER
799403563,2013-05-30,,,P,t,,,,JAMILA SIDHOUM
947983821,2023-01-08,,,M,t,,,,HAOKO SARL
342874609,1987-07-13,,NN,P,t,PME,2020,,ELIANE COENEN
947852075,2022-12-26,,,P,t,,,,CLEMENT DUMAS
922936000,2023-01-27,,,P,t,,,,AMINE HAMMOUDA
948323449,2023-01-03,,,M,t,,,,BUSINESSMANIA HOLDING
922743083,2023-01-01,,,P,t,,,,MARK ESCOBEDO
352966782,1989-11-20,,NN,P,t,,,,MOHAMED BOJAADA L ETOILE PARFUM
893378950,2021-01-27,,,P,t,,,,YOUSSEF KHELLADI
922671953,2022-12-28,,,M,t,,,,STONE FOR EAST SEA
688106053,,,,P,t,,,t,BEN ABDESSELAM
537491011,2011-10-01,,,M,t,,,,NUNALIK
918494493,2022-09-01,,,P,t,,,,ERWIN YAO
948396460,2023-01-26,,,M,t,,,,SCI RIDAMARIS
947769642,2023-01-03,,,P,t,,,,AMOR BOUCHAHOUA
948234166,2023-01-02,,,P,t,,,,AICHA AHMAT
948515689,2023-01-11,,,M,t,,,,RENOVARTPLUS
947943320,2023-01-01,,,P,t,,,,BILAL ABBAS
306138900,1977-01-01,2020,51,M,t,GE,2020,,DECATHLON
948320502,2022-12-19,,,M,t,,,,ADIRA
892291915,2021-01-01,,,P,t,,,,ABDOULAYE KEITA
259500023,1980-01-01,2020,22,M,t,PME,2020,,SYNDICAT AZUR
913085916,2022-05-02,,,P,t,,,,CHARLES TOLODE
922947130,2022-07-01,,,P,t,,,,TIHANI TEAROHA
922698824,2023-01-02,,,M,t,,,,HSFP
832199400,2017-09-21,,,M,t,PME,2020,,TAG
334857901,1986-01-26,,,P,t,,,,XAVIER LECLERCQ
948315239,2023-01-23,,,P,t,,,,SELMA BENDAOUD
920195989,2022-10-10,,,M,t,,,,L'ORANGERAIE L'ORANGERAIE
948064621,2023-01-12,,,P,t,,,,GAUTHIER JACQMIN
910269208,2022-02-28,,,P,t,,,,XAVIER BOVIER-LAPIERRE
922749304,2023-01-09,,,P,t,,,,MEY LAOUINI
901523084,2021-07-07,,,M,t,,,,TOITURES SOLEIL
921017646,2023-01-01,,,P,t,,,,MOHAMED ANOUAR KHEDIRI
403730724,1995-10-01,,NN,P,t,,,,CHRISTIAN MONTREUIL CABINET CHRISTIAN MONTREUIL
948320221,2023-01-25,,,M,t,,,,L'ELEGANCE DES FENETRES
947929196,2023-01-24,,,P,t,,,,ULYSSE POMEPUI
948291554,2023-01-23,,,M,t,,,,MS HOLDING
890195860,2020-10-16,,,M,t,PME,2020,,FRAMEX CONSEIL
888528767,2020-08-22,,,M,t,PME,2020,,L2C
921105045,2022-10-27,,,M,t,,,,AJ CHAUFFEUR PRIVEE
948489745,2023-02-01,,,P,t,,,,KARIMA SOUSSAH
948361100,2023-02-15,,,P,t,,,,LIZATA OUEDRAOGO
948345194,2023-01-23,,,P,t,,,,NADJAT LAGUEL
948037155,2023-01-11,,,P,t,,,,NAIM ATTAR
947670709,2022-12-19,,,P,t,,,,ZAKARIA KHEZAM
322347337,1981-07-02,,NN,M,t,,,,LA BOUDINETTE
947462651,2022-11-14,,,P,t,,,,MATTHIAS DUMAINE
383967833,1991-11-01,2019,00,P,t,,,,JEAN MARILLER
911924553,2022-05-02,,,P,t,,,,SARA NOUIOUA
904777661,2021-10-01,,,M,t,,,,NTH NTH
948436704,2023-01-24,,,M,t,,,,UNIVERS CAB
948304126,2023-02-06,,,P,t,,,,JOHN AGBOLI
947963872,2023-01-02,,,P,t,,,,DEMBA BA
402191944,1984-07-01,,NN,P,t,PME,2020,,PHILIPPE RENFER MEMBRE DE LA SCP RENFER VENANT
948312632,2023-02-01,,,P,t,,,,MARC GRUDET
408963973,1996-08-09,,NN,M,t,,,,ITS INTERNATIONAL
889531877,2020-09-30,,,P,t,PME,2020,,BAKARY DIALLO
948294533,2023-01-23,,,P,t,,,,BADREDINE CHEBANI
947865978,2023-01-01,,,M,t,,,,DLP AMENAGEMENT
948020318,2023-01-16,,,M,t,,,,TMF
947876959,2022-12-23,,,M,t,,,,MAINKITHEM
947748950,2022-12-19,,,M,t,,,,L'EXPERTISE DANS LA ASK CONSULTING
948423652,2023-01-18,,,M,t,,,,SKARLETT
912841681,2022-04-06,,,P,t,,,,NOUSSEIBA SAADAT
403067895,1995-10-19,,NN,P,t,PME,2020,,SOPHIE LUONG
922926415,2023-01-02,,,P,t,,,,DOUNIA DHIDAH
922646609,2022-12-01,,,P,t,,,,CHRISTIAN KEVIN DADJIO FOMEJU
948355565,2023-01-06,,,M,t,,,,RAF CONSULTING
889439592,2020-09-29,,,P,t,PME,2020,,MOHAMMED MANIDI
381471481,1991-05-03,2020,02,P,t,PME,2020,,SOUMAIA RTIBI CHABAB COIFFURE
920583788,2022-10-17,,,P,t,,,,PATRICE VARLET
353870306,1990-01-30,,,P,t,,,,ANNE LE BAIL
391319993,1993-06-01,,NN,M,t,,,,PARIS-LIFT
922795232,2023-01-10,,,P,t,,,,HIBA RIZKI
948305420,2023-01-22,,,P,t,,,,ADAM AKRICH
910805662,2022-02-24,,,M,t,,,,HCI RENOVATION
894180777,2021-02-01,,,M,t,,,,IFRANE
948542493,2023-01-19,,,M,t,,,,T-SI TECH
948303169,2023-02-01,,,M,t,,,,REA IMMO 92700
947740379,2022-12-10,,,P,t,,,,THOMAS TALIC
948410550,2023-01-02,,,M,t,,,,PARIS TRANSPORT
948448105,2023-01-25,,,M,t,,,,MANN TRANSPORT
947968913,2022-12-22,,,P,t,,,,AMIRA HATOUT
884102476,2020-07-10,,,P,t,PME,2020,,ABOUBACARI SAKHO
947902375,2023-01-01,,,M,t,,,,TRENSITIS
330377219,1984-02-21,,,M,t,,,t,STEF BERRANDO ET ARIBA
922683107,2023-01-01,,,M,t,,,,T.D.A
948408752,2023-01-01,,,M,t,,,,MANDEM
922890074,2023-01-26,,,P,t,,,,AHMED AGLI
948498662,2023-01-26,,,P,t,,,,SINGH RANJIT
948343173,2023-01-30,,,P,t,,,,CONSTANCE JOYCE ELLA
911894889,2022-03-20,,,P,t,,,,RYAN RAHMANI
948423819,2023-01-02,,,M,t,,,,SMT
352645501,1989-11-27,2020,41,M,t,ETI,2020,,HUBXML KDI HUBXML DEV KDI HUBXML INT KDI
948309372,2023-01-21,,,P,t,,,,VICTOR DUVAL
882510639,2020-03-11,,,M,t,PME,2020,,BIG HUNGRY HUSTLER ENTERTAINENEMENT
948389242,2023-02-01,,,M,t,,,,SCI SYSKON
922838800,2023-01-12,,,P,t,,,,ALEXANDRE BADEY
354040107,1990-03-16,,,M,t,,,,A.3.I
399985753,1994-11-21,,NN,M,t,,,,VIDEO FUTUR EXPANSION
918447376,2022-08-11,,,P,t,,,,SAID CHEURFA
922145040,2022-12-09,,,P,t,,,,SALMA SALMA OUZOUGGATE
922689583,2023-01-02,,,P,t,,,,FATMA TEMZI
404116451,1996-01-02,,NN,P,t,,,,PHILIPPE CALMEL
922889977,2023-01-19,,,P,t,,,,SADIK UZ ZAMAN CHY
922658836,2022-08-01,,,P,t,,,,MARIE-HELENE DURIN
885124024,2020-06-23,,,M,t,PME,2020,,SUPER PIZZA
948523428,2023-02-15,,,P,t,,,,ENDER EROL
332861665,1985-07-01,,NN,P,t,,,,CARLOS GABIRRO DA SILVA
409449923,1996-10-11,,NN,M,t,ETI,2020,,SFCC LCDN LES COMBUSTIBLES DU NORD
922796388,2023-02-09,,,P,t,,,,BOUZID BOUZID LAIOURATE
908515984,2021-12-08,,,M,t,,,,L'AVENUE
948534896,2023-01-01,,,P,t,,,,THEGGY GUIRO
947974184,2023-01-06,,,M,t,,,,FEEL STYLE
900923541,2021-06-25,,,P,t,,,,MOUHAMAD MOUHAMAD SECK
948017256,2023-02-01,,,P,t,,,,IMED KHORCHAN
348583527,1988-09-19,,,P,t,,,,MARIE MADJAR
948379318,2023-01-25,,,M,t,,,,ALIBAT
948366703,2023-02-10,,,P,t,,,,BILEL SACI
948493416,2023-02-15,,,P,t,,,,ARMEL YVER
922667423,2022-12-30,,,P,t,,,,CHERIF CHIA
948442561,2023-01-20,,,P,t,,,,GHEORGHE DERUN
411849433,1997-04-15,,NN,M,t,,,,LE LUTH BAZAR
921979902,2022-11-14,,,M,t,,,,SER SOLUTIONS ECO RESEAUX
905043972,2021-10-21,,,P,t,,,,SAMIR ABADI
908889033,2022-01-01,,,P,t,,,,AXEL SALINIERE
948512108,2023-02-01,,,P,t,,,,IGOR BIZGU
921547501,2022-09-12,,,P,t,,,,JENNIFER SHILLINGFORD
947838934,2023-01-02,,,P,t,,,,ANGIE DUFIET
922926993,2023-01-23,,,P,t,,,,SAIF BOUAKKAZ
325976678,1982-07-07,2020,11,M,t,PME,2020,,MISSION LOCAL INSERT PROF SOCIALE JEUNES
922893185,2023-01-10,,,P,t,,,,CARLA BOYDRON
948263090,2023-01-14,,,M,t,,,,EMEIS CONSEIL
400650602,1995-04-03,,NN,M,t,,,,FORUM GRAPHIC
408493641,1996-08-01,,,P,t,,,,NATHALIE EL KADY
947986857,2023-01-13,,,P,t,,,,TIMOTHEE DUCROS
948426556,2023-02-01,,,P,t,,,,AHMED HASSANI
922914072,2023-01-03,,,P,t,,,,WASSIM KROUF
922740899,2022-07-01,,,P,t,,,,RAPHAEL TAPIRO
411786676,1997-04-03,,NN,P,t,,,,CYRIL BACH
922743190,2023-02-01,,,P,t,,,,SOUKAINA BENTOUMI
905335451,2021-11-22,,,M,t,,,,KV7TECHNO
922796701,2023-01-02,,,M,t,,,,RB EXPRESS
341422319,1987-05-13,,NN,M,t,,,,SOCODIS
922906391,2023-01-26,,,P,t,,,,ALI HASSAN
332184829,1985-02-01,,NN,M,t,,,,VIDEO FUTUR
920826419,2022-10-21,,,M,t,,,,IDEAL MOTORS 92
908005911,2021-11-15,,,P,t,,,,HOUSSEMEDDINE SAKKAL
922889001,2022-12-26,,,M,t,,,,KING AUTO 95
922667134,2022-12-31,,,P,t,,,,AHMED ABDELGHANI BOUKSANI
948380704,2023-01-23,,,P,t,,,,CORINNE BRUNERO
948264411,2023-01-17,,,M,t,,,,SAVOYE CONSULTING
922733852,2023-01-16,,,P,t,,,,ELODIE LATRUBESSE
948421920,2023-01-10,,,M,t,,,,MAHA CONSEIL
888782091,2020-10-01,2020,01,P,t,PME,2020,,ABDELALI ABDEL-ALI BOUAYAD
922854658,2023-01-16,,,P,t,,,,MELISSA SABOUN
919950980,2022-10-01,,,P,t,,,,CARLA YVES NEMATCHOUA
922838974,2022-12-29,,,P,t,,,,DYLAN AZOMBAKIN
895009959,2021-01-28,,,P,t,,,,ANISSA HARIGA
947890844,2022-12-18,,,M,t,,,,DE VILLARDI
404220139,1996-01-02,2020,03,M,t,PME,2020,,VIEWSONIC
922834445,2022-11-05,,,P,t,,,,GILBERT CHALAMET
901554436,2021-07-15,,,M,t,,,,PLUH TEST
922643184,2022-11-28,,,M,t,,,,IKATEL
948533260,2023-01-25,,,M,t,,,,NETT
922936349,2023-02-01,,,P,t,,,,LAURE GUILLET
922737879,2023-01-01,,,M,t,,,,LES DAMES D'ABORD
947604732,2022-11-22,,,P,t,,,,LINDA BEJAOUI
922838917,2023-01-14,,,P,t,,,,YOUCEF BOURENANE
388448110,1992-09-01,,NN,P,t,,,,DANIEL ROSENBLATT LES BONS POULETS DE FRANCE
410888465,1997-02-01,,,M,t,,,,SAINT BENOIT 95
948544663,2023-02-03,,,M,t,,,,ISTACK
947995031,2023-01-09,,,M,t,,,,MALUKU IMMO
948460795,2022-11-15,,,M,t,,,,H2S
403459266,1996-01-01,,NN,P,t,,,,JEROME HAGNEREL
383967056,1991-12-20,2020,12,M,t,PME,2020,,ESCI ACORUS - ESCI
948493945,2023-01-27,,,P,t,,,,YAHIA ZIANE
899558423,2021-05-01,,,P,t,,,,HELENE PENG
948356654,2023-01-05,,,M,t,,,,THINKCHINA
922695911,2022-12-02,,,P,t,,,,CECILE HOUSSET
320948359,1980-10-13,,NN,P,t,PME,2020,,GUILLAUME DUFOUR
948275417,2023-01-20,,,M,t,,,,OAL
913180311,2022-04-25,,,M,t,,,,LA PELLE A BURGER
408771574,1996-07-10,,NN,M,t,,,,SCI LISA
948295530,2023-01-02,,,M,t,,,,F.T. CONSULTING
917971673,2022-07-29,,,P,t,,,,CYNTHIA-VICTORIA EVELANYOU
785277187,,,,P,t,,,t,MICHEL PERRIN
922767694,2023-01-16,,,P,t,,,,KARIMA AISSANI
948016431,2023-01-11,,,P,t,,,,FATIMATA BATHILY
922743372,2023-01-06,,,P,t,,,,ARAB HAMZA
947875779,2023-01-02,,,P,t,,,,ALEXANDRE FERMO
922946801,2023-01-30,,,P,t,,,,HAZRATULLAH SAHIL
922626411,2022-11-04,,,M,t,,,,JASM1
948049796,2023-01-10,,,M,t,,,,BOLIFT & TRANSPORT
947911103,2023-01-03,,,M,t,,,,ELDAR
918511577,2022-09-12,,,M,t,,,,OTL ONAY-TRANSLOG
948054424,2023-01-11,,,P,t,,,,AHMED AHMED BACHIR
890435449,2020-11-01,,,P,t,PME,2020,,HANANE HALIL
948014147,2023-01-10,,,M,t,,,,TOP FORMA
922662978,2022-12-30,,,P,t,,,,MANDANA MARZBANI
904545944,2021-11-10,,,P,t,,,,SIDI MOHAMMED MEZRAI
948526892,2023-01-16,,,P,t,,,,KUJTIM KUKLECI
948420674,2023-01-26,,,M,t,,,,ASED ATLAS TOUBKAL
947985057,2023-01-16,,,P,t,,,,NAJMEDDINE HARB
891363582,2020-11-24,,,M,t,,,,SCI GB ST ROCH
947939377,2023-01-06,,,P,t,,,,ABDELHAK KHAYAT
917924516,2022-08-01,,,P,t,,,,NAJET BOUMIA
948243746,2023-01-04,,,P,t,,,,JHON HERRERA ISAZA
922307764,2022-12-15,,,P,t,,,,VALENTIN DELNATTE
948336383,2023-01-12,,,M,t,,,,SCI DELAROA PMCV
922868153,2023-01-24,,,P,t,,,,REMY AJASSE
325451854,1982-09-01,,,P,t,,,,PASCAL KLEIN SAVANAH
922796958,2023-01-10,,,M,t,,,,TMR TRAVAUX MULTI-RESEAUX
922892468,2023-01-19,,,P,t,,,,MOHAMED AYMEN GHODHBAN
947991634,2023-01-10,,,P,t,,,,RAYAN AYACHE
922145180,2022-12-21,,,P,t,,,,ANISSA FATMI
948499413,2023-01-01,,,M,t,,,,CINQUIEME SENS
948376553,2023-01-01,,,M,t,,,,EP ESTHETIQUE PROJECT
948467295,2023-01-09,,,M,t,,,,LABORATOIRE DELAROM
948354618,2023-01-12,,,M,t,,,,SCI DANN
922212527,2022-12-12,,,M,t,,,,CLEAN RENOV
922625512,2023-01-09,,,M,t,,,,PHARMACIE DU CENTRE GALLIENI
947867248,2023-01-04,,,P,t,,,,AHMED SELHAMI
922650072,2022-12-29,,,P,t,,,,ENZO ONTENIENTE
947883302,2023-02-01,,,P,t,,,,YUN JUNG KOVAC
410356257,1996-12-10,,NN,M,t,,,,GG014
947873501,2023-01-15,,,M,t,,,,RSN FORMATION
313631715,1978-01-01,,NN,M,t,,,,LES MACONS
948303870,2023-01-10,,,M,t,,,,CANOPEE
410491906,1984-01-01,,NN,P,t,,,,GERARD BLIN
922929955,2023-02-01,,,P,t,,,,EUGENIE HERBERT
948450689,2023-01-06,,,M,t,,,,NYNA TRANSPORT
948456306,2023-01-14,,,M,t,,,,GREEN EMBALLAGES
922725130,2022-12-23,,,P,t,,,,REDA ES-SAHLI
948291505,2023-01-19,,,M,t,,,,AYEB
922727912,2023-01-05,,,P,t,,,,MERYEM REMLI
883918419,2020-02-26,,,M,t,PME,2020,,SPE
922899653,2023-01-20,,,P,t,,,,ETHAN MINTANDJIAN
922641154,2022-12-12,,,M,t,,,,IT WORD TECH
922707849,2023-01-03,,,P,t,,,,RAVENDRAKUMAR MUTHULINGAM
947770889,2023-02-01,,,P,t,,,,MYRIAM EL KHATI
922688569,2023-01-02,,,P,t,,,,GERMAIN FRESSE
922119870,2022-12-02,,,M,t,,,,TRANSKAIS
948391966,2023-01-10,,,M,t,,,,SCI FIDIA
948007174,2023-01-02,,,M,t,,,,A.KAN SERVICES
911658649,2022-04-01,,,P,t,,,,OVADIA SAUL
900744558,2021-06-22,,,M,t,,,,NOUKIDS
408335958,1996-07-19,,NN,M,t,PME,2020,,JADE
948431960,2023-01-11,,,M,t,,,,FAST SERVICE
947979134,2023-01-09,,,M,t,,,,KMD NETTOYAGE
922805155,1976-07-10,,,M,t,,,,SDC RESIDENCE LE SAULE
353296213,1990-01-01,,NN,P,t,,,,FRANCOISE GAUCHOIS
947843090,2023-01-01,,,P,t,,,,MARINE RIGAL
947673638,2023-01-01,,,P,t,,,,YACINE ZERZOUR
922790209,2023-01-10,,,P,t,,,,NOEMIE CATHERINE
947925335,2022-07-05,,,M,t,,,,LONDON ACADEMIE
392861019,1993-10-28,2020,11,M,t,ETI,2020,,FINAGRAL
394630628,1993-07-01,,NN,P,t,PME,2020,,PASCAL COTTIAS
948291570,2023-01-17,,,M,t,,,,AMC ALVESMCUT COIFFURE
947985172,2023-01-16,,,P,t,,,,KANDIA DOUCARA
912304797,2022-03-10,,,M,t,,,,LOCA RENT
922851944,2023-02-06,,,P,t,,,,NDEYE TAPA TAPA
393402201,1993-12-01,2020,01,M,t,ETI,2020,,ISOLATION BY TRYBA
898789540,2021-01-01,,,P,t,,,,RAYMOND SY
947998241,2023-01-01,,,P,t,,,,BRAHIM CHAKIR
947897799,2023-01-01,,,P,t,,,,INGRID DUPRE
947950218,2022-12-17,,,M,t,,,,ALMA TRANSPORT
338203672,1986-07-01,,NN,M,t,,,,RESERCO RECHERCHE ET SERVICE POUR COLLECTIVITE
947879797,2023-01-04,,,P,t,,,,MOULOUD KEBAILI
410367445,1996-12-19,,NN,M,t,PME,2020,,WW001
948333745,2023-01-16,,,P,t,,,,JULIEN SUEUR
948391909,2023-01-12,,,M,t,,,,IMMOTOUTPRIX
948503412,2023-01-03,,,M,t,,,,MSA RENOVATION
323999003,1976-01-01,,,M,t,,,,GARAGE DE LA BUTTE BLANCHE
894014141,2021-01-21,,,P,t,,,,MOUNIR AIT BELKAS
338813991,1986-09-01,,,M,t,ETI,2020,,SODICA SOCIETE DE DISTRIBUTION DE COMPOSANTS D'ASCENSEURS
948315015,2023-01-23,,,M,t,,,,SMART DEPANNAGE
948032198,2022-11-28,,,M,t,,,,SCI MSEK
947879391,2022-11-29,,,P,t,,,,JAY LLANES
947685855,2022-12-05,,,P,t,,,,ABDELRAZEK ABOUELSEOUD
948248935,2023-01-15,,,P,t,,,,RAYAN ATTIGUI
922863279,2022-11-14,,,M,t,,,,4F ETANCHE
948342282,2023-01-24,,,P,t,,,,GLEYCIANNE LEITE NOGUEIRA
398914192,1994-05-01,,NN,P,t,,,,FADOI GHANDOUR
948412382,2023-01-23,,,M,t,,,,ALMA B
922936034,2023-01-30,,,P,t,,,,YASMINE NADINE AIDOUD
891218158,2020-11-06,,,M,t,PME,2020,,ENERGY EFFICIENCY TECHNOLOGIES
394606925,1994-04-01,,NN,M,t,,,,STI
922144977,2022-12-12,,,P,t,,,,AMPHAI RUANGCHAN
394512701,1994-04-29,,,P,t,,,,SISAK BILBULYAN KALIW KA
915350557,2022-07-08,,,M,t,,,,HANNIBAL DISTRIBUTION
947978045,2022-12-27,,,M,t,,,,ETXERA
348902230,1988-06-24,,NN,M,t,,,,JAURES VOYAGES
399295617,1994-12-08,,NN,M,t,,,,LES GREENS DE MIGNALOUX BEAUVOIR
408865475,1996-08-20,,NN,P,t,,,,BRUNO BRISON
488242066,2005-12-12,,,P,t,PME,2020,,YACINE KELLIB
922671599,2022-12-01,,,M,t,,,,RECRUTIUM
948278676,2023-01-19,,,M,t,,,,REM CONSULT REM CONSULT SASU
883645756,2020-01-29,,,M,t,PME,2020,,BURO SHOP MOBILIER
922640677,2023-01-02,,,P,t,,,,NADIA BENISSAD
948358528,2023-01-24,,,M,t,,,,DE FARIA
922781398,2022-11-14,,,M,t,,,,GUIBLI
909353823,2022-01-13,,,M,t,,,,LUMEN HISTORY SAS
899833818,2021-05-31,,,M,t,,,,WYN TAXI
948337795,2023-01-19,,,M,t,,,,LES GETS
912799848,2022-04-20,,,M,t,,,,RENOV STYLE
947914073,2023-01-15,,,P,t,,,,RYS SIHEM BEDANI
889169165,2020-09-22,,,P,t,PME,2020,,SOFIANE KHALFALLAH
905195715,2021-11-05,,,M,t,,,,KH ENTREPRISE
922659958,2023-01-01,,,P,t,,,,MAHDI MENASRIA
922063441,2022-11-04,,,M,t,,,,SG TRAVAUX
301469474,1982-04-01,,NN,M,t,,,,SOCIETE EN NOM COLLECTIF LOISEAUX HAMEL
921937348,2022-11-28,,,M,t,,,,KM DRIVE
922767421,2023-01-07,,,P,t,,,,DAYSSON LOURENCO ALVES GOMES
948335104,2023-01-12,,,M,t,,,,DADO CONSULTING
948396973,2023-01-07,,,M,t,,,,MS DEPANNAGE
922940333,2023-01-25,,,P,t,,,,THOMAS LANDI
339674194,1986-12-19,,,P,t,PME,2020,,AZOUAOU BELABBAS
948356597,2023-01-16,,,P,t,,,,VICTOR NEGRUTA
920778842,2022-10-20,,,P,t,,,,EMMANUELLE ZONIABA MEME
920145323,2022-11-01,,,M,t,,,,LPV LE PETIT VENDOME
947716007,2022-12-15,,,P,t,,,,DIFI ALGER
948246889,2023-01-18,,,M,t,,,,CAVOH
947867719,2023-01-03,,,M,t,,,,COM-ELEC
947967600,2023-01-03,,,M,t,,,,VERTECH
922879366,2023-02-13,,,P,t,,,,ANIS HAMIDI
905036984,2021-10-15,,,M,t,,,,MY JOY
948456868,2023-01-13,,,M,t,,,,LA BOITE DE TECH
387557804,1992-05-25,,NN,M,t,,,,SCI FELIX FAURE N°82
948425871,2023-02-01,,,P,t,,,,JOEL FUAKA SEPE
382262293,1991-05-17,,NN,P,t,,,,ORLANDO DIAS L'ALLIANCE
399772698,1995-01-01,2020,01,M,t,PME,2020,,BACK STAGE EVENEMENTS
920726460,2022-09-01,,,M,t,,,,PRO INSTAL BAT
947855474,2023-01-02,,,M,t,,,,TERVEL
922743414,2023-01-06,,,P,t,,,,LOUIS JAKUBOWSKI
948020920,2023-01-09,,,P,t,,,,AHMED TRIKI
948494174,2022-12-03,,,P,t,,,,ALAIN JAY
947907622,2022-12-27,,,M,t,,,,TAXIS DRIVER
378821771,1990-05-31,2020,12,M,t,ETI,2020,,EDWARDS SAS
948479357,2023-01-23,,,M,t,,,,PLW PRETTY LITTLE WINGS
948449764,2023-01-27,,,P,t,,,,LUKASZ KAJA
948396114,2023-01-18,,,M,t,,,,STYL'HAIR
947881165,2023-01-04,,,P,t,,,,MAREK LIPSKI
948519459,2023-02-01,,,P,t,,,,SYRABOULA DIALLO
948410642,2023-01-12,,,P,t,,,,DIAKA SAKHO
922762596,2023-01-07,,,P,t,,,,MARIE-LAURE DUBUISSON
948426911,2023-01-16,,,M,t,,,,MONSENEGO & FILS
948265640,2023-01-20,,,P,t,,,,YAWA GNABA
948461199,2023-01-26,,,M,t,,,,SAS UNIQ NYLNETTOIYAGE78
947615803,2022-12-02,,,P,t,,,,FADOUA BOULAL
948007661,2022-12-09,,,M,t,,,,BM INVEST
344157029,1988-02-18,,NN,M,t,,,,GUENEAU INDUSTRIES
922696158,2022-12-16,,,M,t,,,,CINESTIL EVENTS
919586123,2022-09-21,,,P,t,,,,ESTEBAN PINAULT
948010483,2022-12-13,,,M,t,,,,EL MEDINA
392465936,1993-07-08,,NN,P,t,PME,2020,,THIERRY MASSIET
948494281,2023-01-26,,,P,t,,,,YOUSSEF CAMARA
914812508,2022-06-23,,,M,t,,,,TRALIF BOIS CO
387534548,1992-06-01,,NN,M,t,,,,TECHAUTO
922854641,2023-01-17,,,P,t,,,,OLIVIER GEORGES NDOUMBE TOUKOUROU
452424286,2004-02-27,,NN,M,t,,,,ELLIPSE
948335849,2023-01-04,,,M,t,,,,E.V.A.Z.
948009725,2023-01-01,,,M,t,,,,ARIAX
948447867,2023-01-23,,,M,t,,,,KOUGELAIT
338747553,1986-08-11,,NN,M,t,PME,2020,,ONIT OMNIUM NATIONAL INDUSTRIEL ET TECHNIQUE
948407481,2023-01-24,,,M,t,,,,IVEO - AUDIT CONSEIL EXPERTISE
947680799,2022-12-23,,,P,t,,,,MAMADOU SINERA
948268248,2022-12-07,,,M,t,,,,LDDC CONSEIL & RECRUTEMENT
918562224,2022-07-18,,,M,t,,,,ALPHA INCENDIE
552117012,1980-10-15,,NN,M,t,,,,M APPLIED TECHNOLOGIES
908726870,2021-12-23,,,M,t,,,,EHO L'ECOLE HOTELIERE
912791597,2022-04-17,,,P,t,,,,INES FEHRI
948440714,2023-01-26,,,M,t,,,,LARHAT
915124580,2022-06-22,,,M,t,,,,GLOBAL ACADEMY
405191206,1996-03-01,,NN,M,t,,,,AUTO PISTE
947978433,2023-01-09,,,P,t,,,,TOM GERNEZ
948252234,2023-01-01,,,P,t,,,,IVAN HUTSULIAK
948288154,2023-01-21,,,P,t,,,,RENE MARCEL ZOZO
948006085,2023-01-01,,,P,t,,,,YOLAINE TAVARES
922857016,2023-01-28,,,P,t,,,,ANTONIN VICEDO
948413752,2023-01-16,,,M,t,,,,V.I.E IMMOBILIER
922755954,2022-11-01,,,M,t,,,,GOURMET'S CAFE 95
922761259,2023-01-09,,,P,t,,,,DANGI AJAY
947890646,2023-01-03,,,M,t,,,,SCI FAMILLE YE
922061940,2022-10-01,,,P,t,,,,KEVIN BIZ
947866455,2023-01-20,,,P,t,,,,HACENE LAOUEDJ
403351976,1995-01-02,,NN,P,t,,,,ANNIE ARLAUD
948235536,2023-01-23,,,P,t,,,,SHANEIZ BOUCHERIT
922851415,2023-01-12,,,P,t,,,,ABDELKADER MANSOURI
922108519,2022-10-21,,,M,t,,,,O'CHIKEN D'OR
947907879,2022-02-21,,,M,t,,,,SAKA IMMOBILIER
398248443,1994-07-01,,NN,P,t,PME,2020,,STEPHANE TOMEI CABINET STEPHANE TOMEI
882308968,2020-03-09,,,P,t,PME,2020,,MARIE-OLIVIA LAPIERRE
909419889,2022-01-03,,,P,t,,,,NACHY PRINCE NIANGA ITOUA
919536995,2022-09-01,,,P,t,,,,CLAYD ORTICA
948055843,2023-01-10,,,P,t,,,,HUGO PEROCHON
948413760,2023-01-26,,,M,t,,,,ANA TRANSPORT
410466940,1996-12-27,,NN,M,t,,,,BB205
922899372,2023-01-21,,,P,t,,,,CHLOE DERRIEN
393800115,1994-02-15,,NN,M,t,,,,A.B.C.
947922191,2023-01-04,,,M,t,,,,AS AVRON
948010822,2023-01-03,,,P,t,,,,LINDA BAOUDJ
947897211,2022-07-09,,,P,t,,,,EVA DANTEC
948354154,2023-01-23,,,P,t,,,,EDNAR AMAVI-TEKLE
915205835,2022-07-01,,,M,t,,,,MATERANVI
913822789,2022-05-18,,,P,f,,,,""
922822861,2023-01-11,,,P,t,,,,MAELLE BABOURAM
922837778,2023-01-12,,,P,t,,,,DOUNYA ZEROUNI DOUNYA
907450142,2021-10-19,,,M,t,,,,BEST LOC
889339305,2020-09-24,,,P,t,PME,2020,,ILONA RAZAKAZAFY
920814746,2022-10-20,,,P,t,,,,AHMED ASMANI
922010145,2022-10-20,,,P,t,,,,LYNDA ZHU
922866843,2023-01-17,,,P,t,,,,MIRZA MAROTSAHA
922150685,2022-12-08,,,P,t,,,,CIFTCI MUHAMET
911848927,2022-02-21,,,P,t,,,,NATHALIE PLACERDAT
948372743,2023-01-01,,,P,t,,,,TAYSSIR KHANNOUSSI
948249529,2023-01-13,,,M,t,,,,MON COACH COURTIER
922754668,2022-10-26,,,M,t,,,,BM. MUKABS SERVICES
922093927,2022-12-01,,,M,t,,,,NOSN
922846035,2023-01-13,,,P,t,,,,TRACY VILLORDIN
921953253,2023-01-02,,,P,t,,,,YOUVA BENSLIMANE
411331275,1997-04-01,,NN,P,t,,,,JOSE DA SILVA VICENTE
948515408,2023-01-16,,,P,t,,,,JULIEN MARTY
948248950,2023-01-20,,,M,t,,,,TRANS EXPRESS
420782880,1998-11-05,,,M,t,,,,SCI SAMANTHA
412893406,1997-07-01,,NN,M,t,,,,SCI ATTIA-ROMAIN
948302146,2023-01-21,,,M,t,,,,SAS NORD SUD TRANSIT COLIS
320431174,1980-11-01,,NN,M,t,ETI,2020,,GARRETT MOTION FRANCE A
922667100,2022-12-30,,,P,t,,,,YASMINA ET TAHERY
922761986,2023-01-10,,,P,t,,,,ZINEB TALHA
905182747,2021-11-20,,,P,t,,,,JULIO VENTURA BITTENCOURT
775672272,1952-05-11,2020,53,M,t,GE,2020,,CRF CROIX ROUGE FRANCAISE
301440434,1900-01-01,,NN,P,t,,,,AGROUR MBARK
307826263,1983-01-01,,NN,P,t,,,,ALI BENKACI LA GARENNE
313237752,1978-01-01,,NN,P,t,,,,SAID LAABOUS
321588055,1981-04-02,,NN,P,t,,,,HERMIDA LOUZAO
334662194,1986-12-27,,,P,t,,,,SAID SOUAI
335349353,1985-06-01,,NN,P,t,PME,2020,,SMITH CREEDY
338071053,1986-06-18,2020,21,M,t,ETI,2020,,LB LA BRENNE
352064836,1989-10-01,,NN,M,t,,,,MUSIQUE SYSTEMES
352632673,1989-12-01,,NN,P,t,,,,PHILIPPE PALLOIS TECANIQUES ET PERFORMANCES
394331896,1994-03-14,,NN,M,t,PME,2020,,PROGRAMART FRANCE
398033043,1994-07-28,,NN,M,t,,,,H.L.
398480665,1994-10-10,,NN,M,t,,,,F.G.D.
400074241,1995-02-13,,NN,P,t,,,,THIERRY CATEZ LES COLONNES
402706527,1995-09-25,,NN,P,t,,,,MOHAMED-AHMED KOUCHE ALIMENTATION GENERALE
403419187,1995-12-11,,NN,M,t,,,,SERVICE AGENDA
413750712,1997-10-01,,,P,t,PME,2020,,SAMIR BENTOUMI
353554082,1990-02-07,,NN,P,t,,,,KHOUDIR MEKHAZNI
378614846,1990-08-06,,NN,P,t,,,,ABDELKRIM HATIMY
385386354,1992-05-01,,NN,M,t,PME,2020,,F.P.CONSEILS
388474496,1992-07-01,,NN,M,t,PME,2020,,SYND COPROPRIETE 7 RUE VICTOR MERIC
389089665,1992-11-06,,NN,P,t,,,,TEOFILO CARVALHO
389572520,1992-12-22,,NN,M,t,PME,2020,,PRESSE + BASE
390623452,1993-03-22,2020,12,M,t,PME,2020,,SM PUBLISHING (FRANCE) SAS
390791283,1993-03-12,,NN,M,t,,,,SIRIUS PRODUCTION
393833702,1994-01-17,,NN,M,t,,,,L'AMUSE BOUCHE
827655598,2017-02-01,,,M,t,PME,2020,,WELL TECH
