naf_revision_type_id,id,nom,niveau,parent_naf_type_id
NAFRev1,01,"Agriculture, chasse, services annexes",3,AA
NAFRev1,02,"Sylviculture, exploitation forestière, services annexes",3,AA
NAFRev1,05,"Pêche, aquaculture, services annexes",3,BA
NAFRev1,10,"Extraction de houille, de lignite et de tourbe",3,CA
NAFRev1,11,Extraction d'hydrocarbures ; services annexes,3,CA
NAFRev1,12,Extraction de minerais d'uranium,3,CA
NAFRev1,13,Extraction de minerais métalliques,3,CB
NAFRev1,14,Autres industries extractives,3,CB
NAFRev1,15,Industries alimentaires,3,DA
NAFRev1,16,Industrie du tabac,3,DA
NAFRev1,17,Industrie textile,3,DB
NAFRev1,18,Industrie de l'habillement et des fourrures,3,DB
NAFRev1,19,Industrie du cuir et de la chaussure,3,DC
NAFRev1,20,Travail du bois et fabrication d'articles en bois,3,DD
NAFRev1,21,Industrie du papier et du carton,3,DE
NAFRev1,22,"Edition, imprimerie, reproduction",3,DE
NAFRev1,23,"Cokéfaction, raffinage, industries nucléaires",3,DF
NAFRev1,24,Industrie chimique,3,DG
NAFRev1,25,Industrie du caoutchouc et des plastiques,3,DH
NAFRev1,26,Fabrication d'autres produits minéraux non métalliques,3,DI
NAFRev1,27,Métallurgie,3,DJ
NAFRev1,28,Travail des métaux,3,DJ
NAFRev1,29,Fabrication de machines et d'équipements,3,DK
NAFRev1,30,Fabrication de machines de bureau et de matériel informatique,3,DL
NAFRev1,31,Fabrication de machines et appareils électriques,3,DL
NAFRev1,32,"Fabrication d'équipements de radio, télévision et communication",3,DL
NAFRev1,33,"Fabrication d'instruments médicaux, de précision, d'optique et d'horlogerie",3,DL
NAFRev1,34,Industrie automobile,3,DM
NAFRev1,35,Fabrication d'autres matériels de transport,3,DM
NAFRev1,36,Fabrication de meubles ; industries diverses,3,DN
NAFRev1,37,Récupération,3,DN
NAFRev1,40,"Production et distribution d'électricité, de gaz et de chaleur",3,EA
NAFRev1,41,"Captage, traitement et distribution d'eau",3,EA
NAFRev1,45,Construction,3,FA
NAFRev1,50,Commerce et réparation automobile,3,GA
NAFRev1,51,Commerce de gros et intermédiaires du commerce,3,GA
NAFRev1,52,Commerce de détail et réparation d'articles domestiques,3,GA
NAFRev1,55,Hôtels et restaurants,3,HA
NAFRev1,60,Transports terrestres,3,IA
NAFRev1,61,Transports par eau,3,IA
NAFRev1,62,Transports aériens,3,IA
NAFRev1,63,Services auxiliaires des transports,3,IA
NAFRev1,64,Postes et télécommunications,3,IA
NAFRev1,65,Intermédiation financière,3,JA
NAFRev1,66,Assurance,3,JA
NAFRev1,67,Auxiliaires financiers et d'assurance,3,JA
NAFRev1,70,Activités immobilières,3,KA
NAFRev1,71,Location sans opérateur,3,KA
NAFRev1,72,Activités informatiques,3,KA
NAFRev1,73,Recherche et développement,3,KA
NAFRev1,74,Services fournis principalement aux entreprises,3,KA
NAFRev1,75,Administration publique,3,LA
NAFRev1,80,Education,3,MA
NAFRev1,85,Santé et action sociale,3,NA
NAFRev1,90,"Assainissement, voirie et gestion des déchets",3,OA
NAFRev1,91,Activités associatives,3,OA
NAFRev1,92,"Activités récréatives, culturelles et sportives",3,OA
NAFRev1,93,Services personnels,3,OA
NAFRev1,95,Activités des ménages en tant qu'employeur de personnel domestique,3,PA
NAFRev1,96,Activités indifférenciées des ménages en tant que producteurs de biens pour usage propre,3,PA
NAFRev1,97,Activités indifférenciées des ménages en tant que producteurs de services pour usage propre,3,PA
NAFRev1,99,Activités extra-territoriales,3,QA