"idmutation","idloc"
298,"989834865147"
440,"989404243034"
527,"920538570308"
810,"983364596651"
117,"982887971627"
470,"980545862651"
353,"929014811354"
364,"982545644158"
360,"980816713809"
499,"981799398169"
170,"980933294687"
864,"984149813214"
797,"980860734232"
531,"984571673266"
697,"981093250229"
110,"988773197457"
27,"982382727703"
552,"984635330260"
655,"987083598084"
606,"986901229189"
34,"983799796293"
879,"987142433118"
767,"980381615206"
787,"982532595014"
133,"927046356504"
803,"980817739481"
275,"986897744704"
102,"980927863160"
59,"970355386885"
241,"921602553505"
402,"980211464471"
388,"985520206372"
706,"985084095454"
252,"981387095397"
444,"987095972233"
92,"984050524697"
296,"920352684958"
309,"985484536979"
905,"981380101299"
820,"983349978296"
527,"986906648382"
57,"926604972028"
160,"988844827010"
795,"980705604915"
520,"985848562154"
142,"987800604220"
485,"985100854731"
536,"988630915449"
726,"988794207824"
105,"983259773402"
889,"929964760807"
56,"987800604220"
343,"985940593836"
818,"985600955067"
794,"927997976108"
701,"982625494759"
713,"973951028775"
48,"980979304096"
832,"984628704023"
632,"980053034803"
608,"972851829126"
970,"988773197457"
764,"982427739246"
930,"929700272495"
969,"988845853631"
165,"980116191690"
113,"982311459903"
837,"986387556623"
644,"986425347459"
670,"983199267074"
903,"986172548927"
225,"987123498214"
111,"974683146885"
109,"988758091604"
951,"983304129298"
616,"980447171990"
877,"985100854731"
270,"980723393567"
340,"983481839586"
605,"985346539935"
88,"983083579886"
61,"985871268816"
227,"986874416949"
619,"982567429944"
436,"984243420883"
478,"989792600266"
262,"981690898385"
479,"989218782881"
378,"922981276933"
468,"986461689034"
276,"987123498214"
897,"986147375789"
780,"984050524697"
448,"985520491736"
618,"987062303200"
438,"982789263451"
449,"988758091604"
130,"988016028532"
328,"986550162998"
442,"982778095220"
585,"986608550394"
190,"921125435726"
656,"981267162865"
345,"987498119592"
218,"989274196756"
182,"984406507953"
636,"982201648629"
910,"983802167867"
286,"986534564733"
317,"985561077567"
424,"970162103679"
305,"984780664483"
114,"987667763618"
178,"986026149228"
855,"988113588748"
772,"929700272495"
322,"982408739890"
743,"981198676207"
368,"981384594864"
193,"986976930584"
70,"985179695596"
238,"985787046012"
933,"986979511226"
158,"985848562154"
554,"984691612237"
719,"974474320509"
761,"986369991277"
547,"985281019753"
152,"986126059502"
83,"986457755340"
595,"984050524697"
676,"986532289483"
592,"980310987234"
933,"922369356420"
106,"988351400175"
613,"986598115644"
605,"983546607136"
953,"982443882757"
84,"989218782881"
869,"981331118346"
515,"973059812266"
492,"974474320509"
335,"971625772025"
619,"981796913925"
639,"982842199382"
411,"986633582695"
832,"986026149228"
818,"985911505428"
728,"988845853631"
396,"954399741935"
734,"983281706893"
177,"983546607136"
580,"980143939511"
479,"986402014623"
516,"980490235559"
420,"972851829126"
423,"989738466939"
823,"989615879129"
504,"984050524697"
741,"982404389615"
59,"981752964813"
180,"980453808627"
514,"981695439498"
207,"989161539010"
123,"987319152250"
818,"986906648382"
13,"987143462216"
404,"982637982413"
570,"921753978295"
663,"986322823902"
79,"927997976108"
980,"928948450083"
371,"987665435050"
132,"988801218385"
863,"981267162865"
847,"984311406207"
463,"924892326650"
798,"986464992465"
881,"989144199395"
390,"986979511226"
849,"980990259876"
224,"988968448226"
982,"980528151725"
273,"987851865118"
301,"983278965851"
881,"983833643898"
73,"984783169374"
579,"981301029212"
433,"989710306828"
952,"986239309423"
781,"970162103679"
153,"989921286970"
722,"989763517348"
776,"985102159352"
451,"984430462992"
135,"923466567256"
763,"986025718700"
522,"981129527932"
821,"989675829637"
428,"983199267074"
653,"972851829126"
538,"989108734653"
146,"987424951004"
19,"986976930584"
779,"980122733543"
293,"980310987234"
562,"981093250229"
305,"987748851198"
742,"987474779952"
808,"985994888215"
717,"980559553710"
364,"984571673266"
61,"989871889778"
628,"988112814876"
289,"980257305377"
838,"988129217452"
126,"980474420915"
171,"981965568469"
836,"984857317193"
125,"980347071126"
568,"986544824267"
671,"982311459903"
432,"985625075267"
496,"989097321312"
67,"980347071126"
175,"987737752995"
621,"925238914686"
792,"985419244662"
204,"982443882757"
453,"983505332923"
946,"982437352722"
605,"986206381391"
517,"984794874888"
697,"989751657369"
806,"984857926417"
526,"988801218385"
730,"987474328249"
904,"989805240833"
898,"982881732280"
545,"980450087742"
362,"982824529408"
992,"989615879129"
943,"988578428531"
208,"980687220133"
33,"987740446980"
797,"924440170340"
253,"980143939511"
395,"981891511116"
679,"977800814007"
876,"989736544422"
740,"980182984930"
156,"920485065441"
422,"982823176962"
537,"985971135942"
678,"985963327170"
677,"989751657369"
16,"988813572464"
920,"989736544422"
818,"988044442434"
830,"923596822040"
854,"988407478820"
573,"984635330260"
783,"983541559157"
149,"985643242186"
529,"989521463415"
345,"988533996443"
773,"982407495304"
195,"988211934406"
826,"971658540308"
336,"986172548927"
738,"986544824267"
740,"988233334892"
230,"981161282300"
229,"986691245254"
423,"980297836040"
549,"980436134487"
381,"986874416949"
264,"975555745115"
705,"986464992465"
574,"980310987234"
348,"984721901030"
361,"984628704023"
362,"986598115644"
602,"987083598084"
619,"980384170865"
568,"988334633090"
859,"983954028577"
523,"920320131227"
337,"923544329120"
461,"989391701123"
451,"982575663506"
235,"980927863160"
384,"986544824267"
190,"924753518186"
143,"981058519809"
302,"988600441335"
236,"981508998161"
704,"982122841701"
122,"989336681629"
882,"984311406207"
547,"987154665867"
236,"987458270518"
578,"987740446980"
893,"985212291933"
679,"986778083418"
506,"981048059011"
174,"982889135858"
119,"924469558264"
138,"989978938658"
296,"988813572464"
476,"977800814007"
877,"985466303557"
833,"984197561799"
934,"987319040597"
69,"985911505428"
831,"982532595014"
609,"988656243075"
312,"980053034803"
164,"977473050228"
622,"982866250434"
888,"985536643926"
75,"988102488116"
103,"984446743086"
673,"926334719145"
795,"985778301721"
719,"987792388971"
787,"984448990435"
701,"974683146885"
286,"986425347459"
359,"985484536979"
879,"983772381046"
173,"981331118346"
628,"981097656656"
298,"983643222575"
973,"986025704028"
663,"978074959900"
729,"986778083418"
418,"986322823902"
663,"988628777605"
977,"984446743086"
983,"983135802787"
32,"988758091604"
441,"980310987234"
817,"974321801723"
68,"927201866808"
740,"980141069506"
442,"988713104215"
984,"985603504684"
113,"980990259876"
804,"989023862848"
429,"988801218385"
728,"984543924516"
323,"928992498727"
969,"989755037440"
790,"986425747289"
248,"954792703087"
66,"987718495039"
211,"977800814007"
166,"983688588295"
80,"981557733524"
84,"982778095220"
754,"981135044332"
631,"989211133020"
905,"987322301959"
687,"989755037440"
534,"988667221430"
695,"989161539010"
241,"983272196631"
394,"982250987186"
693,"983567758445"
331,"986897744704"
936,"987132887632"
756,"987735502618"
667,"982408739890"
696,"982357041942"
37,"980679141374"
649,"985166085906"
686,"986522876352"
241,"987792388971"
664,"989858796720"
247,"972518520261"
457,"986459740599"
422,"980530969334"
660,"984842272392"
461,"984160728778"
452,"988757617610"
731,"982881732280"
626,"984150254214"
310,"988958516349"
249,"985461075559"
860,"980490235559"
672,"989675829637"
172,"984093790200"
38,"980079092999"
774,"988667221430"
481,"980611964504"
357,"983363728597"
318,"987937860531"
705,"981058104648"
503,"981177056633"
829,"988053903407"
829,"980405685024"
666,"989736544422"
535,"989857528466"
334,"920352684958"
455,"988516089796"
249,"983785492721"
963,"986091446930"
465,"981404618329"
491,"987001840268"
193,"987435434641"
930,"980316259992"
923,"980927863160"
278,"987132887632"
173,"975555745115"
764,"987008454241"
692,"978736964693"
258,"929595522798"
970,"983423824671"
562,"987123498214"
37,"975690123881"
61,"988464931253"
559,"984938649231"
25,"983343440705"
873,"980866035075"
395,"989666153905"
563,"983736480820"
615,"985181953054"
801,"983344971173"
553,"987892649164"
960,"987439507142"
548,"982725132018"
487,"986357070041"
224,"982598517979"
166,"982250437093"
743,"978921255933"
367,"982996924024"
705,"983654880190"
813,"988887645949"
649,"928948450083"
967,"982122841701"
326,"985959443368"
162,"980679141374"
456,"987474328249"
806,"929700272495"
663,"984238932241"
685,"986172548927"
762,"954792703087"
886,"981159481560"
246,"982566879769"
772,"982283296734"
30,"986387556623"
888,"980436134487"
829,"983785492721"
732,"987205159575"
145,"982427739246"
942,"989250638245"
837,"989008556146"
516,"986468211731"
593,"986633582695"
775,"971658540308"
877,"989097321312"
265,"928247645439"
139,"986550162998"
806,"982887971627"
215,"987982401136"
861,"980483698027"
364,"987765358608"
621,"986532289483"
263,"922475054112"
500,"984066004186"
914,"987510451681"
478,"985100854731"
259,"982209048337"
309,"986685491083"
878,"989347559852"
973,"986482871236"
12,"922475054112"
209,"989579827939"
770,"972787488578"
385,"983343440705"
381,"981488219917"
191,"983469181914"
702,"988516089796"
594,"983754963756"
271,"985181953054"
477,"983762718479"
98,"985687580007"
72,"987271163383"
306,"988656243075"
434,"927997976108"
58,"982443882757"
405,"986607899012"
140,"988628777605"
393,"981097656656"
870,"970229576390"
164,"985460370521"
824,"925435011873"
953,"923596822040"
909,"984592365219"
742,"981965568469"
522,"989763517348"
344,"985603504684"
648,"989336681629"
295,"988112814876"
374,"925183425682"
598,"980968865165"
771,"983906887928"
468,"988845853631"
448,"984692738553"
440,"982887971627"
340,"989871889778"
337,"982397638031"
789,"985543524635"
480,"982543622861"
177,"924440170340"
631,"923981521186"
305,"989169251045"
37,"981008975917"
982,"984959200834"
881,"928992498727"
46,"923791329241"
406,"980979304096"
212,"982637982413"
666,"980946230997"
586,"982858709498"
274,"986577559675"
389,"986577559675"
719,"983006170559"
941,"985832688008"
219,"924063729917"
148,"983121806534"
243,"989919806125"
910,"980187209698"
226,"989274196756"
672,"986878902578"
478,"989840379366"
718,"982437352722"
458,"989832067883"
635,"924747662108"
49,"986280297476"
405,"978807429740"
406,"982960256097"
679,"987261827476"
864,"989269255558"
483,"972542201522"
32,"986337490871"
757,"986457755340"
557,"922981276933"
687,"983273364695"
241,"983199267074"
300,"989508211530"
363,"987678000951"
168,"986328806306"
461,"984783169374"
489,"981129527932"
931,"981343495618"
292,"980271271866"
459,"989269255558"
695,"986624489713"
386,"985722646692"
188,"980559553710"
669,"989760396230"
905,"985991089721"
356,"988334633090"
578,"987458270518"
285,"989097321312"
893,"980584840480"
329,"984691612237"
73,"981075533796"
620,"987439507142"
910,"986641823442"
63,"983272196631"
710,"982342800279"
251,"983083579886"
636,"928948450083"
772,"981159481560"
616,"986641823442"
16,"984352870429"
125,"981508998161"
332,"984414224456"
893,"983538489784"
557,"984383848830"
571,"983654880190"
584,"981436523198"
86,"928109224701"
650,"984575448132"
608,"924469558264"
485,"984959200834"
540,"987498119592"
509,"982598517979"
464,"980450087742"
473,"924063611251"
838,"988301089106"
923,"980431107480"
454,"987639219877"
467,"987001840268"
375,"981436523198"
578,"984861783784"
526,"984963982802"
891,"986280297476"
951,"989834865147"
9,"988708007930"
319,"920538570308"
317,"982671443286"
940,"988368610879"
109,"985959443368"
773,"984167797534"
239,"985429195719"
174,"983304129298"
299,"985520491736"
578,"987435434641"
114,"989778447301"
704,"980475054682"
627,"982407495304"
482,"980168989058"
433,"953666533186"
636,"980968865165"
997,"984077534105"
520,"989451977296"
505,"985437915320"
702,"987095972233"
358,"988968448226"
444,"927046356504"
237,"979574994452"
855,"982866250434"
69,"982427739246"
356,"988713104215"
379,"983196205570"
518,"982762314247"
11,"984628704023"
308,"989037795537"
85,"981267162865"
520,"985179695596"
366,"988102488116"
98,"980490235559"
238,"987570088700"
353,"983278965851"
930,"974474320509"
143,"989871889778"
105,"987510451681"
540,"989760396230"
623,"985897930362"
58,"982866250434"
984,"981384594864"
484,"981364973746"
943,"985179695596"
559,"984691612237"
822,"989792600266"
385,"989666153905"
215,"983363728597"
506,"981945985550"
887,"987424951004"
431,"983439462806"
412,"982116096897"
825,"989443279680"
196,"955151030622"
406,"981001251977"
237,"983156801191"
806,"975412633984"
726,"989760396230"
628,"983316987148"
405,"984415478066"
928,"925553660994"
947,"989451977296"
262,"984465380372"
564,"986624489713"
460,"988874915520"
250,"986206381391"
5,"985722646692"
6,"983611104925"
588,"988233334892"
11,"982188963790"
341,"981301029212"
347,"982294442941"
913,"987489823186"
21,"923466567256"
647,"984959200834"
87,"983316987148"
761,"989579827939"
65,"981267162865"
10,"987665435050"
236,"986445013864"
723,"988830548814"
592,"981969284103"
396,"983935311653"
745,"984857926417"
445,"987740446980"
721,"983098967678"
170,"984313622535"
998,"983121806534"
811,"924830469598"
277,"986390222693"
456,"981213653901"
565,"986239309423"
699,"984149813214"
963,"980211464471"
501,"987322301959"
335,"983954028577"
776,"988368610879"
935,"988667221430"
18,"921809920857"
101,"980436134487"
605,"986459740599"
846,"974373077136"
115,"989088785674"
368,"980769399315"
701,"989760396230"
609,"924751949193"
367,"983848847604"
68,"986624489713"
649,"981440410810"
714,"989209861141"
184,"988044442434"
308,"984050524697"
771,"985543524635"
617,"987892649164"
378,"980158908151"
61,"981967038624"
610,"982342800279"
830,"982881732280"
890,"980820944686"
502,"986778083418"
475,"981059806101"
481,"929141582342"
569,"986025718700"
981,"981752964813"
928,"982098418496"
889,"987930364094"
31,"982342800279"
165,"989001455211"
547,"982098539254"
435,"953666533186"
836,"984628704023"
46,"980770960021"
787,"980053733050"
402,"983654880190"
751,"981135546467"
717,"984430462992"
203,"983616988714"
144,"982116096897"
305,"986607899012"
155,"983118721141"
875,"984511860596"
988,"986459740599"
417,"985643242186"
157,"980211464471"
307,"954399741935"
651,"982637982413"
676,"984780664483"
659,"983803472576"
116,"986025718700"
639,"983935311653"
398,"926783965511"
338,"921809920857"
635,"982279479209"
372,"981213653901"
224,"985897821761"
835,"983272196631"
168,"987135485160"
584,"980979304096"
63,"983276047532"
522,"983932078283"
985,"989451977296"
504,"980687220133"
24,"983304129298"
206,"982164676981"
816,"981058946682"
549,"989858796720"
581,"981404618329"
386,"984330266245"
506,"926783965511"
897,"983643222575"
882,"985848562154"
581,"975078530909"
672,"989336681629"
36,"981690898385"
51,"928992498727"
553,"980773292004"
829,"981620562393"
870,"980549170672"
218,"982671443286"
937,"986464992465"
380,"985825805539"
604,"982583552124"
355,"984938649231"
645,"989211133020"
616,"985987664557"
956,"987261827476"
997,"981020502852"
810,"989496105056"
966,"988773197457"
969,"986901229189"
605,"985603504684"
92,"989138396339"
49,"981084923861"
6,"987361141913"
585,"953666533186"
278,"984692738553"
345,"986357070041"
810,"980436134487"
81,"985250591013"
134,"921333109317"
717,"987031372950"
17,"986901229189"
454,"983780348019"
428,"986979511226"
329,"926783965511"
882,"920352684958"
321,"923544329120"
774,"982996924024"
446,"986897744704"
747,"989778447301"
987,"984357923106"
763,"986240293094"
756,"984465380372"
774,"988996083095"
412,"989443279680"
21,"985546777849"
563,"980979304096"
264,"989521463415"
909,"988713104215"
980,"924211212329"
782,"987498119592"
247,"982575663506"
731,"984959200834"
286,"988678173708"
16,"984025247807"
50,"986468211731"
129,"986461689034"
9,"985999186998"
434,"981135546467"
887,"983868494641"
362,"984616818336"
817,"984511860596"
294,"975327111312"
725,"985068946269"
956,"981557733524"
149,"982168143974"
116,"981837046124"
519,"982170343452"
101,"986445013864"
752,"986461689034"
703,"984073728341"
822,"985690781361"
744,"988708007930"
660,"986468211731"
626,"988229743746"
258,"989211133020"
661,"986897744704"
53,"989209861141"
508,"981799398169"
126,"980053034803"
568,"981967038624"
604,"979589159928"
279,"923314123826"
473,"924830469598"
562,"972542201522"
321,"982543622861"
903,"987740446980"
386,"984311406207"
590,"925223049573"
773,"989451977296"
397,"982547411842"
4,"989037795537"
531,"988757617610"
273,"980575455153"
744,"980439501827"
917,"984373634871"
495,"980990259876"
753,"986633582695"
186,"982778095220"
841,"989269255558"
923,"989469415977"
509,"985625075267"
951,"987822999565"
649,"980618098810"
422,"983098967678"
554,"980866035075"
339,"987570088700"
260,"971922634040"
465,"985520206372"
525,"982287531001"
696,"982806819267"
429,"983762718479"
637,"982357082953"
844,"984093790200"
773,"983344971173"
319,"988262467504"
893,"988193770235"
714,"984383848830"
525,"989736544422"
798,"986337490871"
352,"981030991388"
19,"987947510769"
535,"989404243034"
752,"989567546368"
595,"989460476057"
281,"925223049573"
354,"987489505386"
670,"921722780190"
794,"980143939511"
691,"986979511226"
236,"928449570066"
877,"980277970782"
21,"926916483804"
258,"988656243075"
638,"986352599966"
108,"983281480406"
861,"989228589846"
702,"983259773402"
599,"981434268260"
725,"983276047532"
728,"982213546697"
213,"971266318173"
158,"989611693365"
887,"984322220200"
930,"980483698027"
787,"988628777605"
221,"958328126462"
440,"986425347459"
899,"985574826137"
121,"985013257966"
174,"988517238485"
762,"981154477531"
544,"981159481560"
99,"983423824671"
543,"984635330260"
462,"980216995882"
127,"985600955067"
189,"980334213572"
773,"988517238485"
878,"925464651845"
866,"985110758362"
583,"982188963790"
187,"983316987148"
294,"981752964813"
181,"986506933413"
496,"987421021073"
212,"987792388971"
156,"989730378141"
41,"988102488116"
650,"983799796293"
822,"983802167867"
909,"988678173708"
679,"989666153905"
212,"989432867273"
370,"980611964504"
760,"987361141913"
85,"986902240034"
598,"980860734232"
37,"987135485160"
310,"986436640696"
396,"980756921743"
895,"985482135996"
146,"984155166918"
5,"989097321312"
935,"981983471793"
634,"987947510769"
143,"986902240034"
248,"922475054112"
594,"989978938658"
128,"985230813768"
353,"971625772025"
198,"989858796720"
786,"988942687487"
264,"983273364695"
204,"982209048337"
394,"985482135996"
389,"984857926417"
484,"980297836040"
627,"986425747289"
872,"988845853631"
477,"987062303200"
188,"926783965511"
84,"986633582695"
35,"953666533186"
830,"982237852366"
974,"981752964813"
376,"984313622535"
159,"974683146885"
976,"989097321312"
470,"981213653901"
533,"980549170672"
743,"920244664697"
706,"983833643898"
987,"984415478066"
240,"981982762274"
144,"987639219877"
818,"986878902578"
368,"988676916095"
233,"984149813214"
842,"986425347459"
932,"988367858776"
290,"988526399401"
483,"982561717438"
69,"953245291892"
488,"984330266245"
935,"985084095454"
404,"980277970782"
