"idprocpte","dnulp","dnomus","dprnus","dnomlp","jdatnss","dldnss"
"98822C11218","01","de Haan","Brent","de Haan","25/06/1971","04 LODRIZU"
"97502Q58343","01","Richardson","Aiden","Richardson","28/05/1967","27 NUVADUZO"
"98828R28945","01","Langlois","Clara","Rivière","05/08/1981","49 ROCUMIN"
"98736H08276","01","Pieri","Belle","Roger","15/10/1998","45 SABMONKUR"
"98736H46992","01","Moulin","Jim","Moulin","03/07/1957","18 VIBJEGGAR"
"98826W07592","01","Berry","Mike","Mazzi","12/08/1985","81 DOFUMAB"
"98826W07592","02","Santoni","Bessie","Santoni","20/03/1991","26 WINTEDA"
"98711N52633","01","Kirk","Sophie","Massai","31/12/1989","68 NIKBUDIG"
"98711N52633","02","Watanabe","Alan","Watanabe","15/07/1962","74 NEMMEMEH"
"92004F18409","01","Klein","Ann","Klein","31/08/1955","02 OCEDIZLAS"
"98812A54910","01","Jones","Georgia","Heath","22/10/1989","98 LALEIK"
"98757V59577","01","Fiesoli","Aaron","Bradley","12/09/1952","75 LACPIMO"
"98824G70557","01","Parrini","Bettie","Hartley","11/09/1990","54 NISEHUFE"
"98716R96793","01","Harvey","Manuel","Harvey","24/02/1998","20 VONPERMIZ"
"98812A43539","01","Rogers","Jennie","Rogers","11/05/1951","75 GENABE"
"98812A43539","02","Simon","Anthony","Simon","10/11/1950","37 ZUBETI"
"98414S37151","01","Stella","Mario","Stella","12/12/1990","04 LAURUVO"
"98414S37151","02","Giannini","Maria","Giannini","21/09/1981","05 VORIUB"
"98825E20772","01","Tonelli","Virgie","Hammond","02/01/1952","09 NOMHEED"
"98832S83290","01","Robinson","Madge","Perret","09/01/1987","59 DUTVIPSOJ"
"98832S83290","02","Markus","Jack","Markus","16/01/1988","43 JOAROZOF"
"98749K56377","01","Groß","Duane","Perkins","03/12/1955","17 IZAAKNAH"
"98749K56377","02","Haan","Helena","Carpentier","13/08/1957","99 GUPCISPU"
"98742Y18410","01","Salvadori","Rosalie","Gardiner","29/07/1958","72 POUHUMUG"
"98742Y18410","02","Fontaine","Paul","Fontaine","19/02/1991","80 NUCAWNO"
"98824G43686","01","Becattini","Katherine","Pugh","21/10/1954","52 USAJULKA"
"98824G43686","02","Myers","Ian","Myers","10/02/1953","32 TOHEZZO"
"98713M38887","01","Allen","Theresa","Hart","03/05/1996","38 CALAJRE"
"98715B94682","01","Clark","Dennis","Andrei","21/03/1951","47 REZGOSE"
"98806C41612","01","Ueno","Flora","French","22/05/1968","84 PAGOCEM"
"98806C41612","02","Groß","Eugenia","Long","08/09/1996","03 PECOGOJI"
"98738S80513","01","Matsuo","Amelia","Matsuo","08/09/1978","42 FALUNMAK"
"92009B61945","01","Giovannoni","Derek","Giovannoni","25/02/1954","74 OKFUGID"
"92009B61945","02","Matteucci","Charlotte","Gabellini","20/07/1958","58 IMEHAUZA"
"98740T70678","01","Le GallGall","Josephine","Le GallGall","28/03/1951","02 OHMUJI"
"98740T70678","02","Ducci","Lloyd","Lelli","26/09/1977","02 TERMIMU"
"98749A33772","01","van der Horst","Seth","Middleton","22/07/1971","90 DOFECON"
"98749A33772","02","Nakayama","Winifred","Knowles","28/04/1973","86 VAGIGMU"
"98717F93477","01","Morton","Rosa","Morton","31/03/1981","00 ZOTDOKU"
"98411T18201","01","Willemsen","Lucille","Willemsen","20/06/1996","67 POACEWO"
"98813F32429","01","Sparks","Joe","Collin","29/03/1996","49 SENJIMLAR"
"98813F32429","02","López","Violet","Brogi","20/05/1951","32 WELUZEL"
"98721R11394","01","van Kesteren","Ian","van Kesteren","16/08/1975","26 UWUOLTI"
"98721R11394","02","Cocchi","Sadie","Cocchi","18/07/1969","59 LUTIBI"
"98414V86326","01","Glover","Cole","Merino","15/01/1966","61 ZODIMCUZ"
"98414V86326","02","Nishimura","Curtis","Lambert","01/08/1960","90 UKKUGCUM"
"98741P10928","01","Bergmann","Micheal","Bergmann","31/05/1956","64 WUSICSA"
"98727S34554","01","Pagliai","Isabelle","Marchand","19/10/1976","90 MOSEKEH"
"98756C93803","01","Duran","Harvey","Duran","09/06/1976","15 ZASJESA"
"98754F14767","01","Smit","Minnie","Morgan","14/05/1973","67 SENHATIG"
"98823D07192","01","Ruiz","William","Ruiz","22/02/1966","31 WIHJULFU"
"98823D07192","02","Evers","Bertie","Evers","20/08/1981","22 PAJLEHI"
"98723P13355","01","Brewer","Winnie","Brewer","16/03/1968","64 POJITZI"
"98740T44334","01","Castellani","Sally","Castellani","08/12/1985","51 EMZIJAZ"
"98740T44334","02","May","Justin","May","10/07/1991","15 BUSIKAJ"
"98611H74962","01","Atkinson","Adam","Atkinson","03/09/1972","16 EMZISIR"
"98611H74962","02","Mattioli","Cory","Mattioli","20/03/1969","45 JEONIR"
"92078B75531","01","Piani","Barbara","Piani","31/10/1952","86 MISTULKUT"
"98714T45202","01","Degli Innocenti","Loretta","Degli Innocenti","25/05/1969","99 GUMDIBUS"
"98747D24821","01","Cesari","Austin","Cesari","09/05/1966","56 KEWIUK"
"98803C35412","01","Mulder","Philip","Marchese","19/08/1974","08 PUCTEFTAZ"
"98412Z02089","01","Zingoni","Alice","Zingoni","29/01/1990","18 SABZAFEPI"
"98825U67278","01","Matsumoto","Larry","Weston","09/06/1962","67 WEHATCIB"
"98825U67278","02","Moss","Herbert","Dean","17/09/1979","15 LUWEJILA"
"98825B19796","01","Burke","Aiden","Burke","24/09/1992","77 MALHIZGU"
"98414V62234","01","Mazzei","Emilie","Sereni","20/03/1988","72 UREZUIL"
"98731M72184","01","Scott","Hattie","Ramirez","30/10/1970","11 IKIEWEIL"
"98733E55633","01","Perez","Troy","Kramer","01/06/1964","96 ZARBOVLEP"
"98733E55633","02","Freeman","Dominic","Chiarelli","14/03/1965","98 OFKEET"
"98744Q73488","01","Reyes","Mike","Torres","06/03/1986","44 KULVESOH"
"98744Q73488","02","Koster","Clara","Koster","13/08/1997","77 POFWOBJU"
"92024D43837","01","Cappellini","Andrew","Schut","13/10/1973","89 PEWAHDAL"
"92024D43837","02","Bryan","Lester","Doyle","11/05/1960","70 TIHORA"
"98733Y41043","01","Ciampi","Mario","Dietrich","26/05/1988","24 CAFCUDDID"
"98822J75426","01","Soler","Donald","Soler","30/04/1960","35 IWIWOTZUN"
"98818T05787","01","Sánchez","Gordon","Sánchez","18/02/1965","53 DUGAGUF"
"98612G72595","01","Farrell","Frank","Farrell","12/09/1999","84 ATJIVAC"
"98831J60143","01","Mazzocchi","Fred","Mazzocchi","15/10/1993","57 COMICNE"
"98726V28343","01","McBride","Leah","Brazzini","14/10/1985","99 HOFUMAV"
"98717T74237","01","Brogioni","Mable","Pieroni","03/02/1959","94 LOWZEAK"
"98809D35695","01","Owen","Justin","Barlow","21/11/1952","54 VINEBDIM"
"98809D35695","02","Cenni","Micheal","Mannini","16/03/1988","04 LATILELU"
"98411O05743","01","Price","Ann","Price","19/03/1979","56 KINHIOTA"