id,nom,niveau
"0",Organisme de placement collectif en valeurs mobilières sans personnalité morale,1
"1",Entrepreneur individuel,1
"2",Groupement de droit privé non doté de la personnalité morale,1
"3",Personne morale de droit étranger,1
"4",Personne morale de droit public soumise au droit commercial,1
"5",Société commerciale,1
"6",Autre personne morale immatriculée au RCS,1
"7",Personne morale et organisme soumis au droit administratif,1
"8",Organisme privé spécialisé,1
"9",Groupement de droit privé,1
