naf_revision_type_id,id,nom,niveau,parent_naf_type_id
NAFRev1,A,"Agriculture, chasse, sylviculture",1,
NAFRev1,B,"Pêche, aquaculture, services annexes",1,
NAFRev1,C,Industries extractives,1,
NAFRev1,D,Industrie manufacturière,1,
NAFRev1,E,"Production et distribution d'électricité, de gaz et d'eau",1,
NAFRev1,F,Construction,1,
NAFRev1,G,Commerce ; réparations automobile et d'articles domestiques,1,
NAFRev1,H,Hôtels et restaurants,1,
NAFRev1,I,Transports et communications,1,
NAFRev1,J,Activités financières,1,
NAFRev1,K,"Immobilier, location et services aux entreprises",1,
NAFRev1,L,Administration publique,1,
NAFRev1,M,Education,1,
NAFRev1,N,Santé et action sociale,1,
NAFRev1,O,"Services collectifs, sociaux et personnels",1,
NAFRev1,P,Activités des ménages,1,
NAFRev1,Q,Activités extra-territoriales,1,