<svg width="56" height="56" viewBox="0 0 56 56" fill="none" xmlns="http://www.w3.org/2000/svg">
<path d="M11.41 7.48984C11.7966 7.48984 12.11 7.17644 12.11 6.78984C12.11 6.40324 11.7966 6.08984 11.41 6.08984C11.0234 6.08984 10.71 6.40324 10.71 6.78984C10.71 7.17644 11.0234 7.48984 11.41 7.48984Z" fill="#ECECFE"/>
<path d="M46.9002 9.58945C47.2868 9.58945 47.6002 9.27605 47.6002 8.88945C47.6002 8.50285 47.2868 8.18945 46.9002 8.18945C46.5136 8.18945 46.2002 8.50285 46.2002 8.88945C46.2002 9.27605 46.5136 9.58945 46.9002 9.58945Z" fill="#ECECFE"/>
<path d="M45.4998 52.0797C45.8864 52.0797 46.1998 51.7663 46.1998 51.3797C46.1998 50.9931 45.8864 50.6797 45.4998 50.6797C45.1132 50.6797 44.7998 50.9931 44.7998 51.3797C44.7998 51.7663 45.1132 52.0797 45.4998 52.0797Z" fill="#ECECFE"/>
<path d="M16.24 53.8297C16.6266 53.8297 16.94 53.5163 16.94 53.1297C16.94 52.7431 16.6266 52.4297 16.24 52.4297C15.8534 52.4297 15.54 52.7431 15.54 53.1297C15.54 53.5163 15.8534 53.8297 16.24 53.8297Z" fill="#ECECFE"/>
<path fill-rule="evenodd" clip-rule="evenodd" d="M42.6998 28.6996C42.6998 28.313 43.0132 27.9996 43.3998 27.9996H46.1998C46.5864 27.9996 46.8998 28.313 46.8998 28.6996C46.8998 29.0862 46.5864 29.3996 46.1998 29.3996H43.3998C43.0132 29.3996 42.6998 29.0862 42.6998 28.6996Z" fill="#E1000F"/>
<path fill-rule="evenodd" clip-rule="evenodd" d="M35.6998 28.6996C35.6998 28.313 36.0132 27.9996 36.3998 27.9996H39.1998C39.5864 27.9996 39.8998 28.313 39.8998 28.6996C39.8998 29.0862 39.5864 29.3996 39.1998 29.3996H36.3998C36.0132 29.3996 35.6998 29.0862 35.6998 28.6996Z" fill="#E1000F"/>
<path fill-rule="evenodd" clip-rule="evenodd" d="M42.6998 32.1996C42.6998 31.813 43.0132 31.4996 43.3998 31.4996H46.1998C46.5864 31.4996 46.8998 31.813 46.8998 32.1996C46.8998 32.5862 46.5864 32.8996 46.1998 32.8996H43.3998C43.0132 32.8996 42.6998 32.5862 42.6998 32.1996Z" fill="#E1000F"/>
<path fill-rule="evenodd" clip-rule="evenodd" d="M35.6998 32.1996C35.6998 31.813 36.0132 31.4996 36.3998 31.4996H39.1998C39.5864 31.4996 39.8998 31.813 39.8998 32.1996C39.8998 32.5862 39.5864 32.8996 39.1998 32.8996H36.3998C36.0132 32.8996 35.6998 32.5862 35.6998 32.1996Z" fill="#E1000F"/>
<path fill-rule="evenodd" clip-rule="evenodd" d="M17.4998 23.7996C17.4998 23.413 17.8132 23.0996 18.1998 23.0996H20.9998C21.3864 23.0996 21.6998 23.413 21.6998 23.7996C21.6998 24.1862 21.3864 24.4996 20.9998 24.4996H18.1998C17.8132 24.4996 17.4998 24.1862 17.4998 23.7996Z" fill="#E1000F"/>
<path fill-rule="evenodd" clip-rule="evenodd" d="M9.7998 23.7996C9.7998 23.413 10.1132 23.0996 10.4998 23.0996H13.2998C13.6864 23.0996 13.9998 23.413 13.9998 23.7996C13.9998 24.1862 13.6864 24.4996 13.2998 24.4996H10.4998C10.1132 24.4996 9.7998 24.1862 9.7998 23.7996Z" fill="#E1000F"/>
<path fill-rule="evenodd" clip-rule="evenodd" d="M17.4998 27.2996C17.4998 26.913 17.8132 26.5996 18.1998 26.5996H20.9998C21.3864 26.5996 21.6998 26.913 21.6998 27.2996C21.6998 27.6862 21.3864 27.9996 20.9998 27.9996H18.1998C17.8132 27.9996 17.4998 27.6862 17.4998 27.2996Z" fill="#E1000F"/>
<path fill-rule="evenodd" clip-rule="evenodd" d="M9.7998 27.2996C9.7998 26.913 10.1132 26.5996 10.4998 26.5996H13.2998C13.6864 26.5996 13.9998 26.913 13.9998 27.2996C13.9998 27.6862 13.6864 27.9996 13.2998 27.9996H10.4998C10.1132 27.9996 9.7998 27.6862 9.7998 27.2996Z" fill="#E1000F"/>
<path fill-rule="evenodd" clip-rule="evenodd" d="M25.1998 23.7996C25.1998 23.413 25.5132 23.0996 25.8998 23.0996H28.6998C29.0864 23.0996 29.3998 23.413 29.3998 23.7996C29.3998 24.1862 29.0864 24.4996 28.6998 24.4996H25.8998C25.5132 24.4996 25.1998 24.1862 25.1998 23.7996Z" fill="#E1000F"/>
<path fill-rule="evenodd" clip-rule="evenodd" d="M25.1998 27.2996C25.1998 26.913 25.5132 26.5996 25.8998 26.5996H28.6998C29.0864 26.5996 29.3998 26.913 29.3998 27.2996C29.3998 27.6862 29.0864 27.9996 28.6998 27.9996H25.8998C25.5132 27.9996 25.1998 27.6862 25.1998 27.2996Z" fill="#E1000F"/>
<path fill-rule="evenodd" clip-rule="evenodd" d="M36.3998 37.11V41.2862C36.3998 41.2862 36.3998 41.2861 36.3998 41.2862C36.401 41.2891 36.4032 41.2925 36.4056 41.295C36.4076 41.2972 36.4088 41.2977 36.409 41.2978C36.4092 41.2979 36.41 41.2982 36.4118 41.2986C36.4135 41.299 36.4174 41.2996 36.4239 41.2996H39.1554C39.1579 41.2982 39.1611 41.2962 39.1647 41.2937C39.171 41.2894 39.1775 41.284 39.1838 41.2779C39.1902 41.2717 39.1953 41.2656 39.1993 41.2601C39.1994 41.2599 39.1996 41.2596 39.1998 41.2594V37.1131C39.1998 37.113 39.1998 37.1131 39.1998 37.1131C39.1986 37.1101 39.1965 37.1067 39.194 37.1042C39.192 37.102 39.1908 37.1015 39.1906 37.1014C39.1904 37.1013 39.1896 37.101 39.1878 37.1006C39.1861 37.1003 39.1822 37.0996 39.1757 37.0996H36.4239C36.424 37.0996 36.424 37.0996 36.4239 37.0996C36.4235 37.0996 36.4195 37.0999 36.4133 37.1024C36.4075 37.1046 36.4029 37.1075 36.3998 37.11ZM39.2003 37.1146C39.2003 37.1147 39.2003 37.1146 39.2003 37.1146ZM39.1484 41.3029C39.1481 41.303 39.1484 41.3029 39.1484 41.3029ZM34.9998 37.1085C34.9998 36.2384 35.7361 35.6996 36.4239 35.6996H39.1757C40.0278 35.6996 40.5998 36.3993 40.5998 37.1085V41.2907C40.5998 41.701 40.3977 42.0487 40.1632 42.2783C39.9277 42.5088 39.5791 42.6996 39.1757 42.6996H36.4239C35.5718 42.6996 34.9998 42 34.9998 41.2907V37.1085Z" fill="#E1000F"/>
<path fill-rule="evenodd" clip-rule="evenodd" d="M43.3998 37.1095V41.2864C43.3998 41.2865 43.3998 41.2863 43.3998 41.2864C43.401 41.2895 43.4033 41.2931 43.4057 41.2956C43.4067 41.2967 43.4075 41.2973 43.4079 41.2976L43.4086 41.298C43.4086 41.298 43.4093 41.2983 43.4108 41.2987C43.4124 41.299 43.4161 41.2996 43.4223 41.2996H46.168C46.1755 41.2996 46.1831 41.2987 46.1906 41.2969C46.1906 41.2949 46.1906 41.2928 46.1906 41.2907V37.1128C46.1905 37.1127 46.1906 37.1129 46.1906 37.1128C46.1893 37.1097 46.1871 37.1061 46.1847 37.1036C46.1837 37.1025 46.1829 37.1019 46.1824 37.1016L46.1818 37.1012C46.1817 37.1012 46.1811 37.1009 46.1795 37.1006C46.178 37.1002 46.1743 37.0996 46.168 37.0996H43.4224C43.4224 37.0996 43.4224 37.0996 43.4224 37.0996C43.4224 37.0996 43.4188 37.0998 43.4128 37.1022C43.4072 37.1043 43.4028 37.1072 43.3998 37.1095ZM46.191 37.1142C46.191 37.1143 46.191 37.1142 46.191 37.1142ZM41.9998 37.1085C41.9998 36.2398 42.7338 35.6996 43.4223 35.6996H46.168C47.0206 35.6996 47.5906 36.4007 47.5906 37.1085V41.2355C47.6462 41.664 47.4545 42.0371 47.2092 42.2778C46.946 42.536 46.5725 42.6996 46.168 42.6996H43.4223C42.5697 42.6996 41.9998 41.9985 41.9998 41.2907V37.1085Z" fill="#E1000F"/>
<path d="M29.8374 8.94585C30.1393 8.70435 30.1882 8.26384 29.9467 7.96196C29.7052 7.66007 29.2647 7.61113 28.9628 7.85264L18.4628 16.2526C18.1609 16.4941 18.112 16.9346 18.3535 17.2365C18.595 17.5384 19.0355 17.5874 19.3374 17.3459L29.8374 8.94585Z" fill="#000091"/>
<path d="M33.5907 9.6845C33.5684 9.54927 33.5074 9.42712 33.4194 9.32982C33.2965 9.19395 33.121 9.10654 32.925 9.09968C32.8714 9.09774 32.8175 9.10194 32.7644 9.11238C32.7169 9.12171 32.6711 9.13584 32.6276 9.15425C32.5665 9.18009 32.5099 9.21436 32.4591 9.25559L25.4628 14.8526C25.1609 15.0941 25.112 15.5346 25.3535 15.8365C25.595 16.1384 26.0355 16.1874 26.3374 15.9459L32.2001 11.2557V46.8992H9.1001C8.7135 46.8992 8.4001 47.2126 8.4001 47.5992C8.4001 47.9858 8.7135 48.2992 9.1001 48.2992H32.9001C33.2867 48.2992 33.6001 47.9858 33.6001 47.5992" fill="#000091"/>
<path d="M40.6001 20.2992C40.2135 20.2992 39.9001 20.6126 39.9001 20.9992C39.9001 21.3858 40.2135 21.6992 40.6001 21.6992H46.2001C46.5867 21.6992 46.9001 21.3858 46.9001 20.9992C46.9001 20.6126 46.5867 20.2992 46.2001 20.2992H40.6001Z" fill="#000091"/>
<path d="M35.0001 23.7992C35.0001 23.4126 35.3135 23.0992 35.7001 23.0992H49.7001C50.0867 23.0992 50.4001 23.4126 50.4001 23.7992V47.5992C50.4001 47.9858 50.0867 48.2992 49.7001 48.2992H35.7001C35.3135 48.2992 35.0001 47.9858 35.0001 47.5992C35.0001 47.2126 35.3135 46.8992 35.7001 46.8992H49.0001V24.4992H35.7001C35.3135 24.4992 35.0001 24.1858 35.0001 23.7992Z" fill="#000091"/>
<path d="M7.0001 47.6692C7.0001 48.0558 6.6867 48.3692 6.3001 48.3692C5.9135 48.3692 5.6001 48.0558 5.6001 47.6692C5.6001 47.2826 5.9135 46.9692 6.3001 46.9692C6.6867 46.9692 7.0001 47.2826 7.0001 47.6692Z" fill="#000091"/>
<path fill-rule="evenodd" clip-rule="evenodd" d="M11.2001 44.7992C11.2001 44.4126 11.5135 44.0992 11.9001 44.0992H14.0001V33.5992C14.0001 33.2126 14.3135 32.8992 14.7001 32.8992H24.5001C24.8867 32.8992 25.2001 33.2126 25.2001 33.5992V44.0992H27.3001C27.6867 44.0992 28.0001 44.4126 28.0001 44.7992C28.0001 45.1858 27.6867 45.4992 27.3001 45.4992H11.9001C11.5135 45.4992 11.2001 45.1858 11.2001 44.7992ZM20.3001 44.0992V37.7992C20.3001 37.4126 19.9867 37.0992 19.6001 37.0992C19.2135 37.0992 18.9001 37.4126 18.9001 37.7992V44.0992H15.4001V34.2992H23.8001V44.0992H20.3001Z" fill="#000091"/>
<path d="M15.4001 30.7992C15.4001 30.4126 15.7135 30.0992 16.1001 30.0992H23.1001C23.4867 30.0992 23.8001 30.4126 23.8001 30.7992C23.8001 31.1858 23.4867 31.4992 23.1001 31.4992H16.1001C15.7135 31.4992 15.4001 31.1858 15.4001 30.7992Z" fill="#000091"/>
<path d="M23.6379 17.4011C23.8853 17.6981 23.8452 18.1395 23.5482 18.387L21.4482 20.137C21.3224 20.2418 21.1639 20.2992 21.0001 20.2992H7.0001V44.7992C7.0001 45.1858 6.6867 45.4992 6.3001 45.4992C5.9135 45.4992 5.6001 45.1858 5.6001 44.7992V19.5992C5.6001 19.2126 5.9135 18.8992 6.3001 18.8992H20.7467L22.652 17.3115C22.949 17.064 23.3904 17.1041 23.6379 17.4011Z" fill="#000091"/>
</svg>
