naf_revision_type_id,id,nom,niveau,parent_naf_type_id
NAP,00.10,Indéfini,4,
NAP,00.97,Indéfini,4,
NAP,00.99,Indéfini,4,
NAP,01.00,Cultures générales,4,01
NAP,01.07,Cultures générales associées à d'autres activités agricoles,4,01
NAP,01.10,"Production de légumes frais, de fleurs; pépinières",4,01
NAP,01.16,Cultures fruitières,4,01
NAP,01.17,Viticulture,4,01
NAP,01.30,Vinification,4,01
NAP,01.50,Elevage de bovins,4,01
NAP,01.56,Elevage de bovins associé à d'autres activités agricoles,4,01
NAP,01.57,"Elevage d'ovins, caprins, équins",4,01
NAP,01.60,Elevage de porcins,4,01
NAP,01.63,Aviculture,4,01
NAP,01.70,Productions agricoles diverses,4,01
NAP,01.74,Chasse et piégeage,4,01
NAP,01.80,Travaux agricoles à façon,4,01
NAP,01.90,Services effectués au profit de l'élevage,4,01
NAP,02.10,Sylviculture et services aux forêts,4,02
NAP,02.20,Exploitation forestière,4,02
NAP,03.10,Pêche en mer,4,03
NAP,03.20,Conchyliculture,4,03
NAP,03.30,Pisciculture et pêche en eau douce,4,03
NAP,03.40,Culture et récolte de produits marins divers,4,03
NAP,35.01,Abattage du bétail,4,35
NAP,35.04,Fabrication de charcuterie et de conserves de viandes,4,35
NAP,35.05,Abattage de volaille,4,35
NAP,36.10,Industrie laitière,4,36
NAP,36.20,"Fabrication de crèmes glacées, glaces et sorbets",4,36
NAP,37.01,Conserverie de fruits et confitures,4,37
NAP,37.02,Conserverie de légumes,4,37
NAP,37.03,Conserverie de poissons,4,37
NAP,37.04,Préparation de plats cuisinés,4,37
NAP,38.10,Fabrication industrielle de pain et de pâtisserie fraîche,4,38
NAP,38.40,"Boulangerie, pâtisserie",4,38
NAP,38.50,Pâtisserie,4,38
NAP,39.01,Meunerie,4,39
NAP,39.02,"Biscuiterie, biscotterie",4,39
NAP,39.03,Semoulerie,4,39
NAP,39.04,Fabrication de pâtes alimentaires et de couscous,4,39
NAP,39.05,Transformation de céréales secondaires,4,39
NAP,39.06,Malterie,4,39
NAP,39.07,Fabrication de produits amylacés,4,39
NAP,39.08,Fabrication d'aliments pour animaux,4,39
NAP,40.11,Fabrication d'huiles et corps gras bruts,4,40
NAP,40.12,Fabrication d'huiles et corps gras raffinés et de margarine,4,40
NAP,40.21,"Sucreries, raffineries de sucre",4,40
NAP,40.31,"Chocolaterie, confiserie",4,40
NAP,40.32,"Torréfaction et brûlerie de café, thé, chicorée et infusions, préparation d'épices et herbes aromatiques",4,40
NAP,40.33,"Fabrication de condiments, vinaigre, sauces préparées",4,40
NAP,40.34,"Fabrication d'aliments diététiques, aliments pour bébé, produits de régime",4,40
NAP,40.35,"Fabrication d'entremets, desserts ménagers et petits déjeuners",4,40
NAP,40.36,Fabrication de bouillons et potages,4,40
NAP,40.37,Fabrication de produits alimentaires divers,4,40
NAP,41.01,Distillation d'alcool,4,41
NAP,41.02,Distillation d'eau de vie naturelle,4,41
NAP,41.03,Production de liqueurs et apéritifs alcoolisés autres qu'à base de vin,4,41
NAP,41.04,Production d'apéritifs à base de vin,4,41
NAP,41.05,Champagnisation,4,41
NAP,41.06,Brasserie,4,41
NAP,41.07,Cidrerie,4,41
NAP,41.08,Production de jus de fruits et de légumes,4,41
NAP,41.09,Fabrication de boissons non alcoolisées élaborées,4,41
NAP,41.10,Production d'eaux minérales naturelles,4,41
NAP,42.01,Transformation du tabac,4,42
NAP,04.11,Production de combustibles minéraux solides,4,04
NAP,04.21,Cokéfaction,4,04
NAP,05.11,Extraction de pétrole,4,05
NAP,05.21,Extraction de gaz naturel,4,05
NAP,05.31,Raffinage de pétrole,4,05
NAP,06.01,Production et distribution d'électricité,4,06
NAP,07.01,Distribution de gaz,4,07
NAP,08.01,Production et distribution d'eau,4,08
NAP,08.02,Chauffage urbain et distribution d'énergies diverses,4,08
NAP,09.01,Extraction et préparation de minerai de fer,4,09
NAP,10.01,Sidérurgie,4,10
NAP,11.01,Tréfilage de l'acier et production des dérivés du fil d'acier,4,11
NAP,11.02,Laminage à froid du feuillard d'acier,4,11
NAP,11.03,Etirage et profilage des produits pleins en acier,4,11
NAP,11.04,Profilage des produits plats en acier,4,11
NAP,11.05,Fabrication de tubes d'acier,4,11
NAP,12.01,Extraction et préparation de bauxite,4,12
NAP,12.02,"Extraction et préparation de minerais de plomb, zinc et cuivre",4,12
NAP,12.03,Extraction de minerais contenant des matières fissiles et fer,4,12
NAP,12.04,Extraction et préparation d'autres minerais métalliques,4,12
NAP,13.01,Métallurgie de l'aluminium et des autres métaux légers,4,13
NAP,13.02,"Métallurgie du plomb, du zinc, du cadmium",4,13
NAP,13.03,Métallurgie des métaux précieux,4,13
NAP,13.04,Métallurgie des ferro-alliages,4,13
NAP,13.05,Production d'autres métaux non ferreux,4,13
NAP,13.10,Fabrication de demi-produits en aluminium et autres métaux légers,4,13
NAP,13.11,"Fabrication de demi-produits en plomb, zinc et cadmium",4,13
NAP,13.12,Fabrication de demi-produits en cuivre,4,13
NAP,13.13,Fabrication de demi-produits en métaux précieux,4,13
NAP,13.14,Fabrication d'autres demi-produits non ferreux,4,13
NAP,13.15,Production et transformation de matières fissiles,4,13
NAP,13.16,Production et transformation de matières fertiles,4,13
NAP,14.01,Production de sels (chlorure de sodium et sels divers) ; marais salants,4,14
NAP,14.02,Production de matériaux de carrière pour l'industrie,4,14
NAP,14.03,"Production de minéraux divers : asphalte, talc etc..",4,14
NAP,15.01,Extraction de sables et graviers d'alluvions,4,15
NAP,15.02,Production de matériaux concassés de roche et de laitier,4,15
NAP,15.03,Production de pierres de construction,4,15
NAP,15.04,"Extraction d'argiles, kaolin, terres réfractaires",4,15
NAP,15.05,Fabrication de plâtres et de produits en plâtre,4,15
NAP,15.06,Fabrication de chaux et ciments,4,15
NAP,15.07,Préparation et livraison de béton prêt à l'emploi,4,15
NAP,15.08,Fabrication de produits en béton,4,15
NAP,15.09,Fabrication de matériaux de construction divers,4,15
NAP,15.10,Fabrication de tuiles et briques,4,15
NAP,15.11,Fabrication de produits réfractaires,4,15
NAP,15.12,"Fabrication de produits en grès, en faïence, en autres matières céramiques",4,15
NAP,15.13,Fabrication de vaisselle de ménage en céramique,4,15
NAP,16.01,"Fabrication façonnage et transformation de verre plat, miroiterie",4,16
NAP,16.02,"Fabrication façonnage et transformation de verre creux mécanique, de verrerie de ménage",4,16
NAP,16.03,Fabrication de verre à la main,4,16
NAP,16.04,Fabrication de verre technique,4,16
NAP,17.12,Industrie de l'acide sulfurique et des produits dérivés,4,17
NAP,17.13,Fabrication de produits chimiques par électrolyse ou électrothermie,4,17
NAP,17.14,Fabrication de gaz comprimés,4,17
NAP,17.15,Fabrication d'opacifiants minéraux compositions et couleurs pour émaux,4,17
NAP,17.16,Fabrication de produits divers de la chimie minérale,4,17
NAP,17.17,Fabrication d'engrais azotés et autres produits azotés,4,17
NAP,17.18,Fabrication d'engrais phosphatés,4,17
NAP,17.19,Fabrication d'autres engrais,4,17
NAP,17.21,Chimie organique de synthèse,4,17
NAP,17.22,Fabrication de matières colorantes de synthèse,4,17
NAP,17.23,Traitement chimique des corps gras notamment stéarinerie et glycérinerie ; fabrication de produits de base pour détergents,4,17
NAP,17.24,Fabrication de produits de base pour la pharmacie,4,17
NAP,17.25,"Fabrication de produits auxiliaires pour les industries textiles, du cuir et du caoutchouc, transformation de matières animales et végétales",4,17
NAP,17.26,Fabrication et distillation de goudrons,4,17
NAP,17.27,Fabrication de matières plastiques,4,17
NAP,17.28,Fabrication de caoutchouc synthétique et autres élastomères,4,17
NAP,17.29,"Fabrication d'huiles essentielles, d'arômes naturels et synthétiques",4,17
NAP,43.01,Production de fibres discontinues et de fils continus artificiels,4,43
NAP,43.02,Production de fibres discontinues et de fils continus synthétiques,4,43
NAP,20.01,Fonderie de métaux ferreux,4,20
NAP,20.02,Fonderie de métaux non ferreux,4,20
NAP,21.01,"Forge, estampage, matriçage",4,21
NAP,21.02,"Découpage, emboutissage",4,21
NAP,21.03,Traitement et revêtement des métaux,4,21
NAP,21.04,Décolletage,4,21
NAP,21.05,"Boulonnerie, visserie",4,21
NAP,21.06,Construction métallique,4,21
NAP,21.07,Menuiserie métallique de bâtiment,4,21
NAP,21.08,"Mécanique générale, fabrication de moules et modèles",4,21
NAP,21.09,"Fabrication d'outillage à main, d'outillage électroportatif, d'outillage agricole",4,21
NAP,21.10,Fabrication de ressorts,4,21
NAP,21.11,Fabrication de quincaillerie,4,21
NAP,21.12,"Ferblanterie, fabrication d'articles de ménage, de coutellerie",4,21
NAP,21.13,Fabrication de mobilier métallique,4,21
NAP,21.14,"Fabrication de fûts et tonnelets métalliques, de boîtes et emballages métalliques fabrication de conditionnements métalliques",4,21
NAP,21.15,Fabrication de petits articles métalliques,4,21
NAP,21.16,"Frittage des métaux, fabrication d'aimants permanents",4,21
NAP,21.17,"Fabrication d'armes de chasse, de tir, de défense",4,21
NAP,50.01,Fabrication de pâtes à papier,4,50
NAP,50.02,Fabrication de papiers et de cartons,4,50
NAP,50.03,Fabrication d'articles de papeterie,4,50
NAP,50.04,Transformation du papier,4,50
NAP,50.06,Fabrication de carton ondulé et de produits en carton ondulé,4,50
NAP,50.07,Fabrication de cartonnages,4,50
NAP,52.01,Fabrication de pneumatiques et chambres à air,4,52
NAP,52.02,Rechapage et réparation industrielle de pneumatiques,4,52
NAP,52.03,Fabrication d'ouvrages en caoutchouc,4,52
NAP,52.04,Fabrication d'ouvrages en amiante,4,52
NAP,53.01,"Fabrication de mélanges, plaques, feuilles, films, tubes, tuyaux et profilés",4,53
NAP,53.02,Fabrication de pièces diverses pour l'industrie,4,53
NAP,53.03,Fabrication d'emballages en matières plastiques,4,53
NAP,53.04,Fabrication d'éléments pour le bâtiment,4,53
NAP,53.05,Fabrication de produits de consommation divers,4,53
NAP,53.06,Fabrication de pellicules cellulosiques,4,53
NAP,22.01,Fabrication de tracteurs agricoles,4,22
NAP,22.02,Fabrication d'autre matériel agricole,4,22
NAP,23.01,Fabrication de machines-outils à métaux,4,23
NAP,23.02,Fabrication de machines à bois,4,23
NAP,23.03,"Fabrication d'outillage, outils pour machines",4,23
NAP,23.04,Fabrication d'engrenages et organes de transmission,4,23
NAP,23.05,Fabrication de matériel de soudage,4,23
NAP,24.01,Robinetterie,4,24
NAP,24.02,Fabrication et installation de fours,4,24
NAP,24.03,"Fabrication et installation de matériel aéraulique, thermique et frigorifique",4,24
NAP,24.04,Fabrication de moteurs à combustion interne autres que pour l'automobile et l'aéronautique,4,24
NAP,24.05,Fabrication de transmissions hydrauliques et pneumatiques,4,24
NAP,24.06,Fabrication de pompes et compresseurs,4,24
NAP,24.07,Fabrication de turbines thermiques et hydrauliques et d'équipements de barrages,4,24
NAP,24.08,Chaudronnerie,4,24
NAP,24.09,"Fabrication de machines pour les industries alimentaires chimiques, plastiques et de machines à chaussures",4,24
NAP,24.10,Fabrication de machines pour les industries textiles et de machines à coudre industrielles,4,24
NAP,24.11,"Fabrication de machines pour les industries du papier, du carton et des arts graphiques",4,24
NAP,25.01,Fabrication de matériel de travaux publics,4,25
NAP,25.02,"Fabrication de matériel pour la sidérurgie pour la fonderie, pour la préparation des matériaux, matériel fixe de chemin de fer",4,25
NAP,25.03,Fabrication de matériel de manutention et de levage,4,25
NAP,25.04,Fabrication de matériel de mines et de forage,4,25
NAP,34.01,Horlogerie,4,34
NAP,34.02,"Fabrication d'appareils de pesage et de compteurs, d'instruments de métrologie",4,34
NAP,34.03,Fabrication de lunettes pour la correction et la protection de la vue,4,34
NAP,34.04,Fabrication d'instruments d'optique et de précision,4,34
NAP,34.05,Fabrication de matériel photographique et cinématographique,4,34
NAP,34.06,Fabrication de matériel médico-chirurgical et de prothèses,4,34
NAP,34.07,Fabrication de roulements,4,34
NAP,27.01,Fabrication de matériel de traitement de l'information,4,27
NAP,27.02,Fabrication de machines de bureau,4,27
NAP,28.10,"Fabrication d'équipements de distribution, de commande à basse tension ; d'applications de l'électronique de puissance",4,28
NAP,28.11,Fabrication de matériel électrique de grande puissance ou à haute tension,4,28
NAP,28.12,"Fabrication d'appareillage industriel à basse tension, de relais ; de matériel de signalisation",4,28
NAP,28.13,Fabrication de machines tournantes et transformateurs électriques de petite et moyenne puissance,4,28
NAP,28.14,Fabrication d'isolateurs et pièces isolantes en verre et céramique,4,28
NAP,28.15,Fabrication d'équipements d'automatisation de processus industriels,4,28
NAP,28.16,Réparation de gros matériel électrique,4,28
NAP,28.17,Fabrication de matériel d'éclairage,4,28
NAP,28.18,Fabrication de fils et câbles isolés pour l'électricité,4,28
NAP,28.19,"Fabrication et installation d'ascenseurs, monte-charge et escaliers mécaniques",4,28
NAP,28.21,Fabrication d'appareillage électrique d'installation,4,28
NAP,28.22,Fabrication de piles électriques et appareils d'éclairage à bas voltage,4,28
NAP,28.23,Fabrication d'accumulateurs,4,28
NAP,28.24,Fabrication de lampes électriques,4,28
NAP,29.11,Fabrication de matériel télégraphique et téléphonique,4,29
NAP,29.12,Fabrication d'appareils de radiologie et d'électronique médicale,4,29
NAP,29.13,"Fabrication d'appareils de contrôle et de régulation spécifiquement conçus pour l'automatisme industriel, d'instruments et d'appareils électriques et électroniques de mesure",4,29
NAP,29.14,Fabrication de matériel professionnel électronique et radioélectrique,4,29
NAP,29.15,Fabrication de composants passifs et de condensateurs fixes,4,29
NAP,29.16,Fabrication de tubes électroniques et de semi-conducteurs,4,29
NAP,29.21,Fabrication d'appareils radiorécepteur et de téléviseurs,4,29
NAP,29.22,Fabrication d'appareils d'enregistrement et de reproduction du son et de l'image et de supports d'enregistrement,4,29
NAP,30.01,"Fabrication d'appareils frigorifiques domestiques, de machines à laver le linge et à laver la vaisselle",4,30
NAP,30.02,"Fabrication d'appareils ménagers de cuisine, de chauffage de l'eau et de chauffage de l'air non électriques",4,30
NAP,30.03,Fabrication d'autres appareils d'équipement ménager,4,30
NAP,31.11,Construction de voitures particulières,4,31
NAP,31.12,Construction de caravanes et remorques de tourisme,4,31
NAP,31.13,Fabrication de pièces et équipements spécifiques pour automobiles,4,31
NAP,31.14,Construction de véhicules utilitaires,4,31
NAP,31.15,"Construction de carrosseries, bennes, remorques autres que de tourisme",4,31
NAP,31.16,Fabrication de motocycles et cycles,4,31
NAP,31.17,Fabrication de pièces et équipements pour cycles et motocycles,4,31
NAP,31.21,Fabrication et réparation de matériel ferroviaire roulant et d'autres matériels de transport guide,4,31
NAP,26.01,Fabrication de véhicules blindés,4,26
NAP,26.02,Fabrication d'armes et munitions de guerre,4,26
NAP,32.01,Construction de bâtiments de guerre,4,32
NAP,32.02,Construction de navires de marine marchande,4,32
NAP,32.03,Construction d'autres bateaux,4,32
NAP,32.04,Fabrication et pose d'équipements spécifiques de bord,4,32
NAP,32.05,Réparation de navires,4,32
NAP,33.01,Construction de cellules d'aéronefs,4,33
NAP,33.02,Fabrication de propulseurs d'aéronefs et d'équipements de propulseurs,4,33
NAP,33.03,Fabrication d'équipements spécifiques pour les aéronefs,4,33
NAP,33.04,Construction d'engins et de lanceurs spatiaux,4,33
NAP,18.01,Fabrication d'allumettes,4,18
NAP,18.02,Fabrication d'abrasifs appliqués,4,18
NAP,18.03,"Fabrication d'explosifs, d'accessoires de mise à feu et d'artifices",4,18
NAP,18.04,Fabrication de colles,4,18
NAP,18.05,Fabrication de produits savonniers et de produits détergents,4,18
NAP,18.06,Fabrication de produits de ménage et de produits d'entretien,4,18
NAP,18.07,"Fabrication de peintures, vernis, couleurs fines, encres d'imprimerie",4,18
NAP,18.08,Fabrication de produits phytosanitaires,4,18
NAP,18.09,Fabrication de produits photographiques et cinématographiques,4,18
NAP,18.10,"Fabrication de charbons artificiels, de terres actives et de produits chimiques à usage métallurgique et mécanique",4,18
NAP,18.11,Parfumerie,4,18
NAP,19.01,Fabrication de spécialités pharmaceutiques,4,19
NAP,19.02,Fabrication d'autres produits pharmaceutiques,4,19
NAP,44.10,"Préparation et commerce de la laine, délainage",4,44
NAP,44.11,"Préparation de lin, chanvre, et d'autres plantes textiles",4,44
NAP,44.12,Filterie,4,44
NAP,44.13,Filature de lin et de chanvre,4,44
NAP,44.14,Filature de l'industrie cotonnière,4,44
NAP,44.15,Filature de l'industrie lainière - cycle cardé,4,44
NAP,44.16,Filature de l'industrie lainière - cycle peigné,4,44
NAP,44.17,Moulinage et texturation de la soie et des textiles artificiels et synthétiques,4,44
NAP,44.18,"Teintures, apprêts et impressions",4,44
NAP,44.20,Fabrication d'étoffes à mailles,4,44
NAP,44.21,"Fabrication de chandails, pull-over, polos, gilets etc... En bonneterie",4,44
NAP,44.22,Fabrication d'autres vêtements de dessus de bonneterie,4,44
NAP,44.23,Fabrication de sous-vêtements de bonneterie,4,44
NAP,44.24,Fabrication d'articles chaussants de bonneterie,4,44
NAP,44.25,Fabrication d'autres articles de bonneterie,4,44
NAP,44.30,Tissage des industries cotonnières et linières,4,44
NAP,44.31,Tissage de l'industrie lainière,4,44
NAP,44.32,Tissage de soierie,4,44
NAP,44.33,Industrie du jute,4,44
NAP,44.34,Fabrication de tapis,4,44
NAP,44.35,Fabrication de feutre,4,44
NAP,44.36,Fabrication d'étoffes non tissées ni tricotées,4,44
NAP,44.37,Enduction d'étoffes,4,44
NAP,44.38,Fabrication de produits textiles élastiques,4,44
NAP,44.39,"Ficellerie, corderie, fabrication de filets",4,44
NAP,44.40,Ouaterie,4,44
NAP,44.41,"Fabrication de dentelles, tulles, broderies et guipures",4,44
NAP,44.42,"Fabrication de rubans, tresses, passementeries et articles textiles divers",4,44
NAP,47.01,Confection de vêtements masculins,4,47
NAP,47.02,Confection de vêtements féminins,4,47
NAP,47.03,Confection de vêtements pour enfants,4,47
NAP,47.04,Habillement sur mesure,4,47
NAP,47.05,Confection de chemiserie et lingerie,4,47
NAP,47.06,Confection de vêtements en matières plastiques,4,47
NAP,47.07,"Confection de corsets, gaines et soutien-gorges",4,47
NAP,47.08,Confection de chapellerie pour hommes et femmes,4,47
NAP,47.09,Fabrication d'accessoires divers de l'habillement,4,47
NAP,47.10,Fabrication de pelleterie et fourrures,4,47
NAP,45.11,"Tannerie, mégisserie",4,45
NAP,45.21,"Fabrication d'articles de maroquinerie, d'articles de voyage et de chasse",4,45
NAP,45.22,Fabrication de gants,4,45
NAP,45.23,Fabrication d'articles divers en cuir et similaires,4,45
NAP,46.01,Fabrication de chaussures et d'autres articles chaussants,4,46
NAP,48.01,Scierie,4,48
NAP,48.02,Fabrication d'éléments de charpente et de menuiseries de bâtiment,4,48
NAP,48.03,"Fabrication de parquets, moulures et baguettes",4,48
NAP,48.04,"Fabrication et transformation de panneaux, bois de placage, bois améliorés et traités",4,48
NAP,48.05,Fabrication d'emballages en bois,4,48
NAP,48.06,Fabrication de bâtiments préfabriqués légers,4,48
NAP,48.07,Fabrication d'objets divers en bois,4,48
NAP,49.01,Fabrication de meubles meublants,4,49
NAP,49.02,Fabrication de sièges,4,49
NAP,49.03,Fabrication de meubles de cuisine et meubles en bois blanc,4,49
NAP,49.04,Fabrication de literie,4,49
NAP,49.05,Fabrication de meubles divers et industries connexes à l'industrie de l'ameublement,4,49
NAP,49.06,Fabrication de mobilier fonctionnel non métallique,4,49
NAP,54.01,"Fabrication de jeux, jouets et d'articles de puériculture",4,54
NAP,54.02,Fabrication d'articles de sport et de campement,4,54
NAP,54.03,Fabrication de bateaux de plaisance,4,54
NAP,54.04,"Bijouterie, joaillerie",4,54
NAP,54.05,Fabrication d'instruments de musique,4,54
NAP,54.06,Fabrication d'articles de bureau et d'articles de paris,4,54
NAP,54.07,"Fabrication d'accessoires d'ameublement en bronze et fer forgé, statuettes et articles funéraires",4,54
NAP,54.08,"Fabrication d'articles de brosserie, d'articles de vannerie et d'articles en liège",4,54
NAP,54.09,Laboratoires photographiques et cinématographiques,4,54
NAP,54.10,Fabrication d'articles divers non désignés ailleurs,4,54
NAP,51.01,Agences de presse,4,51
NAP,51.10,Imprimerie de labeur,4,51
NAP,51.11,Industries connexes à l'imprimerie,4,51
NAP,51.12,Edition,4,51
NAP,51.20,Presse,4,51
NAP,51.30,"Edition de disques, bandes et cassettes enregistrées",4,51
NAP,55.10,Travaux d'aménagement des terres et des eaux ; voirie ; parcs et jardins,4,55
NAP,55.11,Construction de lignes de transport d'électricité,4,55
NAP,55.12,Travaux d'infrastructure générale,4,55
NAP,55.13,Construction de chaussées,4,55
NAP,55.20,"Entreprises de forages, sondages ; fondations spéciales",4,55
NAP,55.30,Construction d'ossatures autres que métalliques,4,55
NAP,55.31,"Installation industrielle, montage levage",4,55
NAP,55.40,Installation électrique,4,55
NAP,55.50,Construction industrialisée,4,55
NAP,55.60,Maçonnerie et travaux courants de béton armé,4,55
NAP,55.70,Génie climatique,4,55
NAP,55.71,Menuiserie-serrurerie,4,55
NAP,55.72,"Couverture, plomberie, installations sanitaires",4,55
NAP,55.73,"Aménagements, finitions",4,55
NAP,57.01,Commerce de gros de matières premières agricoles,4,57
NAP,57.02,Commerce de gros de bestiaux,4,57
NAP,57.03,Commerce de gros de fruits et légumes,4,57
NAP,57.04,Commerce de gros de viandes sans abattage,4,57
NAP,57.05,Commerce de gros de produits laitiers,4,57
NAP,57.06,Commerce de gros de volailles et gibiers,4,57
NAP,57.07,Commerce de gros de poissons,4,57
NAP,57.08,"Commerce de gros de vins, spiritueux, liqueurs",4,57
NAP,57.09,Commerce de gros d'autres boissons,4,57
NAP,57.10,Commerce de gros d'épicerie,4,57
NAP,57.11,Commerces de gros spécialisés de produits alimentaires divers,4,57
NAP,58.01,Commerce de gros d'accessoires d'automobiles et de matériel de garage,4,58
NAP,58.02,"Commerce de gros de pneumatiques, cycles et motocycles",4,58
NAP,58.03,Commerce de gros de quincaillerie et d'appareils ménagers,4,58
NAP,58.04,Commerce de gros de matériel électrique et électronique,4,58
NAP,58.05,Commerce de gros des textiles,4,58
NAP,58.06,"Commerce de gros de l'habillement, des chaussures et de la maroquinerie",4,58
NAP,58.07,Commerce de gros de produits pharmaceutiques,4,58
NAP,58.08,"Commerce de gros de parfumerie, produits de beauté",4,58
NAP,58.09,"Commerce de gros de droguerie, de produits d'entretien",4,58
NAP,58.10,Commerce de gros de céramique et verrerie,4,58
NAP,58.11,"Commerce de gros de jouets, papeterie et articles de fumeurs",4,58
NAP,58.12,Commerces de gros divers,4,58
NAP,59.01,Commerce des textiles bruts,4,59
NAP,59.02,Commerce de gros de cuirs et peaux,4,59
NAP,59.03,"Commerce de gros de charbon, minerais et minéraux",4,59
NAP,59.04,Commerce de gros de produits pétroliers,4,59
NAP,59.05,Commerce de métaux,4,59
NAP,59.06,Commerce de produits chimiques industriels,4,59
NAP,59.07,Commerce du bois,4,59
NAP,59.08,"Commerce de matériaux de construction, de verre à vitres et d'appareils sanitaires",4,59
NAP,59.09,Commerce de matériel agricole,4,59
NAP,59.10,Commerce d'équipements et de fournitures pour l'industrie,4,59
NAP,59.11,Commerce de matériel et mobilier de bureau,4,59
NAP,59.12,Commerce de matériel pour le bâtiment et les travaux publics,4,59
NAP,59.13,Commerce de fournitures diverses pour les utilisateurs professionnels du commerce et des services,4,59
NAP,59.14,Commerce de papiers et cartons en l'état,4,59
NAP,60.01,"Intermédiaires du commerce en matières premières agricoles, animaux vivants, matières premières textiles et demi produits",4,60
NAP,60.02,"Intermédiaires du commerce en combustibles, métaux, minéraux et produits chimiques pour l'industrie",4,60
NAP,60.03,Intermédiaires du commerce en bois et matériaux de construction,4,60
NAP,60.04,"Intermédiaires du commerce en machines, matériel et véhicules",4,60
NAP,60.05,"Intermédiaires du commerce en meubles, articles de ménage et quincaillerie",4,60
NAP,60.06,"Intermédiaires du commerce en textiles habillement, chaussures et articles en cuir",4,60
NAP,60.07,Intermédiaires du commerce spécialisés en produits alimentaires,4,60
NAP,60.08,Centrales d'achats en produits alimentaires,4,60
NAP,60.09,Intermédiaires du commerce spécialisés en produits non désignés ailleurs,4,60
NAP,60.10,Intermédiaires du commerce en produits divers (sans prédominance),4,60
NAP,60.11,Centrales d'achats en produits non alimentaires,4,60
NAP,61.01,Exploitation de super marchés,4,61
NAP,61.02,Exploitation de magasins populaires,4,61
NAP,61.03,Exploitation d'hypermarchés,4,61
NAP,62.11,Commerce de détail indépendant d'alimentation générale,4,62
NAP,62.12,Exploitation de supérettes indépendantes,4,62
NAP,62.21,Exploitation de magasins d'alimentation générale dépendant d'une entreprise à magasins multiples,4,62
NAP,62.22,Exploitation de supérettes dépendant d'une entreprise à magasins multiples,4,62
NAP,62.30,Coopératives alimentaires d'entreprise ou d'administration,4,62
NAP,62.41,Commerce de détail de fruits et légumes,4,62
NAP,62.42,Commerce de détail de produits laitiers,4,62
NAP,62.43,Commerce de détail des viandes,4,62
NAP,62.44,Commerce de détail de poissons et coquillages,4,62
NAP,62.45,Commerce de détail de vins et boissons,4,62
NAP,62.46,Commerce de détail de confiserie et commerces de détail alimentaires divers,4,62
NAP,63.01,Grands magasins,4,63
NAP,63.02,Autres grandes surfaces non spécialisées non alimentaires,4,63
NAP,63.03,Grandes surfaces semi spécialisées non alimentaires,4,63
NAP,63.04,Entreprises de vente par correspondance à assortiment général,4,63
NAP,63.05,Autres commerces non alimentaires non spécialisés,4,63
NAP,64.11,Commerce de détail de l'habillement,4,64
NAP,64.12,Commerce de détail de la chaussure voyage,4,64
NAP,64.13,Commerce de détail de la maroquinerie et des articles de voyage,4,64
NAP,64.14,Commerce de détail des textiles pour la maison,4,64
NAP,64.21,Commerce de détail du meuble,4,64
NAP,64.22,Commerce de détail de quincaillerie et d'appareils ménagers,4,64
NAP,64.23,"Commerce de détail de la droguerie, couleurs vernis",4,64
NAP,64.24,"Commerce de détail de matériel électrique, radioélectrique et électroménager",4,64
NAP,64.25,Autres commerces de détail de l'équipement du foyer,4,64
NAP,64.30,Pharmacies,4,64
NAP,64.40,Commerce de détail d'articles médicaux et de produits de beauté,4,64
NAP,64.41,"Commerce de détail et réparation de motocycles, cycles et véhicules divers",4,64
NAP,64.42,Commerce de détail des charbons et combustibles,4,64
NAP,64.43,"Commerce de détail de livres, papeterie et fournitures de bureau",4,64
NAP,64.44,Commerce de détail d'optique (médicale et non médicale) et de photographie,4,64
NAP,64.45,Commerce de détail de l'horlogerie-bijouterie,4,64
NAP,64.46,"Commerce de détail de fleurs, graines et petits animaux d'agrément",4,64
NAP,64.47,Commerce de détail d'articles de sport et de camping,4,64
NAP,64.48,Commerce de détail du tabac,4,64
NAP,64.49,Commerces de détail divers,4,64
NAP,68.01,Transports ferroviaires,4,68
NAP,69.11,Transports routiers de marchandises en zone longue,4,69
NAP,69.12,Camionnage et transport routier de marchandises en zone courte,4,69
NAP,69.21,Transports urbains de voyageurs,4,69
NAP,69.22,Transports routiers de voyageurs,4,69
NAP,69.23,Taxis,4,69
NAP,69.24,Déménagement,4,69
NAP,69.25,Location de véhicules industriels,4,69
NAP,69.26,Transport par conduite,4,69
NAP,70.01,Transports fluviaux de passagers,4,70
NAP,70.02,Transports fluviaux de marchandises,4,70
NAP,71.01,Transports maritimes autres que de produits pétroliers,4,71
NAP,71.02,Transports maritimes de produits pétroliers,4,71
NAP,71.03,Navigation côtière et d'estuaire,4,71
NAP,72.01,Transports aériens,4,72
NAP,73.01,Gares routières,4,73
NAP,73.02,Ports fluviaux et voies fluviales,4,73
NAP,73.03,Ports maritimes,4,73
NAP,73.04,Aéroports,4,73
NAP,73.05,Exploitation d'ouvrages routiers à péage,4,73
NAP,73.06,Exploitation de parkings,4,73
NAP,73.07,Entrepôts autres que frigorifiques,4,73
NAP,73.08,Entrepôts frigorifiques,4,73
NAP,73.09,Remorquage et pilotage,4,73
NAP,74.01,Collecte de fret maritime,4,74
NAP,74.02,Collecte de fret aérien,4,74
NAP,74.03,Collecte de fret terrestre et fluvial,4,74
NAP,74.04,Manutention portuaire,4,74
NAP,74.05,Manutention terrestre et fluviale,4,74
NAP,74.06,Activités spécifiques d'auxiliaires des transports maritimes,4,74
NAP,74.07,Activités spécifiques d'auxiliaires de transport aérien,4,74
NAP,74.08,Autres auxiliaires des transports,4,74
NAP,74.09,Agences de voyages,4,74
NAP,74.10,Routage,4,74
NAP,75.01,P.T.T. - services communs et recherche,4,75
NAP,75.02,P.T.T. - services de télécommunications,4,75
NAP,75.03,P.T.T. - services postaux et financiers,4,75
NAP,75.04,Activités de télécommunications hors p.t.t.,4,75
NAP,65.01,Commerce de détail d'accessoires et d'équipements automobiles,4,65
NAP,65.02,Commerce de détail de carburants et lubrifiants,4,65
NAP,65.03,Vente et réparation de véhicules automobiles,4,65
NAP,65.06,Réparation de véhicules automobiles,4,65
NAP,67.01,Restaurants et cafés-restaurants (sans hébergement),4,67
NAP,67.02,Cantines,4,67
NAP,67.03,Traiteurs,4,67
NAP,67.04,Débits de boissons (sans spectacle),4,67
NAP,67.05,Cafés-tabacs,4,67
NAP,67.06,Débits de boissons avec spectacle,4,67
NAP,67.07,Cafés associés à une autre activité,4,67
NAP,67.08,Hôtels avec restaurant,4,67
NAP,67.09,Hôtels sans restaurant,4,67
NAP,67.10,Wagons-lits et wagons-restaurants,4,67
NAP,67.11,"Foyers d'étudiants et de jeunes travailleurs, résidences universitaires",4,67
NAP,67.12,Installations d'hébergement à équipements développés,4,67
NAP,67.13,Installations d'hébergement à équipements légers,4,67
NAP,56.01,Récupération de ferraille et vieux métaux non ferreux,4,56
NAP,56.02,Récupération de produits divers,4,56
NAP,76.00,Holdings,4,76
NAP,77.01,Cabinets d'études techniques,4,77
NAP,77.02,Cabinets d'études économiques et sociologiques,4,77
NAP,77.03,Cabinets d'études informatiques et d'organisation,4,77
NAP,77.04,Travaux à façon informatiques,4,77
NAP,77.05,Cabinets d'architecte,4,77
NAP,77.06,Cabinets de métreur et de géomètre,4,77
NAP,77.07,Cabinets de conseils en information et documentation,4,77
NAP,77.08,Cabinets juridiques et offices publics et ministériels,4,77
NAP,77.09,Cabinets d expertise comptable et d analyse financière,4,77
NAP,77.10,Créateurs et intermédiaires en publicité,4,77
NAP,77.11,Régies publicitaires,4,77
NAP,77.12,Travaux à façon divers,4,77
NAP,77.13,Prestation temporaire de personnel,4,77
NAP,77.14,Services divers rendus principalement aux entreprises,4,77
NAP,77.15,Ordres et syndicats professionnels,4,77
NAP,78.01,Auxiliaires financiers,4,78
NAP,78.02,Auxiliaires d'assurances,4,78
NAP,79.01,Promotion immobilière,4,79
NAP,79.02,Promotion en infrastructure (services marchands),4,79
NAP,79.03,Supports juridiques de programmes,4,79
NAP,79.04,Administration d'immeubles,4,79
NAP,79.05,Administration d'infrastructures,4,79
NAP,79.06,Agences immobilières,4,79
NAP,80.01,Location de machines et équipements agricoles,4,80
NAP,80.02,Location de matériel pour le bâtiment et les travaux publics,4,80
NAP,80.03,Location de matériel de bureau,4,80
NAP,80.04,Location de voitures particulières,4,80
NAP,80.05,Location de wagons,4,80
NAP,80.06,Location de biens de consommation,4,80
NAP,80.07,Crédit-bail mobilier,4,80
NAP,80.08,Location d'autres biens d'équipement,4,80
NAP,82.01,Enseignement général primaire et secondaire (services marchands),4,82
NAP,82.02,Formation des adultes et formation continue (services marchands),4,82
NAP,82.03,Autres enseignements spécialisés et professionnels et enseignement supérieur (services marchands),4,82
NAP,82.04,Enseignement par correspondance (services marchands),4,82
NAP,82.05,Professeurs indépendants,4,82
NAP,82.06,"Auto-écoles, écoles de pilotage",4,82
NAP,83.01,Recherche scientifique et technique (services marchands),4,83
NAP,66.01,Réparation de chaussures et d'autres articles en cuir,4,66
NAP,66.02,Réparation d'appareils électriques pour le ménage,4,66
NAP,66.03,Réparation de montres et horloges de bijouterie,4,66
NAP,66.04,Réparations non désignées ailleurs et sans spécialisation,4,66
NAP,84.01,Médecine systématique et de dépistage (services marchands),4,84
NAP,84.02,Etablissements hospitaliers généraux,4,84
NAP,84.03,Cliniques générales,4,84
NAP,84.04,Etablissements hospitaliers spécialisés,4,84
NAP,84.05,Cliniques spécialisées,4,84
NAP,84.06,Dispensaires,4,84
NAP,84.07,Autres instituts pour la santé,4,84
NAP,84.08,Laboratoires d'analyses médicales extra-hospitaliers,4,84
NAP,84.09,Centres de transfusion sanguine et banques d'organes,4,84
NAP,84.10,Cabinets de médecin,4,84
NAP,84.11,Cabinets dentaires,4,84
NAP,84.12,Cabinets d'auxiliaires médicaux,4,84
NAP,84.13,Ambulances,4,84
NAP,84.14,"Vétérinaires, cliniques vétérinaires",4,84
NAP,85.01,Crèches,4,85
NAP,85.02,"Etablissements pour l'enfance protégée, handicapée ou inadaptée (services marchands)",4,85
NAP,85.03,"Etablissements pour adultes nécessiteux, handicapés, ou inadaptés (services marchands)",4,85
NAP,85.04,Etablissements pour personnes âgées,4,85
NAP,86.01,Radiodiffusion et télévision,4,86
NAP,86.02,Production de films,4,86
NAP,86.03,Distribution de films,4,86
NAP,86.04,Gestion de salles de cinéma,4,86
NAP,86.05,Gestion de salles de spectacle (services marchands),4,86
NAP,86.06,Autres spectacles et services récréatifs (services marchands),4,86
NAP,86.07,Création et interprétation littéraires et artistiques (services marchands),4,86
NAP,86.08,Services annexes aux spectacles,4,86
NAP,86.09,Jeux de hasard et d'argent,4,86
NAP,86.10,Gestion d'équipements et centres sportifs (services marchands),4,86
NAP,86.11,Remontées mécaniques,4,86
NAP,86.12,Professeurs de sport et sportifs professionnels,4,86
NAP,87.01,Laverie-blanchisserie-teinturerie de détail,4,87
NAP,87.02,Blanchisserie et teinturerie de gros,4,87
NAP,87.03,Salons de coiffure,4,87
NAP,87.04,Esthétique corporelle,4,87
NAP,87.05,Services funéraires,4,87
NAP,87.06,Studios de photographie,4,87
NAP,87.07,Services personnels divers,4,87
NAP,87.08,Services de nettoyage,4,87
NAP,87.09,Enlèvement des ordures (services marchands),4,87
NAP,87.10,Autres services d'assainissement (services marchands),4,87
NAP,81.11,Location de logements,4,81
NAP,81.21,Location d'immeubles à usages industriels et commerciaux,4,81
NAP,81.22,Crédit bail immobilier,4,81
NAP,88.01,"Assurances ""vie et capitalisation""",4,88
NAP,88.02,"Assurances ""i.a.r.d.""",4,88
NAP,88.03,Réassurance,4,88
NAP,88.04,Assurances relevant du code de la mutualité,4,88
NAP,88.05,Caisses de retraites relevant de la législation sur les assurances,4,88
NAP,89.01,Instituts d'émission,4,89
NAP,89.02,"Banques de dépôts, d'affaires, de crédit à long et moyen terme",4,89
NAP,89.03,Crédit coopératif et mutuel,4,89
NAP,89.04,Etablissements financiers et unions économiques,4,89
NAP,89.05,Organismes financiers à statut légal spécial,4,89
NAP,89.06,Organismes de répartition d'emprunts collectifs obligataires,4,89
NAP,89.07,Sociétés de placements en valeurs mobilières,4,89
NAP,90.01,Pouvoirs publics,4,90
NAP,90.02,Administration centrale,4,90
NAP,90.03,Services extérieurs des administrations économiques et financières,4,90
NAP,90.04,Services extérieurs des autres administrations,4,90
NAP,90.05,Activités administratives spécialisées diverses,4,90
NAP,90.11,Administration locale,4,90
NAP,90.12,Promotion en infrastructure (services non marchands à caractère public),4,90
NAP,90.13,Voirie et assainissement (services non marchand à caractère public),4,90
NAP,90.21,Cours et tribunaux,4,90
NAP,90.22,Etablissements pénitentiaires,4,90
NAP,90.23,Etablissements d'éducation surveillée,4,90
NAP,90.24,Police nationale,4,90
NAP,90.25,Protection civile,4,90
NAP,90.26,Gendarmerie,4,90
NAP,90.31,Commandements territoriaux militaires,4,90
NAP,90.32,Forces et infrastructures des forces,4,90
NAP,90.33,"Dépôts, magasins et organismes d'approvisionnement militaire",4,90
NAP,90.34,Ecoles militaires,4,90
NAP,90.35,Service de santé militaire,4,90
NAP,90.36,Laboratoires et centres d'essais militaires,4,90
NAP,91.01,Organismes généraux de la sécurité sociale,4,91
NAP,91.02,"Sécurité sociale : maladie, maternité, accidents de travail",4,91
NAP,91.03,Sécurité sociale : vieillesse,4,91
NAP,91.04,Caisses de retraites ne relevant pas de la législation sur les assurances,4,91
NAP,91.05,Sécurité sociale : allocations familiales,4,91
NAP,91.06,Couverture du risque chômage et autres garanties du maintien du revenu,4,91
NAP,92.11,Enseignement préscolaire (services non marchands à caractère public),4,92
NAP,92.12,Enseignement élémentaire (services non marchands à caractère public),4,92
NAP,92.13,Enseignement du second degré premier cycle (services non marchands à caractère public),4,92
NAP,92.14,Enseignement du second degré second cycle (services non marchands à caractère public),4,92
NAP,92.15,Enseignement supérieur (services non marchands à caractère public),4,92
NAP,92.16,Enseignement artistique (services non marchands à caractère public),4,92
NAP,92.17,Formation de fonctionnaires (services non marchands à caractère public),4,92
NAP,92.18,Formation des adultes et formation continue (services non marchands à caractère public),4,92
NAP,92.21,Enseignement.(services non marchands à caractère privé),4,92
NAP,93.11,Recherche scientifique et technique (services non marchands à caractère public),4,93
NAP,93.21,Recherche scientifique et technique (services non marchands à caractère privé)),4,93
NAP,94.11,Médecine systématique et de dépistage (services non marchands à caractère public),4,94
NAP,94.21,Médecine systématique et de dépistage (services non marchands à caractère privé)),4,94
NAP,95.11,Organisme locaux d'action sociale (services non marchands à caractère public),4,95
NAP,95.12,"Etablissements pour l'enfance protégée, handicapée, ou inadaptée (services non marchands à caractère public)",4,95
NAP,95.13,"Etablissements pour adultes nécessiteux, handicapés, ou inadaptés (services non marchands à caractère public)",4,95
NAP,95.21,Oeuvres et organismes sociaux à compétence générale (services non marchands à caractère privé),4,95
NAP,95.22,Oeuvres et organismes sociaux spécialisés (services non marchands à caractère privé),4,95
NAP,95.23,"Etablissements pour l'enfance protégée, handicapée, inadaptée (services non marchands à caractère privé)",4,95
NAP,95.24,"Etablissements pour adultes nécessiteux, handicapés ou inadaptés (services non marchands à caractère privé)",4,95
NAP,96.11,Gestion de bibliothèques (services non marchands à caractère public),4,96
NAP,96.12,Conservation du patrimoine culturel (services non marchands à caractère public),4,96
NAP,96.13,Gestion de salles de théâtre (services non marchands à caractère public),4,96
NAP,96.14,Gestion d'équipements culturels (services non marchands à caractère public),4,96
NAP,96.15,Gestion d'équipements socio-éducatifs (services non marchands à caractère public),4,96
NAP,96.16,Associations culturelles et socio-éducatives (services non marchands à caractère public),4,96
NAP,96.17,Gestion d'équipements sportifs (services non marchands à caractère public),4,96
NAP,96.18,Associations sportives (services non marchands à caractère public),4,96
NAP,96.21,Gestion de bibliothèques et conservation du patrimoine culturel (services non marchands à caractère privé),4,96
NAP,96.22,"Gestion d'équipements culturels, socio-éducatifs et d'autres salles de spectacle (services non marchands à caractère privé)",4,96
NAP,96.23,Associations culturelles et socio-éducatives (services non marchands à caractère privé),4,96
NAP,96.24,Gestion d'équipements sportifs (services non marchands à caractère privé),4,96
NAP,96.25,Associations sportives (services non marchands à caractère privé),4,96
NAP,97.11,Organisations économiques (services non marchands à caractère public),4,97
NAP,97.12,Offices du tourisme (services non marchands à caractère public),4,97
NAP,97.21,Organisations syndicales (services non marchands à caractère prive),4,97
NAP,97.22,Organisations religieuses et philosophiques (services non marchands à caractère privé),4,97
NAP,97.23,Autres services fournis à la collectivité (services non marchands à caractère privé),4,97
NAP,98.01,Services domestiques,4,98
NAP,99.01,Représentation diplomatique étrangère en France ; organismes internationaux,4,99
