{
  "version": "5",
  "dialect": "pg",
  "entries": [
    {
      "idx": 0,
      "version": "5",
      "when": 1692289396742,
      "tag": "0000_aromatic_penance",
      "breakpoints": true
    },
    {
      "idx": 1,
      "version": "5",
      "when": 1697615623042,
      "tag": "0001_pale_patriot",
      "breakpoints": true
    },
    {
      "idx": 2,
      "version": "5",
      "when": 1698154972192,
      "tag": "0002_powerful_juggernaut",
      "breakpoints": true
    },
    {
      "idx": 3,
      "version": "5",
      "when": 1698658254155,
      "tag": "0003_cultured_cammi",
      "breakpoints": true
    },
    {
      "idx": 4,
      "version": "5",
      "when": 1699536813921,
      "tag": "0004_remarkable_shadowcat",
      "breakpoints": true
    },
    {
      "idx": 5,
      "version": "5",
      "when": 1699609649721,
      "tag": "0005_charming_patriot",
      "breakpoints": true
    },
    {
      "idx": 6,
      "version": "5",
      "when": 1700497422621,
      "tag": "0006_flippant_mesmero",
      "breakpoints": true
    },
    {
      "idx": 7,
      "version": "5",
      "when": 1700650819800,
      "tag": "0007_yellow_the_anarchist",
      "breakpoints": true
    },
    {
      "idx": 8,
      "version": "5",
      "when": 1701092468189,
      "tag": "0008_worthless_luckman",
      "breakpoints": true
    },
    {
      "idx": 9,
      "version": "5",
      "when": 1701099051717,
      "tag": "0009_bumpy_gambit",
      "breakpoints": true
    },
    {
      "idx": 10,
      "version": "5",
      "when": 1701105982060,
      "tag": "0010_common_cerise",
      "breakpoints": true
    },
    {
      "idx": 11,
      "version": "5",
      "when": 1701170408574,
      "tag": "0011_productive_prodigy",
      "breakpoints": true
    },
    {
      "idx": 12,
      "version": "5",
      "when": 1701250228418,
      "tag": "0012_mysterious_virginia_dare",
      "breakpoints": true
    },
    {
      "idx": 13,
      "version": "5",
      "when": 1701273085137,
      "tag": "0013_nosy_charles_xavier",
      "breakpoints": true
    },
    {
      "idx": 14,
      "version": "5",
      "when": 1701362554881,
      "tag": "0014_happy_skaar",
      "breakpoints": true
    },
    {
      "idx": 15,
      "version": "5",
      "when": 1702392439631,
      "tag": "0015_rare_hydra",
      "breakpoints": true
    },
    {
      "idx": 16,
      "version": "5",
      "when": 1702398508096,
      "tag": "0016_wide_shinobi_shaw",
      "breakpoints": true
    },
    {
      "idx": 17,
      "version": "5",
      "when": 1702631069946,
      "tag": "0017_cool_edwin_jarvis",
      "breakpoints": true
    },
    {
      "idx": 18,
      "version": "5",
      "when": 1702911725161,
      "tag": "0018_first_catseye",
      "breakpoints": true
    },
    {
      "idx": 19,
      "version": "5",
      "when": 1702978230670,
      "tag": "0019_yielding_nova",
      "breakpoints": true
    },
    {
      "idx": 20,
      "version": "5",
      "when": 1703239072982,
      "tag": "0020_friendly_scarlet_witch",
      "breakpoints": true
    },
    {
      "idx": 21,
      "version": "5",
      "when": 1703262722424,
      "tag": "0021_bumpy_amazoness",
      "breakpoints": true
    },
    {
      "idx": 22,
      "version": "5",
      "when": 1703584048166,
      "tag": "0022_safe_shiva",
      "breakpoints": true
    },
    {
      "idx": 23,
      "version": "5",
      "when": 1704388124225,
      "tag": "0023_sad_betty_ross",
      "breakpoints": true
    },
    {
      "idx": 24,
      "version": "5",
      "when": 1705439406957,
      "tag": "0024_large_blockbuster",
      "breakpoints": true
    },
    {
      "idx": 25,
      "version": "5",
      "when": 1705502195579,
      "tag": "0025_curly_namora",
      "breakpoints": true
    },
    {
      "idx": 26,
      "version": "5",
      "when": 1705942548111,
      "tag": "0026_spooky_hellion",
      "breakpoints": true
    },
    {
      "idx": 27,
      "version": "5",
      "when": 1706563259130,
      "tag": "0027_slippery_fabian_cortez",
      "breakpoints": true
    },
    {
      "idx": 28,
      "version": "5",
      "when": 1706716244990,
      "tag": "0028_strong_silhouette",
      "breakpoints": true
    },
    {
      "idx": 29,
      "version": "5",
      "when": 1706737290195,
      "tag": "0029_huge_deathbird",
      "breakpoints": true
    },
    {
      "idx": 30,
      "version": "5",
      "when": 1707475821039,
      "tag": "0030_omniscient_cerise",
      "breakpoints": true
    },
    {
      "idx": 31,
      "version": "5",
      "when": 1707488356832,
      "tag": "0031_legal_the_leader",
      "breakpoints": true
    },
    {
      "idx": 32,
      "version": "5",
      "when": 1707559318573,
      "tag": "0032_foamy_warbound",
      "breakpoints": true
    },
    {
      "idx": 33,
      "version": "5",
      "when": 1707834712090,
      "tag": "0033_productive_mysterio",
      "breakpoints": true
    },
    {
      "idx": 34,
      "version": "5",
      "when": 1707928306879,
      "tag": "0034_certain_bug",
      "breakpoints": true
    },
    {
      "idx": 35,
      "version": "5",
      "when": 1708534741844,
      "tag": "0035_chunky_bulldozer",
      "breakpoints": true
    },
    {
      "idx": 36,
      "version": "5",
      "when": 1708965462108,
      "tag": "0036_careless_callisto",
      "breakpoints": true
    },
    {
      "idx": 37,
      "version": "5",
      "when": 1709043365311,
      "tag": "0037_bitter_dazzler",
      "breakpoints": true
    },
    {
      "idx": 38,
      "version": "5",
      "when": 1709110614752,
      "tag": "0038_material_bedlam",
      "breakpoints": true
    },
    {
      "idx": 39,
      "version": "5",
      "when": 1709117154586,
      "tag": "0039_hot_colleen_wing",
      "breakpoints": true
    },
    {
      "idx": 40,
      "version": "5",
      "when": 1709137834063,
      "tag": "0040_bumpy_power_man",
      "breakpoints": true
    },
    {
      "idx": 41,
      "version": "5",
      "when": 1709197641372,
      "tag": "0041_faithful_timeslip",
      "breakpoints": true
    },
    {
      "idx": 42,
      "version": "5",
      "when": 1709299351663,
      "tag": "0042_glossy_otto_octavius",
      "breakpoints": true
    },
    {
      "idx": 43,
      "version": "5",
      "when": 1709552715229,
      "tag": "0043_watery_ultimo",
      "breakpoints": true
    },
    {
      "idx": 44,
      "version": "5",
      "when": 1709644301041,
      "tag": "0044_demonic_krista_starr",
      "breakpoints": true
    },
    {
      "idx": 45,
      "version": "5",
      "when": 1709658048367,
      "tag": "0045_loose_hydra",
      "breakpoints": true
    },
    {
      "idx": 46,
      "version": "5",
      "when": 1709661415741,
      "tag": "0046_outgoing_kree",
      "breakpoints": true
    },
    {
      "idx": 47,
      "version": "5",
      "when": 1709805503058,
      "tag": "0047_steep_doctor_spectrum",
      "breakpoints": true
    },
    {
      "idx": 48,
      "version": "5",
      "when": 1709823344030,
      "tag": "0048_bizarre_jazinda",
      "breakpoints": true
    },
    {
      "idx": 49,
      "version": "5",
      "when": 1709832837780,
      "tag": "0049_natural_piledriver",
      "breakpoints": true
    },
    {
      "idx": 50,
      "version": "5",
      "when": 1710351859662,
      "tag": "0050_same_blue_blade",
      "breakpoints": true
    },
    {
      "idx": 51,
      "version": "5",
      "when": 1710431724238,
      "tag": "0051_flimsy_vampiro",
      "breakpoints": true
    },
    {
      "idx": 52,
      "version": "5",
      "when": 1710757427054,
      "tag": "0052_magical_bastion",
      "breakpoints": true
    },
    {
      "idx": 53,
      "version": "5",
      "when": 1710839030498,
      "tag": "0053_powerful_spectrum",
      "breakpoints": true
    },
    {
      "idx": 54,
      "version": "5",
      "when": 1710951515945,
      "tag": "0054_opposite_chamber",
      "breakpoints": true
    },
    {
      "idx": 55,
      "version": "5",
      "when": 1711030896949,
      "tag": "0055_abandoned_blue_marvel",
      "breakpoints": true
    },
    {
      "idx": 56,
      "version": "5",
      "when": 1711442329638,
      "tag": "0056_hot_the_enforcers",
      "breakpoints": true
    },
    {
      "idx": 57,
      "version": "5",
      "when": 1711651064684,
      "tag": "0057_nappy_goblin_queen",
      "breakpoints": true
    },
    {
      "idx": 58,
      "version": "5",
      "when": 1712067849321,
      "tag": "0058_wise_eddie_brock",
      "breakpoints": true
    },
    {
      "idx": 59,
      "version": "5",
      "when": 1712133983829,
      "tag": "0059_huge_crystal",
      "breakpoints": true
    },
    {
      "idx": 60,
      "version": "5",
      "when": 1713954302944,
      "tag": "0060_remarkable_dreaming_celestial",
      "breakpoints": true
    },
    {
      "idx": 61,
      "version": "5",
      "when": 1713954420156,
      "tag": "0061_stiff_marrow",
      "breakpoints": true
    },
    {
      "idx": 62,
      "version": "5",
      "when": 1714332138590,
      "tag": "0062_mysterious_gauntlet",
      "breakpoints": true
    },
    {
      "idx": 63,
      "version": "5",
      "when": 1714404856888,
      "tag": "0063_tiny_inertia",
      "breakpoints": true
    },
    {
      "idx": 64,
      "version": "5",
      "when": 1714723366421,
      "tag": "0064_woozy_wild_child",
      "breakpoints": true
    },
    {
      "idx": 65,
      "version": "5",
      "when": 1715191554910,
      "tag": "0065_curious_lily_hollister",
      "breakpoints": true
    },
    {
      "idx": 66,
      "version": "5",
      "when": 1715619288396,
      "tag": "0066_lazy_absorbing_man",
      "breakpoints": true
    },
    {
      "idx": 67,
      "version": "5",
      "when": 1715771248814,
      "tag": "0067_spotty_thaddeus_ross",
      "breakpoints": true
    },
    {
      "idx": 68,
      "version": "5",
      "when": 1715851178148,
      "tag": "0068_lovely_screwball",
      "breakpoints": true
    },
    {
      "idx": 69,
      "version": "5",
      "when": 1715953426450,
      "tag": "0069_equal_typhoid_mary",
      "breakpoints": true
    },
    {
      "idx": 70,
      "version": "5",
      "when": 1716475607019,
      "tag": "0070_powerful_freak",
      "breakpoints": true
    },
    {
      "idx": 71,
      "version": "5",
      "when": 1716884405131,
      "tag": "0071_dashing_ulik",
      "breakpoints": true
    },
    {
      "idx": 72,
      "version": "5",
      "when": 1717139171701,
      "tag": "0072_tranquil_reaper",
      "breakpoints": true
    },
    {
      "idx": 73,
      "version": "5",
      "when": 1718028427574,
      "tag": "0073_wonderful_mister_sinister",
      "breakpoints": true
    },
    {
      "idx": 74,
      "version": "5",
      "when": 1718198350490,
      "tag": "0074_right_blazing_skull",
      "breakpoints": true
    },
    {
      "idx": 75,
      "version": "5",
      "when": 1718782745752,
      "tag": "0075_lyrical_zaran",
      "breakpoints": true
    },
    {
      "idx": 76,
      "version": "5",
      "when": 1718790484341,
      "tag": "0076_eager_sabra",
      "breakpoints": true
    },
    {
      "idx": 77,
      "version": "5",
      "when": 1719310804239,
      "tag": "0077_modern_northstar",
      "breakpoints": true
    },
    {
      "idx": 78,
      "version": "5",
      "when": 1719509220240,
      "tag": "0078_exotic_speed",
      "breakpoints": true
    },
    {
      "idx": 79,
      "version": "5",
      "when": 1719582670717,
      "tag": "0079_minor_punisher",
      "breakpoints": true
    },
    {
      "idx": 80,
      "version": "5",
      "when": 1719836528204,
      "tag": "0080_cold_talon",
      "breakpoints": true
    },
    {
      "idx": 81,
      "version": "5",
      "when": 1720014601547,
      "tag": "0081_medical_blue_marvel",
      "breakpoints": true
    },
    {
      "idx": 82,
      "version": "5",
      "when": 1720172296656,
      "tag": "0082_fluffy_deadpool",
      "breakpoints": true
    },
    {
      "idx": 83,
      "version": "5",
      "when": 1720434736719,
      "tag": "0083_puzzling_karnak",
      "breakpoints": true
    },
    {
      "idx": 84,
      "version": "5",
      "when": 1720456212930,
      "tag": "0084_elite_dazzler",
      "breakpoints": true
    },
    {
      "idx": 85,
      "version": "5",
      "when": 1720617803088,
      "tag": "0085_curly_captain_britain",
      "breakpoints": true
    },
    {
      "idx": 86,
      "version": "5",
      "when": 1721744728242,
      "tag": "0086_massive_spitfire",
      "breakpoints": true
    },
    {
      "idx": 87,
      "version": "5",
      "when": 1721837995212,
      "tag": "0087_legal_sebastian_shaw",
      "breakpoints": true
    },
    {
      "idx": 88,
      "version": "5",
      "when": 1722587072145,
      "tag": "0088_yummy_hulk",
      "breakpoints": true
    },
    {
      "idx": 89,
      "version": "5",
      "when": 1723124476951,
      "tag": "0089_naive_talos",
      "breakpoints": true
    },
    {
      "idx": 90,
      "version": "5",
      "when": 1723129758921,
      "tag": "0090_broken_guardsmen",
      "breakpoints": true
    },
    {
      "idx": 91,
      "version": "5",
      "when": 1723480298062,
      "tag": "0091_busy_wallflower",
      "breakpoints": true
    },
    {
      "idx": 92,
      "version": "5",
      "when": 1723623716357,
      "tag": "0092_brave_agent_brand",
      "breakpoints": true
    },
    {
      "idx": 93,
      "version": "5",
      "when": 1723655729018,
      "tag": "0093_aberrant_sphinx",
      "breakpoints": true
    },
    {
      "idx": 94,
      "version": "5",
      "when": 1724148622174,
      "tag": "0094_broad_toxin",
      "breakpoints": true
    },
    {
      "idx": 95,
      "version": "5",
      "when": 1724341433296,
      "tag": "0095_unusual_pretty_boy",
      "breakpoints": true
    },
    {
      "idx": 96,
      "version": "5",
      "when": 1724751905986,
      "tag": "0096_easy_dreaming_celestial",
      "breakpoints": true
    },
    {
      "idx": 97,
      "version": "5",
      "when": 1725464555461,
      "tag": "0097_eminent_gideon",
      "breakpoints": true
    },
    {
      "idx": 98,
      "version": "5",
      "when": 1725612001459,
      "tag": "0098_shallow_liz_osborn",
      "breakpoints": true
    },
    {
      "idx": 99,
      "version": "5",
      "when": 1725874273073,
      "tag": "0099_third_loners",
      "breakpoints": true
    },
    {
      "idx": 100,
      "version": "5",
      "when": 1725874957531,
      "tag": "0100_odd_lord_hawal",
      "breakpoints": true
    },
    {
      "idx": 101,
      "version": "5",
      "when": 1725879127646,
      "tag": "0101_dusty_mad_thinker",
      "breakpoints": true
    },
    {
      "idx": 102,
      "version": "5",
      "when": 1725954228373,
      "tag": "0102_oval_lorna_dane",
      "breakpoints": true
    },
    {
      "idx": 103,
      "version": "5",
      "when": 1725975812878,
      "tag": "0103_white_captain_britain",
      "breakpoints": true
    },
    {
      "idx": 104,
      "version": "5",
      "when": 1726087287166,
      "tag": "0104_mean_joshua_kane",
      "breakpoints": true
    },
    {
      "idx": 105,
      "version": "5",
      "when": 1726152520249,
      "tag": "0105_melodic_ozymandias",
      "breakpoints": true
    },
    {
      "idx": 106,
      "version": "5",
      "when": 1726152690859,
      "tag": "0106_chemical_wrecking_crew",
      "breakpoints": true
    },
    {
      "idx": 107,
      "version": "5",
      "when": 1726153584784,
      "tag": "0107_mighty_captain_britain",
      "breakpoints": true
    },
    {
      "idx": 108,
      "version": "5",
      "when": 1726158649743,
      "tag": "0108_bored_wallflower",
      "breakpoints": true
    },
    {
      "idx": 109,
      "version": "5",
      "when": 1726224271857,
      "tag": "0109_burly_smiling_tiger",
      "breakpoints": true
    },
    {
      "idx": 110,
      "version": "5",
      "when": 1728395224599,
      "tag": "0110_sleepy_vulcan",
      "breakpoints": true
    },
    {
      "idx": 111,
      "version": "7",
      "when": 1729151845058,
      "tag": "0111_absurd_rage",
      "breakpoints": true
    },
    {
      "idx": 112,
      "version": "7",
      "when": 1729502846337,
      "tag": "0112_ambiguous_mysterio",
      "breakpoints": true
    },
    {
      "idx": 113,
      "version": "7",
      "when": 1729679885704,
      "tag": "0113_natural_raza",
      "breakpoints": true
    },
    {
      "idx": 114,
      "version": "7",
      "when": 1730373788181,
      "tag": "0114_ordinary_steel_serpent",
      "breakpoints": true
    },
    {
      "idx": 115,
      "version": "7",
      "when": 1730375253810,
      "tag": "0115_shallow_pandemic",
      "breakpoints": true
    },
    {
      "idx": 116,
      "version": "7",
      "when": 1730398114199,
      "tag": "0116_lame_crystal",
      "breakpoints": true
    },
    {
      "idx": 117,
      "version": "7",
      "when": 1730475288827,
      "tag": "0117_complete_caretaker",
      "breakpoints": true
    },
    {
      "idx": 118,
      "version": "7",
      "when": 1730662702545,
      "tag": "0118_magical_patch",
      "breakpoints": true
    },
    {
      "idx": 119,
      "version": "7",
      "when": 1730822424032,
      "tag": "0119_glamorous_redwing",
      "breakpoints": true
    },
    {
      "idx": 120,
      "version": "7",
      "when": 1730828038521,
      "tag": "0120_polite_lila_cheney",
      "breakpoints": true
    },
    {
      "idx": 121,
      "version": "7",
      "when": 1730986455295,
      "tag": "0121_kind_psynapse",
      "breakpoints": true
    },
    {
      "idx": 122,
      "version": "7",
      "when": 1731346910743,
      "tag": "0122_modern_salo",
      "breakpoints": true
    },
    {
      "idx": 123,
      "version": "7",
      "when": 1731663329805,
      "tag": "0123_silly_black_panther",
      "breakpoints": true
    },
    {
      "idx": 124,
      "version": "7",
      "when": 1731947576229,
      "tag": "0124_familiar_naoko",
      "breakpoints": true
    },
    {
      "idx": 125,
      "version": "7",
      "when": 1732268842513,
      "tag": "0125_rich_the_renegades",
      "breakpoints": true
    },
    {
      "idx": 126,
      "version": "7",
      "when": 1732529252986,
      "tag": "0126_spicy_william_stryker",
      "breakpoints": true
    },
    {
      "idx": 127,
      "version": "7",
      "when": 1732887892895,
      "tag": "0127_narrow_war_machine",
      "breakpoints": true
    },
    {
      "idx": 128,
      "version": "7",
      "when": 1733303270156,
      "tag": "0128_fuzzy_masque",
      "breakpoints": true
    },
    {
      "idx": 129,
      "version": "7",
      "when": 1734106948065,
      "tag": "0129_amazing_shocker",
      "breakpoints": true
    },
    {
      "idx": 130,
      "version": "7",
      "when": 1734544696108,
      "tag": "0130_lowly_vapor",
      "breakpoints": true
    },
    {
      "idx": 131,
      "version": "7",
      "when": 1734628801247,
      "tag": "0131_red_nemesis",
      "breakpoints": true
    },
    {
      "idx": 132,
      "version": "7",
      "when": 1735813008671,
      "tag": "0132_freezing_alice",
      "breakpoints": true
    },
    {
      "idx": 133,
      "version": "7",
      "when": 1737232442629,
      "tag": "0133_ordinary_ultimatum",
      "breakpoints": true
    },
    {
      "idx": 134,
      "version": "7",
      "when": 1738663155338,
      "tag": "0134_nappy_typhoid_mary",
      "breakpoints": true
    },
    {
      "idx": 135,
      "version": "7",
      "when": 1738849757277,
      "tag": "0135_same_firedrake",
      "breakpoints": true
    },
    {
      "idx": 136,
      "version": "7",
      "when": 1738965317281,
      "tag": "0136_rapid_union_jack",
      "breakpoints": true
    },
    {
      "idx": 137,
      "version": "7",
      "when": 1739543819906,
      "tag": "0137_lowly_dorian_gray",
      "breakpoints": true
    },
    {
      "idx": 138,
      "version": "7",
      "when": 1739892148888,
      "tag": "0138_adorable_metal_master",
      "breakpoints": true
    },
    {
      "idx": 139,
      "version": "7",
      "when": 1739973986775,
      "tag": "0139_fast_zaran",
      "breakpoints": true
    },
    {
      "idx": 140,
      "version": "7",
      "when": 1740144724463,
      "tag": "0140_bent_hellion",
      "breakpoints": true
    }
  ]
}