naf_revision_type_id,id,nom,niveau,parent_naf_type_id
NAFRev2,01,"Culture et production animale, chasse et services annexes",2,A
NAFRev2,02,Sylviculture et exploitation forestière,2,A
NAFRev2,03,Pêche et aquaculture,2,A
NAFRev2,05,Extraction de houille et de lignite,2,B
NAFRev2,06,Extraction d'hydrocarbures,2,B
NAFRev2,07,Extraction de minerais métalliques,2,B
NAFRev2,08,Autres industries extractives,2,B
NAFRev2,09,Services de soutien aux industries extractives,2,B
NAFRev2,10,Industries alimentaires,2,C
NAFRev2,11,Fabrication de boissons,2,C
NAFRev2,12,Fabrication de produits à base de tabac,2,C
NAFRev2,13,Fabrication de textiles,2,C
NAFRev2,14,Industrie de l'habillement,2,C
NAFRev2,15,Industrie du cuir et de la chaussure,2,C
NAFRev2,16,"Travail du bois et fabrication d'articles en bois et en liège, à l'exception des meubles ; fabrication d'articles en vannerie et sparterie",2,C
NAFRev2,17,Industrie du papier et du carton,2,C
NAFRev2,18,Imprimerie et reproduction d'enregistrements,2,C
NAFRev2,19,Cokéfaction et raffinage,2,C
NAFRev2,20,Industrie chimique,2,C
NAFRev2,21,Industrie pharmaceutique,2,C
NAFRev2,22,Fabrication de produits en caoutchouc et en plastique,2,C
NAFRev2,23,Fabrication d'autres produits minéraux non métalliques,2,C
NAFRev2,24,Métallurgie,2,C
NAFRev2,25,"Fabrication de produits métalliques, à l'exception des machines et des équipements",2,C
NAFRev2,26,"Fabrication de produits informatiques, électroniques et optiques",2,C
NAFRev2,27,Fabrication d'équipements électriques,2,C
NAFRev2,28,Fabrication de machines et équipements n.c.a.,2,C
NAFRev2,29,Industrie automobile,2,C
NAFRev2,30,Fabrication d'autres matériels de transport,2,C
NAFRev2,31,Fabrication de meubles,2,C
NAFRev2,32,Autres industries manufacturières,2,C
NAFRev2,33,Réparation et installation de machines et d'équipements,2,C
NAFRev2,35,"Production et distribution d'électricité, de gaz, de vapeur et d'air conditionné",2,D
NAFRev2,36,"Captage, traitement et distribution d'eau",2,E
NAFRev2,37,Collecte et traitement des eaux usées,2,E
NAFRev2,38,"Collecte, traitement et élimination des déchets ; récupération",2,E
NAFRev2,39,Dépollution et autres services de gestion des déchets,2,E
NAFRev2,41,Construction de bâtiments,2,F
NAFRev2,42,Génie civil,2,F
NAFRev2,43,Travaux de construction spécialisés,2,F
NAFRev2,45,Commerce et réparation d'automobiles et de motocycles,2,G
NAFRev2,46,"Commerce de gros, à l'exception des automobiles et des motocycles",2,G
NAFRev2,47,"Commerce de détail, à l'exception des automobiles et des motocycles",2,G
NAFRev2,49,Transports terrestres et transport par conduites,2,H
NAFRev2,50,Transports par eau,2,H
NAFRev2,51,Transports aériens,2,H
NAFRev2,52,Entreposage et services auxiliaires des transports,2,H
NAFRev2,53,Activités de poste et de courrier,2,H
NAFRev2,55,Hébergement,2,I
NAFRev2,56,Restauration,2,I
NAFRev2,58,Édition,2,J
NAFRev2,59,"Production de films cinématographiques, de vidéo et de programmes de télévision ; enregistrement sonore et édition musicale",2,J
NAFRev2,60,Programmation et diffusion,2,J
NAFRev2,61,Télécommunications,2,J
NAFRev2,62,"Programmation, conseil et autres activités informatiques",2,J
NAFRev2,63,Services d'information,2,J
NAFRev2,64,"Activités des services financiers, hors assurance et caisses de retraite",2,K
NAFRev2,65,Assurance,2,K
NAFRev2,66,Activités auxiliaires de services financiers et d'assurance,2,K
NAFRev2,68,Activités immobilières,2,L
NAFRev2,69,Activités juridiques et comptables,2,L
NAFRev2,70,Activités des sièges sociaux ; conseil de gestion,2,M
NAFRev2,71,Activités d'architecture et d'ingénierie ; activités de contrôle et analyses techniques,2,M
NAFRev2,72,Recherche-développement scientifique,2,M
NAFRev2,73,Publicité et études de marché,2,M
NAFRev2,74,"Autres activités spécialisées, scientifiques et techniques",2,M
NAFRev2,75,Activités vétérinaires,2,M
NAFRev2,77,Activités de location et location-bail,2,N
NAFRev2,78,Activités liées à l'emploi,2,N
NAFRev2,79,"Activités des agences de voyage, voyagistes, services de réservation et activités connexes",2,N
NAFRev2,80,Enquêtes et sécurité,2,N
NAFRev2,81,Services relatifs aux bâtiments et aménagement paysager,2,N
NAFRev2,82,Activités administratives et autres activités de soutien aux entreprises,2,N
NAFRev2,84,Administration publique et défense ; sécurité sociale obligatoire,2,O
NAFRev2,85,Enseignement,2,P
NAFRev2,86,Activités pour la santé humaine,2,Q
NAFRev2,87,Hébergement médico-social et social,2,Q
NAFRev2,88,Action sociale sans hébergement,2,Q
NAFRev2,90,"Activités créatives, artistiques et de spectacle",2,R
NAFRev2,91,"Bibliothèques, archives, musées et autres activités culturelles",2,R
NAFRev2,92,Organisation de jeux de hasard et d'argent,2,R
NAFRev2,93,"Activités sportives, récréatives et de loisirs",2,R
NAFRev2,94,Activités des organisations associatives,2,S
NAFRev2,95,Réparation d'ordinateurs et de biens personnels et domestiques,2,S
NAFRev2,96,Autres services personnels,2,S
NAFRev2,97,Activités des ménages en tant qu'employeurs de personnel domestique,2,T
NAFRev2,98,Activités indifférenciées des ménages en tant que producteurs de biens et services pour usage propre,2,T
NAFRev2,99,Activités des organisations et organismes extraterritoriaux,2,U
