<svg width="142" height="142" viewBox="0 0 142 142" fill="none" xmlns="http://www.w3.org/2000/svg">
<path fill-rule="evenodd" clip-rule="evenodd" d="M30.1754 14.1999C29.1967 14.1999 28.4004 13.4036 28.4004 12.4249C28.4004 11.4461 29.1967 10.6499 30.1754 10.6499C31.1541 10.6499 31.9504 11.4461 31.9504 12.4249C31.9504 13.4036 31.1541 14.1999 30.1754 14.1999Z" fill="#ECECFE"/>
<path fill-rule="evenodd" clip-rule="evenodd" d="M12.4254 113.6C11.4467 113.6 10.6504 112.804 10.6504 111.825C10.6504 110.846 11.4467 110.05 12.4254 110.05C13.4041 110.05 14.2004 110.846 14.2004 111.825C14.2004 112.804 13.4041 113.6 12.4254 113.6Z" fill="#ECECFE"/>
<path fill-rule="evenodd" clip-rule="evenodd" d="M136.675 102.95C135.697 102.95 134.9 102.154 134.9 101.175C134.9 100.196 135.697 99.3999 136.675 99.3999C137.654 99.3999 138.45 100.196 138.45 101.175C138.45 102.154 137.654 102.95 136.675 102.95Z" fill="#ECECFE"/>
<path fill-rule="evenodd" clip-rule="evenodd" d="M108.275 10.6501C107.296 10.6501 106.5 9.85383 106.5 8.8751C106.5 7.89628 107.296 7.1001 108.275 7.1001C109.254 7.1001 110.05 7.89628 110.05 8.8751C110.05 9.85383 109.254 10.6501 108.275 10.6501Z" fill="#ECECFE"/>
<path fill-rule="evenodd" clip-rule="evenodd" d="M69.2242 74.5498C63.3424 74.5498 58.5742 79.318 58.5742 85.1998C58.5742 89.1418 60.7159 92.5836 63.8992 94.425V101.175C63.8992 104.116 66.2833 106.5 69.2242 106.5C72.1651 106.5 74.5492 104.116 74.5492 101.175V94.425C77.7325 92.5836 79.8742 89.1418 79.8742 85.1998C79.8742 79.318 75.1061 74.5498 69.2242 74.5498ZM69.2242 92.2998C73.1454 92.2998 76.3242 89.121 76.3242 85.1998C76.3242 81.2786 73.1454 78.0998 69.2242 78.0998C65.303 78.0998 62.1242 81.2786 62.1242 85.1998C62.1242 89.121 65.303 92.2998 69.2242 92.2998ZM67.4492 95.8498V101.175C67.4492 102.085 68.1344 102.835 69.0172 102.938L69.2242 102.95C70.2045 102.95 70.9992 102.155 70.9992 101.175V95.8498H67.4492Z" fill="#E1000F"/>
<path d="M104.252 110.975L104.091 112.698H101.924L101.555 108.857C104.229 108.578 105.981 107.996 105.981 106.017C105.981 104.806 105.059 103.968 103.86 103.968C102.638 103.968 101.878 104.62 101.025 105.901L98.5121 104.341C99.803 102.269 101.555 101.175 103.998 101.175C106.719 101.175 109.162 103.061 109.162 106.017C109.162 108.741 107.11 110.486 104.252 110.975Z" fill="#000091"/>
<path d="M105.036 116.19C105.036 117.284 104.091 118.215 103.03 118.215C101.924 118.215 101.002 117.284 101.002 116.19C101.002 115.096 101.924 114.165 103.03 114.165C104.091 114.165 105.036 115.096 105.036 116.19Z" fill="#000091"/>
<path fill-rule="evenodd" clip-rule="evenodd" d="M69.2246 17.75C86.5686 17.75 99.3996 27.7905 99.3996 42.9395C99.3996 43.9198 98.6049 44.7145 97.6246 44.7145C96.6443 44.7145 95.8496 43.9198 95.8496 42.9395C95.8496 29.9682 84.7723 21.3 69.2246 21.3C53.8928 21.3 42.9082 29.729 42.606 42.4015L42.5996 42.9395V49.7H49.6996C52.6405 49.7 55.0246 52.0841 55.0246 55.025V58.575C55.0246 59.1974 54.9178 59.7948 54.7216 60.35H83.7276C83.5314 59.7948 83.4246 59.1974 83.4246 58.575V55.025C83.4246 52.0841 85.8087 49.7 88.7496 49.7V43.7055C88.7496 34.5554 80.5901 28.4 69.0345 28.4C58.9626 28.4 51.2927 33.1571 49.6575 40.5308C49.4453 41.4879 48.4974 42.0917 47.5403 41.8794C46.5833 41.6672 45.9795 40.7193 46.1917 39.7622C48.2315 30.5639 57.4441 24.85 69.0345 24.85C82.1627 24.85 91.9932 32.1135 92.2926 43.1838L92.2996 43.7055V49.7H97.6246C100.566 49.7 102.95 52.0841 102.95 55.025V58.575C102.95 59.1974 102.843 59.7948 102.647 60.35H103.026C106.857 60.35 109.863 63.7616 110.041 67.9286L110.05 68.3214V79.875C110.05 80.8553 109.255 81.65 108.275 81.65C107.364 81.65 106.614 80.9648 106.512 80.082L106.5 79.875V68.3214C106.5 65.929 105.011 64.0681 103.265 63.9108L103.026 63.9H31.8735C30.1066 63.9 28.5415 65.6569 28.4087 67.9985L28.3996 68.3214V85.2H40.8246C41.8049 85.2 42.5996 85.9947 42.5996 86.975C42.5996 87.8853 41.9144 88.6355 41.0316 88.7381L40.8246 88.75H28.3996V99.4H39.0496L39.3625 99.409C42.1578 99.571 44.3746 101.889 44.3746 104.725V117.15H86.6766C85.7266 114.976 85.1996 112.574 85.1996 110.05C85.1996 100.247 93.1466 92.3 102.95 92.3C112.753 92.3 120.7 100.247 120.7 110.05C120.7 119.853 112.753 127.8 102.95 127.8C97.1425 127.8 91.9866 125.011 88.7483 120.7H31.8735C28.0427 120.7 25.0367 117.288 24.858 113.121L24.8496 112.729V68.3214C24.8496 64.1098 27.7396 60.5705 31.5169 60.3599L31.8735 60.35H35.8026C35.6064 59.7948 35.4996 59.1974 35.4996 58.575V55.025C35.4996 52.6974 36.993 50.7186 39.0739 49.9945C39.0691 49.9656 39.065 49.9364 39.0616 49.907L39.0496 49.7V42.9395C39.0496 27.7905 51.8806 17.75 69.2246 17.75ZM97.6246 60.35C98.6049 60.35 99.3996 59.5553 99.3996 58.575V55.025C99.3996 54.0447 98.6049 53.25 97.6246 53.25H88.7496C87.7693 53.25 86.9746 54.0447 86.9746 55.025V58.575C86.9746 59.5553 87.7693 60.35 88.7496 60.35H97.6246ZM51.4746 58.575C51.4746 59.5553 50.6799 60.35 49.6996 60.35H40.8246C39.8443 60.35 39.0496 59.5553 39.0496 58.575V55.025C39.0496 54.0447 39.8443 53.25 40.8246 53.25H49.6996C50.6799 53.25 51.4746 54.0447 51.4746 55.025V58.575ZM28.3996 112.729V102.95H39.0496C39.9599 102.95 40.7101 103.635 40.8127 104.518L40.8246 104.725V117.15H31.8735L31.634 117.139C29.8879 116.982 28.3996 115.121 28.3996 112.729ZM102.95 95.85C110.792 95.85 117.15 102.208 117.15 110.05C117.15 117.892 110.792 124.25 102.95 124.25C95.1072 124.25 88.7496 117.892 88.7496 110.05C88.7496 102.208 95.1072 95.85 102.95 95.85Z" fill="#000091"/>
<path d="M110.05 86.975C110.05 87.9553 109.255 88.75 108.275 88.75C107.294 88.75 106.5 87.9553 106.5 86.975C106.5 85.9947 107.294 85.2 108.275 85.2C109.255 85.2 110.05 85.9947 110.05 86.975Z" fill="#000091"/>
<path d="M46.1496 86.975C46.1496 85.9947 46.9443 85.2 47.9246 85.2C48.9049 85.2 49.6996 85.9947 49.6996 86.975C49.6996 87.9553 48.9049 88.75 47.9246 88.75C46.9443 88.75 46.1496 87.9553 46.1496 86.975Z" fill="#000091"/>
</svg>
