{
  "$schema": "https://raw.githubusercontent.com/infection/infection/0.26.18/resources/schema.json",
  "source": {
    "directories": ["./src/"]
  },
  "phpUnit": {
    "configDir": "./"
  },
  "logs": {
    "html": "./ci/infection/infection.html"
  }
}
