<svg width="33" height="32" viewBox="0 0 33 32" fill="none" xmlns="http://www.w3.org/2000/svg">
<path d="M14.2651 4H19.5984C22.4274 4 25.1405 5.12381 27.1409 7.12419C29.1413 9.12458 30.2651 11.8377 30.2651 14.6667C30.2651 17.4956 29.1413 20.2088 27.1409 22.2091C25.1405 24.2095 22.4274 25.3333 19.5984 25.3333V30C12.9318 27.3333 3.59842 23.3333 3.59842 14.6667C3.59842 11.8377 4.72223 9.12458 6.72261 7.12419C8.723 5.12381 11.4361 4 14.2651 4ZM16.9318 22.6667H19.5984C20.649 22.6667 21.6893 22.4597 22.6599 22.0577C23.6305 21.6557 24.5124 21.0664 25.2553 20.3235C25.9981 19.5807 26.5874 18.6987 26.9895 17.7281C27.3915 16.7575 27.5984 15.7172 27.5984 14.6667C27.5984 13.6161 27.3915 12.5758 26.9895 11.6052C26.5874 10.6346 25.9981 9.75268 25.2553 9.00981C24.5124 8.26694 23.6305 7.67767 22.6599 7.27563C21.6893 6.87359 20.649 6.66667 19.5984 6.66667H14.2651C12.1434 6.66667 10.1085 7.50952 8.60823 9.00981C7.10794 10.5101 6.26509 12.5449 6.26509 14.6667C6.26509 19.48 9.54775 22.6213 16.9318 25.9733V22.6667Z" fill="#27A658"/>
<path d="M16.5318 19.3333L13.6681 14.6667L16.5318 10H13.4408L10.5318 14.6667L13.4408 19.3333H16.5318ZM22.5318 19.3333L19.6681 14.6667L22.5318 10H19.4408L16.5318 14.6667L19.4408 19.3333H22.5318Z" fill="#27A658"/>
</svg>
