<svg width="80" height="79" viewBox="0 0 80 79" fill="none" xmlns="http://www.w3.org/2000/svg">
<g clip-path="url(#clip0_1761_113782)">
<path fill-rule="evenodd" clip-rule="evenodd" d="M74.6997 63.802C74.7013 63.7363 74.7022 63.6704 74.7022 63.6042C74.7022 59.3454 71.2497 55.893 66.9909 55.893C62.7321 55.893 59.2797 59.3454 59.2797 63.6042C59.2797 63.6704 59.2805 63.7363 59.2822 63.802H74.6997Z" fill="#009F79"/>
<mask id="mask0_1761_113782" style="mask-type:alpha" maskUnits="userSpaceOnUse" x="56" y="55" width="17" height="9">
<path fill-rule="evenodd" clip-rule="evenodd" d="M72.326 63.8019C72.3277 63.7362 72.3285 63.6703 72.3285 63.6042C72.3285 59.3454 68.8761 55.893 64.6172 55.893C60.3584 55.893 56.906 59.3454 56.906 63.6042C56.906 63.6703 56.9068 63.7362 56.9085 63.8019H72.326Z" fill="black" fill-opacity="0.25"/>
</mask>
<g mask="url(#mask0_1761_113782)">
<path fill-rule="evenodd" clip-rule="evenodd" d="M74.6976 63.802C74.6993 63.7363 74.7001 63.6704 74.7001 63.6042C74.7001 59.3454 71.2477 55.893 66.9889 55.893C62.7301 55.893 59.2776 59.3454 59.2776 63.6042C59.2776 63.6704 59.2785 63.7363 59.2801 63.802H74.6976Z" fill="black"/>
</g>
<path fill-rule="evenodd" clip-rule="evenodd" d="M72.6486 53.2478C72.6502 53.1821 72.6511 53.1162 72.6511 53.0501C72.6511 48.7913 69.1986 45.3389 64.9398 45.3389C60.681 45.3389 57.2286 48.7913 57.2286 53.0501C57.2286 53.1162 57.2294 53.1821 57.2311 53.2478H72.6486Z" fill="#009F79"/>
<mask id="mask1_1761_113782" style="mask-type:alpha" maskUnits="userSpaceOnUse" x="54" y="45" width="17" height="9">
<path fill-rule="evenodd" clip-rule="evenodd" d="M70.2745 53.2478C70.2762 53.1821 70.277 53.1162 70.277 53.0501C70.277 48.7913 66.8246 45.3389 62.5658 45.3389C58.307 45.3389 54.8545 48.7913 54.8545 53.0501C54.8545 53.1162 54.8554 53.1821 54.857 53.2478H70.2745Z" fill="black" fill-opacity="0.25"/>
</mask>
<g mask="url(#mask1_1761_113782)">
<path fill-rule="evenodd" clip-rule="evenodd" d="M72.647 53.2478C72.6486 53.1821 72.6495 53.1162 72.6495 53.05C72.6495 48.7912 69.197 45.3388 64.9382 45.3388C60.6794 45.3388 57.227 48.7912 57.227 53.05C57.227 53.1162 57.2278 53.1821 57.2295 53.2478H72.647Z" fill="black"/>
</g>
<path fill-rule="evenodd" clip-rule="evenodd" d="M80.7012 53.2478C80.7028 53.1821 80.7037 53.1163 80.7037 53.0502C80.7037 48.7914 77.2512 45.3389 72.9924 45.3389C68.7336 45.3389 65.2812 48.7914 65.2812 53.0502C65.2812 53.1163 65.282 53.1821 65.2837 53.2478H80.7012Z" fill="#009F79"/>
<mask id="mask2_1761_113782" style="mask-type:alpha" maskUnits="userSpaceOnUse" x="62" y="45" width="17" height="9">
<path fill-rule="evenodd" clip-rule="evenodd" d="M78.3283 53.2478C78.33 53.1821 78.3308 53.1162 78.3308 53.0501C78.3308 48.7913 74.8784 45.3389 70.6196 45.3389C66.3608 45.3389 62.9083 48.7913 62.9083 53.0501C62.9083 53.1162 62.9092 53.1821 62.9108 53.2478H78.3283Z" fill="black" fill-opacity="0.25"/>
</mask>
<g mask="url(#mask2_1761_113782)">
<path fill-rule="evenodd" clip-rule="evenodd" d="M80.7008 53.2479C80.7024 53.1822 80.7032 53.1162 80.7032 53.0501C80.7032 48.7913 77.2508 45.3389 72.992 45.3389C68.7332 45.3389 65.2808 48.7913 65.2808 53.0501C65.2808 53.1162 65.2816 53.1822 65.2832 53.2479H80.7008Z" fill="black"/>
</g>
<rect x="16.7331" y="34.5657" width="23.7281" height="26.2704" fill="#273475"/>
<path d="M33.6819 22.4898H52.5373L64.6132 34.5657H40.4614C37.8966 29.8498 36.2468 27.2057 33.6819 22.4898Z" fill="#FED131"/>
<rect x="33.2591" y="19.3119" width="2.96601" height="7.6269" fill="#3B5FA9"/>
<rect x="24.3597" y="19.3119" width="8.89805" height="7.6269" fill="#273475"/>
<rect x="40.4608" y="34.5657" width="24.1518" height="26.2704" fill="#FEFEFE"/>
<path d="M33.2591 26.9387H36.437L40.4623 34.5656L33.2591 26.9387Z" fill="#FED131"/>
<path d="M24.36 26.9387H33.258L40.4612 34.5656L28.5972 39.158L16.7331 34.5656L24.36 26.9387Z" fill="#273475"/>
<path d="M40.4574 57.4185H53.428V63.8045H40.4574V57.4185Z" fill="#273475"/>
<path d="M50.6306 49.1838C50.6306 47.6627 51.8636 46.4296 53.3847 46.4296C54.9058 46.4296 56.1389 47.6627 56.1389 49.1838V57.4463H50.6306V49.1838Z" fill="#273475"/>
<rect x="44.2743" y="57.4464" width="17.8364" height="1.27115" fill="#3B5FA9"/>
<rect x="46.6983" y="58.7175" width="17.8364" height="1.27115" fill="#3B5FA9"/>
<rect x="49.1212" y="59.9886" width="17.8364" height="1.27115" fill="#3B5FA9"/>
<rect x="51.0873" y="61.2598" width="17.8364" height="1.27115" fill="#3B5FA9"/>
<rect x="53.0522" y="62.531" width="17.8364" height="1.27115" fill="#3B5FA9"/>
<rect x="58.4659" y="36.6659" width="3.81345" height="5.93203" fill="#273475"/>
<line x1="58.4659" y1="39.4293" x2="62.2793" y2="39.4293" stroke="white" stroke-width="0.405238"/>
<line x1="60.3629" y1="36.6659" x2="60.3629" y2="42.5979" stroke="white" stroke-width="0.405238"/>
<rect x="43.349" y="36.666" width="3.81345" height="5.93203" fill="#273475"/>
<line x1="43.3491" y1="39.4294" x2="47.1625" y2="39.4294" stroke="white" stroke-width="0.405238"/>
<line x1="45.2472" y1="36.666" x2="45.2472" y2="42.598" stroke="white" stroke-width="0.405238"/>
<rect x="12.53" y="41.345" width="1.27115" height="22.0333" fill="#273475"/>
<path fill-rule="evenodd" clip-rule="evenodd" d="M42.3698 63.802C42.3717 63.7246 42.3727 63.6469 42.3727 63.569C42.3727 58.5494 38.3036 54.4803 33.284 54.4803C28.2644 54.4803 24.1953 58.5494 24.1953 63.569C24.1953 63.6469 24.1963 63.7246 24.1982 63.802H42.3698Z" fill="#009F79"/>
<mask id="mask3_1761_113782" style="mask-type:alpha" maskUnits="userSpaceOnUse" x="21" y="54" width="19" height="10">
<path fill-rule="evenodd" clip-rule="evenodd" d="M39.572 63.802C39.5739 63.7246 39.5749 63.6469 39.5749 63.5689C39.5749 58.5494 35.5057 54.4802 30.4862 54.4802C25.4666 54.4802 21.3975 58.5494 21.3975 63.5689C21.3975 63.6469 21.3984 63.7246 21.4004 63.802H39.572Z" fill="black" fill-opacity="0.25"/>
</mask>
<g mask="url(#mask3_1761_113782)">
<path fill-rule="evenodd" clip-rule="evenodd" d="M42.3698 63.802C42.3717 63.7246 42.3727 63.6469 42.3727 63.569C42.3727 58.5494 38.3036 54.4803 33.284 54.4803C28.2644 54.4803 24.1953 58.5494 24.1953 63.569C24.1953 63.6469 24.1963 63.7246 24.1982 63.802H42.3698Z" fill="black"/>
</g>
<path fill-rule="evenodd" clip-rule="evenodd" d="M19.0659 60.8359C19.0676 60.7655 19.0685 60.6948 19.0685 60.624C19.0685 56.0607 15.3693 52.3615 10.806 52.3615C6.24281 52.3615 2.54358 56.0607 2.54358 60.624C2.54358 60.6948 2.54447 60.7655 2.54624 60.8359H19.0659Z" fill="#009F79"/>
<mask id="mask4_1761_113782" style="mask-type:alpha" maskUnits="userSpaceOnUse" x="0" y="52" width="17" height="17">
<path fill-rule="evenodd" clip-rule="evenodd" d="M16.5027 61.2344C16.5175 61.0329 16.5249 60.8294 16.5249 60.6241C16.5249 56.0609 12.8257 52.3616 8.26247 52.3616C3.69923 52.3616 0 56.0609 0 60.6241C0 63.1639 1.14597 65.4361 2.94906 66.9518V61.2344H16.5027ZM8.81351 68.8685H7.71143C7.89356 68.8805 8.0773 68.8866 8.26247 68.8866C8.44764 68.8866 8.63138 68.8805 8.81351 68.8685Z" fill="black" fill-opacity="0.25"/>
</mask>
<g mask="url(#mask4_1761_113782)">
<path fill-rule="evenodd" clip-rule="evenodd" d="M19.0647 60.8359C19.0665 60.7655 19.0674 60.6949 19.0674 60.624C19.0674 56.0608 15.3681 52.3616 10.8049 52.3616C6.24165 52.3616 2.54242 56.0608 2.54242 60.624C2.54242 60.6949 2.54331 60.7655 2.54508 60.8359H19.0647Z" fill="black"/>
</g>
<rect x="2.54327" y="60.8359" width="16.5249" height="2.96601" fill="#009F79"/>
<rect x="2.54327" y="60.8359" width="13.9826" height="2.96601" fill="#00775B"/>
<path fill-rule="evenodd" clip-rule="evenodd" d="M30.2956 63.802C30.2976 63.7246 30.2985 63.6469 30.2985 63.569C30.2985 58.5494 26.2294 54.4803 21.2098 54.4803C16.1903 54.4803 12.1211 58.5494 12.1211 63.569C12.1211 63.6469 12.1221 63.7246 12.124 63.802H30.2956Z" fill="#009F79"/>
<mask id="mask5_1761_113782" style="mask-type:alpha" maskUnits="userSpaceOnUse" x="9" y="54" width="19" height="10">
<path fill-rule="evenodd" clip-rule="evenodd" d="M27.4978 63.802C27.4997 63.7245 27.5007 63.6469 27.5007 63.569C27.5007 58.5494 23.4315 54.4803 18.412 54.4803C13.3924 54.4803 9.32324 58.5494 9.32324 63.569C9.32324 63.6469 9.32422 63.7245 9.32617 63.802H27.4978Z" fill="black" fill-opacity="0.25"/>
</mask>
<g mask="url(#mask5_1761_113782)">
<path fill-rule="evenodd" clip-rule="evenodd" d="M30.2944 63.8021C30.2963 63.7246 30.2973 63.647 30.2973 63.5691C30.2973 58.5495 26.2282 54.4803 21.2086 54.4803C16.189 54.4803 12.1199 58.5495 12.1199 63.5691C12.1199 63.647 12.1209 63.7246 12.1228 63.8021H30.2944Z" fill="black"/>
</g>
<path d="M4.4102 40.5368C4.4102 36.0968 8.00955 14.9064 12.4496 14.9064C16.8896 14.9064 20.489 36.0968 20.489 40.5368C20.489 44.9768 16.8896 48.5762 12.4496 48.5762C8.00955 48.5762 4.4102 44.9768 4.4102 40.5368Z" fill="#009F79"/>
<mask id="mask6_1761_113782" style="mask-type:alpha" maskUnits="userSpaceOnUse" x="6" y="12" width="17" height="37">
<path d="M6.88609 40.5369C6.88609 36.0968 10.4854 12.1579 14.9255 12.1579C19.3655 12.1579 22.9648 36.0968 22.9648 40.5369C22.9648 44.9769 19.3655 48.5762 14.9255 48.5762C10.4854 48.5762 6.88609 44.9769 6.88609 40.5369Z" fill="black" fill-opacity="0.25"/>
</mask>
<g mask="url(#mask6_1761_113782)">
<path d="M4.41044 40.5368C4.41044 36.0968 8.67406 14.9064 13.1141 14.9064C17.5541 14.9064 20.4892 36.0968 20.4892 40.5368C20.4892 44.9768 16.8898 48.5762 12.4498 48.5762C8.00979 48.5762 4.41044 44.9768 4.41044 40.5368Z" fill="black"/>
</g>
<rect x="55.6928" y="42.4673" width="4.88288" height="2.58506" transform="rotate(25.1243 55.6928 42.4673)" fill="#C4C4C4"/>
<rect x="55.6928" y="42.4673" width="1.72337" height="2.58506" transform="rotate(25.1243 55.6928 42.4673)" fill="#3B5FA9"/>
<rect x="57.2532" y="43.1992" width="1.72337" height="2.58506" transform="rotate(25.1243 57.2532 43.1992)" fill="white"/>
<rect x="58.8135" y="43.9308" width="1.72337" height="2.58506" transform="rotate(25.1243 58.8135 43.9308)" fill="#CE0500"/>
<rect x="55.5299" y="42.3997" width="0.287228" height="5.17011" transform="rotate(25.1243 55.5299 42.3997)" fill="#273475"/>
<rect width="4.88288" height="2.58506" transform="matrix(-0.905389 0.424583 0.424583 0.905389 51.2358 42.4673)" fill="#C4C4C4"/>
<rect width="1.72337" height="2.58506" transform="matrix(-0.905389 0.424583 0.424583 0.905389 51.2358 42.4673)" fill="#3B5FA9"/>
<rect width="1.72337" height="2.58506" transform="matrix(-0.905389 0.424583 0.424583 0.905389 49.6756 43.1992)" fill="white"/>
<rect width="1.72337" height="2.58506" transform="matrix(-0.905389 0.424583 0.424583 0.905389 48.1153 43.9308)" fill="#CE0500"/>
<rect width="0.287228" height="5.17011" transform="matrix(-0.905389 0.424583 0.424583 0.905389 51.3999 42.3998)" fill="#273475"/>
</g>
<defs>
<clipPath id="clip0_1761_113782">
<rect width="80" height="77.8947" fill="white" transform="translate(0 0.157898)"/>
</clipPath>
</defs>
</svg>
