<svg width="201" height="160" viewBox="0 0 201 160" fill="none" xmlns="http://www.w3.org/2000/svg">
<path d="M29.3969 144.643C68.5927 165.12 132.146 165.12 171.342 144.643C210.537 124.167 210.537 90.9676 171.342 70.4868C132.146 50.0061 68.6106 50.0105 29.3969 70.4868C-9.81688 90.9631 -9.78102 124.167 29.3969 144.643Z" fill="#F5F5F5"/>
<path d="M18.4677 111.063L5.72656 103.709V76.3804L18.4677 83.7391V111.063Z" fill="#E0E0E0"/>
<path d="M18.4668 83.7388L36.6709 73.2295V100.554L18.4668 111.063V83.7388Z" fill="#EBEBEB"/>
<path d="M36.6718 73.2298L18.4677 83.7391L5.72656 76.3804L23.9307 65.8711L36.6718 73.2298Z" fill="#F5F5F5"/>
<path d="M20.2916 84.7878L34.8522 76.3804L35.1883 76.5731V86.697L20.6232 95.1044L20.2871 94.9117L20.2916 84.7878Z" fill="#E0E0E0"/>
<path d="M20.623 84.9847L35.1881 76.5728V86.6966L20.623 95.104V84.9847Z" fill="#F5F5F5"/>
<path d="M26.3326 83.4028L28.8109 81.9732C29.1291 81.785 29.389 81.8701 29.389 82.1614C29.3659 82.3398 29.3017 82.5104 29.2014 82.6598C29.101 82.8091 28.9674 82.9331 28.8109 83.0219L26.3326 84.4515C26.0099 84.6397 25.75 84.5546 25.75 84.2633C25.7732 84.0843 25.838 83.9133 25.9392 83.7639C26.0404 83.6145 26.1751 83.4908 26.3326 83.4028Z" fill="#E0E0E0"/>
<path d="M19.9551 97.5959L34.5157 89.1885V99.3123L34.8518 99.505L20.2867 107.912L19.9551 107.72V97.5959Z" fill="#E0E0E0"/>
<path d="M20.2871 97.7883L34.8522 89.3809V99.5047L20.2871 107.912V97.7883Z" fill="#F5F5F5"/>
<path d="M25.9977 96.2108L28.4984 94.7857C28.8211 94.5975 29.081 94.6826 29.081 94.9739C29.0578 95.1528 28.993 95.3239 28.8918 95.4733C28.7907 95.6227 28.6559 95.7463 28.4984 95.8344L26.0201 97.264C25.6974 97.4522 25.4375 97.3671 25.4375 97.0758C25.4576 96.8981 25.5187 96.7275 25.6159 96.5774C25.7131 96.4273 25.8438 96.3019 25.9977 96.2108Z" fill="#E0E0E0"/>
<path d="M18.4677 82.1614L5.72656 74.8026V47.4785L18.4677 54.8328V82.1614Z" fill="#E0E0E0"/>
<path d="M18.4668 54.8325L36.6709 44.3232V71.6519L18.4668 82.1611V54.8325Z" fill="#EBEBEB"/>
<path d="M36.6718 44.3235L18.4677 54.8328L5.72656 47.4785L23.9307 36.9692L36.6718 44.3235Z" fill="#F5F5F5"/>
<path d="M20.2871 55.8859L34.8522 47.4785L35.1883 47.6712V57.7951L20.6232 66.2025L20.2871 66.0053V55.8859Z" fill="#E0E0E0"/>
<path d="M26.3326 54.4967L28.8064 53.0671C29.1291 52.8833 29.389 52.9685 29.389 53.2598C29.3651 53.4385 29.3001 53.6092 29.199 53.7585C29.0979 53.9078 28.9635 54.0316 28.8064 54.1202L26.3326 55.5498C26.0099 55.7336 25.75 55.6529 25.75 55.3616C25.7736 55.1822 25.8385 55.0107 25.9396 54.8606C26.0407 54.7105 26.1752 54.586 26.3326 54.4967Z" fill="#E0E0E0"/>
<path d="M19.9551 68.6945L34.5157 60.2871V70.4065L34.8518 70.5992L20.2867 79.0066L19.9551 78.8139V68.6945Z" fill="#E0E0E0"/>
<path d="M20.2871 68.8869L34.8522 60.4795V70.5989L20.2871 79.0063V68.8869Z" fill="#F5F5F5"/>
<path d="M25.9967 67.3048L28.4974 65.8752C28.8156 65.6914 29.08 65.7766 29.08 66.0679C29.0548 66.2462 28.9892 66.4164 28.8882 66.5655C28.7872 66.7146 28.6536 66.8387 28.4974 66.9283L25.9967 68.3445C25.674 68.5282 25.4141 68.4431 25.4141 68.1563C25.4396 67.9792 25.5054 67.8104 25.6064 67.6628C25.7074 67.5152 25.8409 67.3927 25.9967 67.3048Z" fill="#E0E0E0"/>
<path d="M20.2871 55.8859L34.8522 47.4785V57.5979L20.2871 66.0053V55.8859Z" fill="#E0E0E0"/>
<path d="M42.1348 52.4805L34.1621 47.8779V56.7962L42.1348 61.3943V52.4805Z" fill="#E0E0E0"/>
<path d="M25.75 67.448V54.8324L28.8737 53.0219L29.389 53.7837L38.4911 48.5269V60.0893L25.75 67.448Z" fill="#EBEBEB"/>
<path d="M25.75 67.4485L26.6598 56.4104L39.4009 49.0562L38.4911 60.0898L25.75 67.4485Z" fill="#F5F5F5"/>
<path d="M27.5695 60.8875L20.623 56.8765V65.7948L27.5695 69.8013V60.8875Z" fill="#EBEBEB"/>
<path d="M27.5684 60.09L42.1335 51.6826V61.802L27.5684 70.2094V60.09Z" fill="#F5F5F5"/>
<path d="M33.2799 58.5079L35.7537 57.0783C36.0764 56.8945 36.3363 56.9797 36.3363 57.271C36.3121 57.4496 36.2469 57.6202 36.1458 57.7695C36.0447 57.9187 35.9105 58.0426 35.7537 58.1315L33.2799 59.5611C32.9572 59.7448 32.6973 59.6597 32.6973 59.3728C32.7209 59.1934 32.7857 59.0219 32.8868 58.8719C32.9879 58.7218 33.1225 58.5972 33.2799 58.5079Z" fill="#E0E0E0"/>
<path d="M27.5699 60.0899L27.0859 59.812V69.9314L27.5699 70.2093V60.0899Z" fill="#E0E0E0"/>
<path d="M27.0859 59.8118L41.6466 51.3999L42.135 51.6822L27.5699 60.0897L27.0859 59.8118Z" fill="#EBEBEB"/>
<path d="M168.994 94.5076L156.248 87.1488V59.8247L168.994 67.179V94.5076Z" fill="#E0E0E0"/>
<path d="M168.994 67.1797L187.198 56.6704V83.999L168.994 94.5083V67.1797Z" fill="#EBEBEB"/>
<path d="M187.198 56.6703L168.994 67.1795L156.248 59.8253L174.457 49.3115L187.198 56.6703Z" fill="#F5F5F5"/>
<path d="M170.814 68.2321L185.38 59.8247L185.716 60.0174L185.711 70.1368L171.151 78.5442L170.814 78.3515V68.2321Z" fill="#E0E0E0"/>
<path d="M171.15 68.425L185.715 60.0176L185.711 70.137L171.15 78.5444V68.425Z" fill="#F5F5F5"/>
<path d="M176.86 66.8431L179.334 65.4134C179.656 65.2297 179.916 65.3148 179.916 65.6017C179.893 65.7811 179.828 65.9526 179.727 66.1027C179.626 66.2527 179.491 66.3773 179.334 66.4666L176.86 67.8962C176.537 68.08 176.277 67.9948 176.277 67.708C176.301 67.5286 176.366 67.3571 176.467 67.207C176.568 67.0569 176.703 66.9323 176.86 66.8431Z" fill="#E0E0E0"/>
<path d="M170.477 81.0413L185.042 72.6294V82.7533L185.378 82.946L170.813 91.3534L170.477 91.1607V81.0413Z" fill="#E0E0E0"/>
<path d="M170.814 81.2341L185.38 72.8267V82.946L170.814 91.3535V81.2341Z" fill="#F5F5F5"/>
<path d="M176.524 79.6521L179.002 78.2225C179.321 78.0388 179.58 78.1239 179.58 78.4108C179.557 78.5896 179.492 78.7605 179.392 78.9105C179.292 79.0604 179.158 79.1854 179.002 79.2757L176.524 80.7053C176.201 80.8891 175.941 80.8039 175.941 80.5126C175.966 80.334 176.031 80.1634 176.132 80.0141C176.233 79.8649 176.367 79.741 176.524 79.6521Z" fill="#E0E0E0"/>
<path d="M47.7705 123.069C47.7705 123.069 47.8198 115.961 43.3382 110.632C39.372 105.913 37.2612 102.92 38.5115 101.539C39.7619 100.159 42.4508 99.8272 46.0764 103.646C49.702 107.464 49.9844 118.04 49.4824 120.433L47.7705 123.069Z" fill="#90CAF9"/>
<path opacity="0.2" d="M47.7705 123.069C47.7705 123.069 47.8198 115.961 43.3382 110.632C39.372 105.913 37.2612 102.92 38.5115 101.539C39.7619 100.159 42.4508 99.8272 46.0764 103.646C49.702 107.464 49.9844 118.04 49.4824 120.433L47.7705 123.069Z" fill="black"/>
<path d="M48.522 115.428C48.4709 115.428 48.4213 115.411 48.3814 115.379C48.3415 115.347 48.3136 115.303 48.3024 115.253C46.7338 107.917 42.7094 103.861 40.4462 102.095C40.3993 102.059 40.3688 102.005 40.3612 101.947C40.3536 101.888 40.3697 101.828 40.4058 101.781C40.443 101.734 40.4971 101.704 40.5567 101.696C40.6162 101.689 40.6763 101.705 40.724 101.741C43.032 103.534 47.1416 107.684 48.7416 115.159C48.7481 115.188 48.7489 115.217 48.7439 115.246C48.7388 115.275 48.728 115.302 48.7122 115.327C48.6963 115.352 48.6756 115.373 48.6514 115.389C48.6272 115.406 48.6 115.418 48.5713 115.423L48.522 115.428Z" fill="white"/>
<path d="M47.6004 125.708L45.7764 126.761C45.5818 126.23 45.2537 125.757 44.8235 125.389C44.3934 125.021 43.8758 124.77 43.3205 124.659C41.3262 124.211 39.2557 124.287 37.8574 122.558C36.4592 120.828 38.1622 118.945 37.8574 117.673C37.5527 116.4 37.3555 116.032 34.8548 114.76C32.3541 113.487 31.3681 111.376 33.2504 109.946C35.1326 108.517 38.1801 109.566 40.0265 110.843C41.6668 111.963 43.2263 112.259 45.0593 112.488C46.8923 112.716 49.877 113.733 49.4199 117.991C49.1205 120.626 48.5098 123.217 47.6004 125.708Z" fill="#90CAF9"/>
<path d="M40.6016 120.115C40.5538 120.115 40.5074 120.1 40.4688 120.072C40.4302 120.043 40.4014 120.004 40.3864 119.959C40.3695 119.902 40.3754 119.84 40.403 119.787C40.4307 119.735 40.4778 119.695 40.5343 119.676C40.6957 119.627 44.5677 118.399 46.2125 119.717C46.2533 119.755 46.2782 119.808 46.2822 119.864C46.2862 119.92 46.269 119.975 46.2341 120.019C46.1991 120.063 46.149 120.092 46.0935 120.101C46.0381 120.11 45.9814 120.097 45.9346 120.066C44.4826 118.901 40.7091 120.093 40.6688 120.106L40.6016 120.115Z" fill="white"/>
<path d="M47.8012 125.368C47.7466 125.368 47.6939 125.348 47.6533 125.311C47.6127 125.275 47.5871 125.225 47.5816 125.17C46.5822 115.732 35.2124 111.255 35.1004 111.21C35.0726 111.2 35.0472 111.184 35.0256 111.164C35.004 111.143 34.9866 111.119 34.9745 111.092C34.9624 111.065 34.9558 111.035 34.9551 111.006C34.9544 110.976 34.9596 110.947 34.9704 110.919C34.9925 110.865 35.0345 110.821 35.0879 110.797C35.1413 110.773 35.2019 110.77 35.2573 110.789C35.3783 110.838 46.999 115.41 48.0252 125.13C48.0315 125.189 48.0144 125.248 47.9774 125.294C47.9405 125.34 47.8868 125.37 47.8281 125.377L47.8012 125.368Z" fill="white"/>
<path d="M159.274 119.51C159.323 119.353 161.246 109.458 159.274 102.44C157.481 96.0043 155.142 93.6291 151.808 93.1047C148.473 92.5804 147.026 94.9825 148.796 98.2361C150.566 101.49 154.828 105.806 155.872 113.075C156.32 116.068 156.661 118.668 156.661 118.668L159.274 119.51Z" fill="#90CAF9"/>
<path opacity="0.2" d="M159.274 119.51C159.323 119.353 161.246 109.458 159.274 102.44C157.481 96.0043 155.142 93.6291 151.808 93.1047C148.473 92.5804 147.026 94.9825 148.796 98.2361C150.566 101.49 154.828 105.806 155.872 113.075C156.32 116.068 156.661 118.668 156.661 118.668L159.274 119.51Z" fill="black"/>
<path d="M158.148 113.828C158.118 113.826 158.09 113.818 158.063 113.805C158.037 113.793 158.013 113.775 157.993 113.752C157.974 113.73 157.959 113.705 157.949 113.677C157.939 113.649 157.935 113.619 157.937 113.59C158.385 105.577 155.768 98.4244 151.076 94.9153C151.028 94.8796 150.997 94.8265 150.989 94.7677C150.98 94.7089 150.995 94.6491 151.031 94.6016C151.068 94.555 151.12 94.5243 151.179 94.516C151.237 94.5076 151.297 94.5222 151.345 94.5568C156.154 98.142 158.851 105.456 158.381 113.617C158.377 113.676 158.351 113.73 158.307 113.77C158.264 113.809 158.207 113.83 158.148 113.828Z" fill="white"/>
<path d="M164.43 124.664C164.175 122.822 165.233 120.061 167.747 119.407C170.261 118.753 171.381 117.31 170.476 115.732C169.571 114.155 169.781 112.707 172.063 112.053C174.344 111.399 176.342 110.26 175.029 107.849C174.075 106.106 173.864 104.977 176.204 101.544C178.144 98.6933 176.558 97.0217 174.129 97.3354C171.7 97.6491 170.198 100.544 168.679 101.028C167.16 101.512 166.81 98.9309 164.807 100.087C162.804 101.243 162.925 104.206 162.862 106.272C162.799 108.338 162.665 108.804 160.854 108.553C159.044 108.302 157.269 108.598 157.309 112.976C157.341 116.732 159.344 121.384 159.344 121.384L164.43 124.664Z" fill="#90CAF9"/>
<path d="M161.253 121.863H161.23C161.17 121.856 161.116 121.826 161.078 121.779C161.04 121.732 161.022 121.672 161.029 121.612C162.292 110.323 171.982 100.8 174.509 98.8679C174.557 98.8317 174.617 98.8158 174.676 98.8238C174.735 98.8318 174.789 98.863 174.825 98.9105C174.861 98.9581 174.877 99.0181 174.869 99.0773C174.861 99.1366 174.83 99.1902 174.783 99.2265C172.286 101.131 162.723 110.529 161.477 121.661C161.47 121.716 161.444 121.767 161.403 121.804C161.361 121.841 161.308 121.862 161.253 121.863Z" fill="white"/>
<path d="M165.672 109.795C165.627 109.794 165.583 109.781 165.545 109.755C165.508 109.729 165.478 109.693 165.462 109.651C165.442 109.595 165.446 109.533 165.471 109.479C165.496 109.425 165.541 109.382 165.596 109.36C169.208 108.015 173.304 108.652 173.479 108.679C173.537 108.689 173.589 108.721 173.623 108.769C173.658 108.817 173.672 108.876 173.663 108.934C173.652 108.992 173.619 109.044 173.572 109.078C173.525 109.113 173.466 109.129 173.407 109.122C173.367 109.122 169.253 108.477 165.753 109.781C165.727 109.79 165.7 109.794 165.672 109.795Z" fill="white"/>
<path d="M162.454 116.579C162.422 116.579 162.391 116.572 162.363 116.559C162.334 116.546 162.309 116.527 162.288 116.503C160.786 114.754 159.768 112.642 159.335 110.377C159.33 110.348 159.331 110.318 159.339 110.289C159.346 110.261 159.358 110.234 159.376 110.21C159.393 110.186 159.415 110.166 159.44 110.151C159.466 110.136 159.494 110.126 159.523 110.121C159.552 110.117 159.582 110.118 159.61 110.125C159.639 110.132 159.666 110.145 159.69 110.162C159.713 110.18 159.733 110.202 159.749 110.227C159.764 110.252 159.774 110.28 159.778 110.309C160.207 112.485 161.187 114.514 162.624 116.203C162.652 116.236 162.67 116.276 162.676 116.319C162.682 116.362 162.676 116.405 162.658 116.445C162.64 116.484 162.612 116.518 162.575 116.542C162.539 116.565 162.497 116.578 162.454 116.579Z" fill="white"/>
<path d="M47.6016 56.3469V125.713L118.599 84.7242L118.594 21.6641L65.8057 52.1432L63.9817 46.8863L47.6016 56.3469Z" fill="#90CAF9"/>
<path opacity="0.7" d="M47.6016 56.3469V125.713L118.599 84.7242L118.594 21.6641L65.8057 52.1432L63.9817 46.8863L47.6016 56.3469Z" fill="black"/>
<path d="M47.6016 125.713L51.2406 62.6525L122.238 21.6641L118.599 84.7242L47.6016 125.713Z" fill="#E0E0E0"/>
<path d="M47.6016 125.712L53.0601 63.7053L124.057 22.7124L118.599 84.7239L47.6016 125.712Z" fill="#90CAF9"/>
<path opacity="0.7" d="M47.6016 125.712L53.0601 63.7053L124.057 22.7124L118.599 84.7239L47.6016 125.712Z" fill="black"/>
<path d="M58.5215 62.6526V132.023L129.519 91.0299V27.9697L76.7256 58.4489L74.9061 53.192L58.5215 62.6526Z" fill="#90CAF9"/>
<path opacity="0.5" d="M58.5215 62.6526V132.023L129.519 91.0299V27.9697L76.7256 58.4489L74.9061 53.192L58.5215 62.6526Z" fill="black"/>
<path d="M58.5215 132.023L62.1605 68.9582L133.158 27.9697L129.519 91.0299L58.5215 132.023Z" fill="#E0E0E0"/>
<path d="M58.5215 132.022L63.98 70.011L134.977 29.0181L129.518 91.0295L58.5215 132.022Z" fill="#90CAF9"/>
<path opacity="0.5" d="M58.5215 132.022L63.98 70.011L134.977 29.0181L129.518 91.0295L58.5215 132.022Z" fill="black"/>
<path d="M118.577 154.095C105.831 146.736 94.0091 138.736 88.6133 129.352L105.016 119.882L118.577 154.095Z" fill="#E0E0E0"/>
<path d="M71.2617 70.011V139.377L142.259 98.3883V35.3281L89.4659 65.8073L87.6463 60.5504L71.2617 70.011Z" fill="#90CAF9"/>
<path opacity="0.2" d="M71.2617 70.011V139.377L142.259 98.3883V35.3281L89.4659 65.8073L87.6463 60.5504L71.2617 70.011Z" fill="black"/>
<path d="M91.714 90.519C91.5347 90.519 91.5078 90.3129 91.5078 90.1918V31.0351C91.5222 30.8057 91.5896 30.5826 91.7047 30.3836C91.8197 30.1845 91.9794 30.0148 92.1711 29.8879L143.413 0.3095C143.483 0.26573 143.564 0.241013 143.646 0.237793C143.826 0.237793 143.853 0.443947 143.853 0.564949V59.7217C143.838 59.9518 143.771 60.1756 143.656 60.3755C143.541 60.5753 143.381 60.7457 143.189 60.8734L91.947 90.4518C91.8762 90.4934 91.7961 90.5165 91.714 90.519Z" fill="white"/>
<path d="M143.618 0.443746C143.622 0.476511 143.622 0.509576 143.618 0.542341V59.6991C143.604 59.8899 143.547 60.075 143.451 60.2409C143.356 60.4068 143.225 60.5493 143.067 60.6581L91.8249 90.2365L91.7353 90.2768C91.7293 90.2442 91.7293 90.2108 91.7353 90.1782V31.0215C91.7507 30.8315 91.8081 30.6473 91.9034 30.4822C91.9988 30.3171 92.1296 30.1752 92.2865 30.0669L143.529 0.488561C143.557 0.468792 143.589 0.455063 143.623 0.448228M143.65 7.1595e-05C143.528 0.00370488 143.409 0.0392442 143.305 0.103149L92.0624 29.6815C91.8372 29.8295 91.6497 30.0282 91.5151 30.2616C91.3804 30.4951 91.3024 30.7569 91.2871 31.026V90.1827C91.2871 90.5322 91.4619 90.7339 91.7353 90.7339C91.8574 90.7307 91.9765 90.6951 92.0803 90.6308L143.323 61.0525C143.549 60.9056 143.737 60.7071 143.872 60.4734C144.007 60.2397 144.084 59.9774 144.098 59.708V0.551306C144.098 0.201744 143.923 -0.00440997 143.65 7.1595e-05Z" fill="#90CAF9"/>
<path opacity="0.7" d="M143.618 0.443746C143.622 0.476511 143.622 0.509576 143.618 0.542341V59.6991C143.604 59.8899 143.547 60.075 143.451 60.2409C143.356 60.4068 143.225 60.5493 143.067 60.6581L91.8249 90.2365L91.7353 90.2768C91.7293 90.2442 91.7293 90.2108 91.7353 90.1782V31.0215C91.7507 30.8315 91.8081 30.6473 91.9034 30.4822C91.9988 30.3171 92.1296 30.1752 92.2865 30.0669L143.529 0.488561C143.557 0.468792 143.589 0.455063 143.623 0.448228M143.65 7.1595e-05C143.528 0.00370488 143.409 0.0392442 143.305 0.103149L92.0624 29.6815C91.8372 29.8295 91.6497 30.0282 91.5151 30.2616C91.3804 30.4951 91.3024 30.7569 91.2871 31.026V90.1827C91.2871 90.5322 91.4619 90.7339 91.7353 90.7339C91.8574 90.7307 91.9765 90.6951 92.0803 90.6308L143.323 61.0525C143.549 60.9056 143.737 60.7071 143.872 60.4734C144.007 60.2397 144.084 59.9774 144.098 59.708V0.551306C144.098 0.201744 143.923 -0.00440997 143.65 7.1595e-05Z" fill="white"/>
<path d="M96.7461 33.2803L114.95 22.771V43.7896L96.7461 54.2988V33.2803Z" fill="#90CAF9"/>
<path opacity="0.8" d="M96.7461 33.2803L114.95 22.771V43.7896L96.7461 54.2988V33.2803Z" fill="white"/>
<path d="M112.223 28.0103V34.3293L111.649 34.6475V32.7159C111.649 31.6493 110.784 31.2863 109.709 31.9047L101.996 36.3639C100.925 36.9824 100.055 38.3492 100.055 39.4158V41.3474L99.4863 41.688V35.3824L112.223 28.0103Z" fill="white"/>
<path d="M108.718 44.099C107.786 44.6368 107.028 44.0721 107.028 42.8307V32.7158L104.684 33.9886V44.1842C104.684 45.4211 103.927 46.8731 102.995 47.3974L101.301 48.3744V49.0467L110.403 43.7898V43.122L108.718 44.099Z" fill="white"/>
<path d="M118.578 21.7356C118.578 22.3182 119.102 22.484 119.743 22.1166L137.454 11.8762C137.769 11.6981 138.037 11.4496 138.24 11.1502C138.442 10.8509 138.572 10.5088 138.62 10.1508C138.62 9.57265 138.095 9.40235 137.454 9.77432L119.757 19.9923C119.437 20.1701 119.164 20.4205 118.959 20.7233C118.755 21.0262 118.624 21.373 118.578 21.7356Z" fill="#455A64"/>
<path d="M118.578 28.0096C118.578 28.5922 119.102 28.7625 119.743 28.3905L137.441 18.1726C137.755 17.9944 138.024 17.746 138.226 17.4466C138.428 17.1473 138.558 16.8052 138.606 16.4472C138.606 15.869 138.082 15.6987 137.441 16.0707L119.743 26.2887C119.43 26.4664 119.161 26.7141 118.959 27.0126C118.757 27.3112 118.627 27.6524 118.578 28.0096Z" fill="#455A64"/>
<path d="M118.578 34.3287C118.578 34.9113 119.102 35.0816 119.743 34.7097L137.441 24.4917C137.755 24.314 138.023 24.0662 138.225 23.7677C138.427 23.4692 138.558 23.128 138.606 22.7708C138.606 22.1882 138.082 22.0179 137.441 22.3898L119.743 32.6078C119.43 32.7855 119.161 33.0333 118.959 33.3318C118.757 33.6303 118.627 33.9715 118.578 34.3287Z" fill="#455A64"/>
<path d="M118.578 40.6339C118.578 41.2165 119.102 41.3868 119.743 41.0148L137.441 30.7969C137.755 30.6192 138.023 30.3714 138.225 30.0729C138.427 29.7744 138.558 29.4332 138.606 29.0759C138.606 28.4933 138.082 28.323 137.441 28.695L119.743 38.913C119.43 39.0907 119.161 39.3384 118.959 39.6369C118.757 39.9355 118.627 40.2767 118.578 40.6339Z" fill="#455A64"/>
<path d="M96.7461 59.5556C96.7461 60.1382 97.266 60.3085 97.9113 59.9365L137.452 37.0805C137.766 36.9034 138.035 36.6558 138.237 36.3571C138.439 36.0585 138.57 35.717 138.617 35.3596C138.617 34.777 138.093 34.6112 137.452 34.9787L97.9113 57.8347C97.5969 58.0115 97.328 58.2591 97.1258 58.5577C96.9236 58.8564 96.7936 59.198 96.7461 59.5556Z" fill="#455A64"/>
<path d="M96.7461 65.861C96.7461 66.4436 97.266 66.6139 97.9113 66.2419L137.452 43.4128C137.766 43.2347 138.035 42.9862 138.237 42.6869C138.439 42.3875 138.57 42.0454 138.617 41.6874C138.617 41.1093 138.093 40.939 137.452 41.3109L97.9113 64.14C97.5969 64.3169 97.328 64.5645 97.1258 64.8631C96.9236 65.1618 96.7936 65.5034 96.7461 65.861Z" fill="#455A64"/>
<path d="M96.7461 72.1716C96.7461 72.7497 97.266 72.92 97.9113 72.5481L137.452 49.7189C137.766 49.5408 138.035 49.2924 138.237 48.993C138.439 48.6937 138.57 48.3516 138.617 47.9935C138.617 47.4154 138.093 47.2451 137.452 47.6171L97.9113 70.4462C97.5964 70.6235 97.3271 70.8718 97.1249 71.1713C96.9226 71.4707 96.7929 71.8133 96.7461 72.1716Z" fill="#455A64"/>
<path d="M71.2617 139.377L84.0028 83.6755L155 42.6826L142.259 98.3885L71.2617 139.377Z" fill="#90CAF9"/>
<path d="M88.6309 88.0362V129.352L105.015 119.891V78.5801L88.6309 88.0362Z" fill="#90CAF9"/>
<path opacity="0.2" d="M88.6309 88.0362V129.352L105.015 119.891V78.5801L88.6309 88.0362Z" fill="black"/>
<path d="M118.611 153.825C117.217 152.785 103.781 142.518 96.9516 127.832C89.6824 112.218 89.6914 94.0051 89.6914 87.1528V86.9377L138.397 58.8203C138.397 65.7354 138.397 83.9754 145.698 99.6429C152.371 113.984 165.291 124.121 167.339 125.672L118.611 153.825Z" fill="white"/>
<path d="M138.171 59.2237C138.171 66.4301 138.31 84.3205 145.494 99.755C151.943 113.603 164.204 123.561 166.934 125.663L118.622 153.556C116.736 152.136 103.806 142.039 97.1557 127.756C89.8956 112.187 89.8956 94.0097 89.8956 87.1663V87.0812L138.153 59.2192M138.601 58.4439L89.4474 86.8257C89.4474 93.2747 89.313 112.012 96.73 127.944C104.03 143.58 118.578 154.094 118.578 154.094L167.745 125.708C167.745 125.708 153.18 115.194 145.902 99.5578C138.48 83.6259 138.619 64.8884 138.619 58.4395L138.601 58.4439Z" fill="#90CAF9"/>
<path opacity="0.7" d="M138.171 59.2237C138.171 66.4301 138.31 84.3205 145.494 99.755C151.943 113.603 164.204 123.561 166.934 125.663L118.622 153.556C116.736 152.136 103.806 142.039 97.1557 127.756C89.8956 112.187 89.8956 94.0097 89.8956 87.1663V87.0812L138.153 59.2192M138.601 58.4439L89.4474 86.8257C89.4474 93.2747 89.313 112.012 96.73 127.944C104.03 143.58 118.578 154.094 118.578 154.094L167.745 125.708C167.745 125.708 153.18 115.194 145.902 99.5578C138.48 83.6259 138.619 64.8884 138.619 58.4395L138.601 58.4439Z" fill="white"/>
<path d="M133.058 67.9629L117.516 76.926C117.205 77.0972 116.94 77.3411 116.743 77.6368C116.547 77.9325 116.424 78.2714 116.387 78.6245C116.409 79.1937 116.951 79.355 117.592 78.983L133.139 70.0199C133.446 69.8503 133.709 69.6097 133.904 69.3181C134.1 69.0266 134.223 68.6926 134.264 68.3438C134.237 67.7522 133.704 67.5909 133.058 67.9629Z" fill="#455A64"/>
<path d="M133.388 74.08L117.846 83.0431C117.539 83.2085 117.278 83.4488 117.089 83.7419C116.899 84.0349 116.787 84.3711 116.762 84.7193C116.811 85.2705 117.376 85.4184 118.017 85.0464L133.563 76.0833C133.869 75.9186 134.128 75.6788 134.315 75.3863C134.503 75.0938 134.612 74.7583 134.634 74.4116C134.589 73.8559 134.034 73.7215 133.388 74.08Z" fill="#455A64"/>
<path d="M134.011 80.0275L118.465 88.9906C117.824 89.3626 117.358 90.1021 117.434 90.6354C117.51 91.1687 118.097 91.3076 118.743 90.9356L134.289 81.9725C134.93 81.6005 135.387 80.8655 135.306 80.3322C135.226 79.7989 134.652 79.6555 134.011 80.0275Z" fill="#455A64"/>
<path d="M134.946 85.7954L119.399 94.7586C118.758 95.1305 118.315 95.8566 118.422 96.3764C118.53 96.8963 119.139 97.0128 119.767 96.6408L135.309 87.6777C135.954 87.3057 136.384 86.5842 136.277 86.0643C136.169 85.5445 135.609 85.4235 134.946 85.7954Z" fill="#455A64"/>
<path d="M136.208 91.3701L120.662 100.333C120.021 100.705 119.604 101.413 119.765 101.911C119.927 102.408 120.541 102.52 121.181 102.148L136.728 93.1851C137.373 92.8131 137.777 92.1095 137.624 91.6076C137.472 91.1057 136.849 90.9981 136.208 91.3701Z" fill="#455A64"/>
<path d="M137.847 96.7438L99.9603 118.618C99.3194 118.99 98.9295 119.68 99.1043 120.16C99.2791 120.64 99.9468 120.729 100.588 120.357L138.475 98.4826C139.12 98.1107 139.492 97.425 139.317 96.941C139.143 96.457 138.466 96.3718 137.847 96.7438Z" fill="#455A64"/>
<path d="M139.843 101.876L101.961 123.75C101.315 124.122 100.961 124.794 101.176 125.252C101.391 125.709 102.073 125.78 102.727 125.408L140.614 103.534C141.259 103.162 141.604 102.49 141.389 102.033C141.174 101.575 140.489 101.508 139.843 101.876Z" fill="#455A64"/>
<path d="M142.332 106.765L104.445 128.639C103.799 129.011 103.481 129.666 103.737 130.1C103.992 130.535 104.723 130.58 105.368 130.208L143.228 108.333C143.869 107.966 144.178 107.316 143.923 106.881C143.667 106.447 142.959 106.393 142.332 106.765Z" fill="#455A64"/>
<path d="M145.229 111.389L107.347 133.259C106.701 133.631 106.414 134.272 106.706 134.68C106.997 135.088 107.763 135.128 108.409 134.752L146.291 112.877C146.937 112.505 147.215 111.873 146.923 111.461C146.632 111.049 145.875 111.017 145.229 111.389Z" fill="#455A64"/>
<path d="M148.538 115.786L110.651 137.656C110.01 138.028 109.754 138.651 110.077 139.041C110.4 139.431 111.193 139.449 111.838 139.077L149.726 117.193C150.366 116.821 150.622 116.207 150.29 115.818C149.959 115.428 149.183 115.401 148.538 115.786Z" fill="#455A64"/>
<path d="M152.189 119.972L114.315 141.842C113.67 142.214 113.419 142.823 113.795 143.186C114.172 143.549 114.97 143.558 115.61 143.186L153.498 121.312C154.143 120.94 154.367 120.339 154.009 119.967C153.65 119.595 152.843 119.604 152.189 119.972Z" fill="#455A64"/>
<path d="M156.221 123.974L118.334 145.844C117.693 146.216 117.482 146.812 117.885 147.166C118.289 147.52 119.113 147.506 119.759 147.134L157.615 125.26C158.255 124.888 158.457 124.305 158.063 123.947C157.668 123.588 156.848 123.602 156.221 123.974Z" fill="#455A64"/>
<path d="M111.884 80.1934L94.0117 90.501C94.2089 96.9768 94.9484 106.316 97.6552 115.723L115.532 105.416C112.821 96.0088 112.081 86.6647 111.884 80.1934Z" fill="#90CAF9"/>
<path opacity="0.8" d="M111.884 80.1934L94.0117 90.501C94.2089 96.9768 94.9484 106.316 97.6552 115.723L115.532 105.416C112.821 96.0088 112.081 86.6647 111.884 80.1934Z" fill="white"/>
<path d="M101.299 89.0758C101.323 88.6578 101.258 88.2394 101.108 87.8484C100.958 87.4575 100.727 87.1029 100.429 86.8081L94.0117 90.5099C94.0655 92.2218 94.1551 94.1355 94.312 96.197C95.1468 96.293 95.9912 96.1369 96.7365 95.7488C99.2596 94.5926 101.299 91.5944 101.299 89.0758Z" fill="#90CAF9"/>
<path opacity="0.6" d="M101.299 89.0758C101.323 88.6578 101.258 88.2394 101.108 87.8484C100.958 87.4575 100.727 87.1029 100.429 86.8081L94.0117 90.5099C94.0655 92.2218 94.1551 94.1355 94.312 96.197C95.1468 96.293 95.9912 96.1369 96.7365 95.7488C99.2596 94.5926 101.299 91.5944 101.299 89.0758Z" fill="white"/>
<path d="M114.01 99.2314C112.818 97.7301 110.393 93.0917 109.358 91.0705C109.317 90.9906 109.253 90.9247 109.175 90.8814C109.096 90.8381 109.007 90.8194 108.917 90.8276C108.828 90.8358 108.743 90.8706 108.674 90.9274C108.605 90.9843 108.554 91.0607 108.529 91.1467C107.409 94.975 106.759 98.9254 106.593 102.911C105.1 101.726 103.817 100.299 102.797 98.6891C102.753 98.6268 102.693 98.5781 102.623 98.549C102.552 98.5198 102.475 98.5113 102.4 98.5245C102.326 98.5377 102.256 98.572 102.2 98.6234C102.144 98.6748 102.104 98.7412 102.084 98.8146C100.13 106.339 101.112 113.743 101.112 113.743L115.529 105.416C114.928 103.337 114.431 101.266 114.01 99.2314Z" fill="#90CAF9"/>
<path opacity="0.6" d="M114.01 99.2314C112.818 97.7301 110.393 93.0917 109.358 91.0705C109.317 90.9906 109.253 90.9247 109.175 90.8814C109.096 90.8381 109.007 90.8194 108.917 90.8276C108.828 90.8358 108.743 90.8706 108.674 90.9274C108.605 90.9843 108.554 91.0607 108.529 91.1467C107.409 94.975 106.759 98.9254 106.593 102.911C105.1 101.726 103.817 100.299 102.797 98.6891C102.753 98.6268 102.693 98.5781 102.623 98.549C102.552 98.5198 102.475 98.5113 102.4 98.5245C102.326 98.5377 102.256 98.572 102.2 98.6234C102.144 98.6748 102.104 98.7412 102.084 98.8146C100.13 106.339 101.112 113.743 101.112 113.743L115.529 105.416C114.928 103.337 114.431 101.266 114.01 99.2314Z" fill="white"/>
</svg>
