<svg width="607" height="404" viewBox="0 0 607 404" fill="none" xmlns="http://www.w3.org/2000/svg">
<path d="M582.945 101.751C582.945 101.751 576.179 97.6306 568.701 113.694C561.223 129.757 558.495 138.976 558.495 138.976C558.495 138.976 556.48 142.353 554.133 140.277C551.786 138.2 548.468 132.197 544.615 133.425C540.649 134.71 539.492 139.226 540.496 145.763C541.499 152.3 543.158 166.698 543.312 167.999C543.466 169.3 542.786 171.231 540.957 170.036C539.128 168.84 528.445 157.827 523.492 163.2C518.538 168.573 524.301 186.325 524.932 188.248C525.563 190.171 525.167 191.052 524.244 191.577C523.322 192.102 520.084 188.046 516.96 185.024C513.836 182.002 509.587 179.061 506.997 182.398C504.408 185.735 504.019 199.229 517.64 220.624L524.6 230.126L536.392 229.044C561.482 225.198 571.404 216.035 572.213 211.89C573.023 207.745 568.037 206.517 563.683 206.129C559.329 205.741 554.133 205.959 553.923 204.925C553.712 203.891 554.117 203.058 555.986 202.226C557.856 201.394 575.038 194.057 575.839 186.793C576.641 179.53 561.271 178.786 559.191 178.172C557.111 177.558 558.115 175.797 559.191 175.061C560.268 174.326 572.23 166.092 577.806 162.545C583.382 158.998 585.956 155.176 584.337 151.346C582.719 147.654 576.025 149.108 572.909 148.704C569.794 148.3 571.024 144.567 571.024 144.567C571.024 144.567 576.179 136.487 583.366 120.271C590.553 104.054 582.791 101.687 582.791 101.687" fill="#F5F5F5"/>
<path d="M576.244 116.126C576.244 116.126 576.203 116.247 576.106 116.473C576.009 116.699 575.863 117.055 575.685 117.483L574.018 121.321C572.561 124.658 570.425 129.474 567.762 135.413C562.437 147.29 554.942 163.628 546.606 181.646C538.27 199.665 530.711 216.003 525.321 227.856L518.951 241.891L517.219 245.705C517.017 246.125 516.863 246.456 516.758 246.69C516.707 246.804 516.65 246.914 516.588 247.022C516.624 246.903 516.667 246.787 516.717 246.674C516.823 246.432 516.96 246.101 517.138 245.672C517.527 244.776 518.093 243.483 518.806 241.826C520.262 238.489 522.399 233.682 525.062 227.743C530.387 215.865 537.881 199.528 546.218 181.501C554.554 163.475 562.089 147.153 567.479 135.308C570.166 129.401 572.335 124.61 573.848 121.281L575.588 117.467C575.783 117.039 575.936 116.716 576.05 116.473C576.163 116.231 576.244 116.126 576.244 116.126Z" fill="#E0E0E0"/>
<path d="M548.945 142.022C549.091 142.276 549.202 142.548 549.277 142.83C549.471 143.339 549.722 144.091 550.03 145.02C550.629 146.886 551.398 149.472 552.191 152.348L554.19 159.717C554.433 160.598 554.635 161.333 554.805 161.947C554.903 162.207 554.966 162.479 554.991 162.755C554.846 162.502 554.734 162.23 554.659 161.947C554.465 161.438 554.214 160.687 553.915 159.75C553.332 157.883 552.595 155.281 551.802 152.405L549.755 145.052L549.131 142.83C549.039 142.569 548.976 142.298 548.945 142.022Z" fill="#E0E0E0"/>
<path d="M556.084 162.925C556.084 162.82 561.328 161.002 567.876 158.885C574.423 156.768 579.765 155.096 579.797 155.201C579.83 155.306 574.553 157.124 568.005 159.241C561.458 161.358 556.116 163.03 556.084 162.925Z" fill="#E0E0E0"/>
<path d="M542.025 190.025C542.313 189.971 542.606 189.947 542.899 189.953L545.263 189.872C547.254 189.799 550.014 189.694 553.049 189.46C556.084 189.226 558.827 188.951 560.818 188.725L563.165 188.458C563.453 188.404 563.747 188.388 564.039 188.409C563.777 188.504 563.506 188.572 563.23 188.611C562.68 188.716 561.878 188.854 560.891 188.999C558.916 189.298 556.164 189.638 553.121 189.864C550.078 190.09 547.31 190.155 545.303 190.147C544.308 190.147 543.498 190.147 542.94 190.106C542.633 190.121 542.325 190.094 542.025 190.025Z" fill="#E0E0E0"/>
<path d="M531.408 172.54C531.596 172.732 531.759 172.947 531.894 173.179C532.185 173.599 532.606 174.221 533.108 174.997C534.119 176.54 535.487 178.689 536.976 181.073C538.466 183.456 539.801 185.63 540.748 187.214C541.225 188.022 541.598 188.652 541.849 189.104C542.002 189.327 542.124 189.569 542.213 189.823C542.018 189.636 541.852 189.421 541.719 189.185C541.428 188.757 541.015 188.143 540.505 187.367C539.502 185.824 538.134 183.675 536.637 181.283C535.139 178.891 533.812 176.726 532.865 175.142C532.396 174.334 532.056 173.704 531.764 173.259C531.617 173.035 531.498 172.793 531.408 172.54Z" fill="#E0E0E0"/>
<path d="M515.949 194.89C516.185 195.136 516.394 195.407 516.572 195.698L518.134 198.025C519.429 199.996 521.21 202.735 523.152 205.773C525.095 208.811 526.835 211.583 528.073 213.595L529.53 216.019C529.718 216.306 529.881 216.608 530.015 216.924C529.78 216.677 529.571 216.406 529.392 216.116L527.838 213.789C526.535 211.809 524.755 209.07 522.812 206.032C520.87 202.994 519.138 200.222 517.892 198.21C517.309 197.257 516.823 196.449 516.443 195.786C516.247 195.506 516.082 195.205 515.949 194.89Z" fill="#E0E0E0"/>
<path d="M529.83 216.294C530.189 216.212 530.555 216.169 530.923 216.164L533.917 215.954C536.442 215.776 539.939 215.518 543.783 215.146C547.627 214.774 551.067 214.338 553.616 213.991L556.587 213.595C556.95 213.529 557.318 213.497 557.687 213.498C557.338 213.617 556.977 213.701 556.611 213.748C555.915 213.886 554.903 214.063 553.657 214.265C551.148 214.678 547.676 215.162 543.823 215.55C539.971 215.938 536.467 216.156 533.933 216.261C532.663 216.31 531.643 216.342 530.931 216.342C530.563 216.357 530.195 216.341 529.83 216.294Z" fill="#E0E0E0"/>
<path d="M100.996 181.339C119.878 168.759 124.466 144.979 124.086 123.495C124.013 119.907 124.475 116.142 122.791 112.991C121.108 109.84 117.126 107.609 113.832 109.072C111.121 110.284 109.89 113.362 108.345 115.9C106.26 119.289 103.262 122.025 99.6928 123.794C97.3619 124.941 94.4888 125.62 92.2227 124.343C89.1148 122.598 88.8073 118.324 88.8882 114.76L89.3252 94.8511C89.3981 91.2878 89.4709 87.6518 88.3945 84.2502C87.3181 80.8485 84.8901 77.6811 81.4666 76.6792C78.0431 75.6773 73.7618 77.568 72.9767 81.0424C72.653 82.4887 72.9282 83.9997 72.8067 85.4783C72.6853 86.957 71.9974 88.5811 70.5244 88.9689C69.0514 89.3567 67.6513 88.3306 66.583 87.2802C62.9086 83.6199 60.4482 78.9578 58.1578 74.3522C55.8674 69.7466 53.6336 64.9551 50.3154 60.9878C46.9971 57.0206 42.3515 53.837 37.1799 53.4654C32.0083 53.0937 26.4481 56.1722 25.0399 61.1575C23.6317 66.1429 26.5453 71.2979 29.7178 75.4106C34.442 81.5031 40.0218 86.8832 46.2849 91.3848C47.418 92.1928 48.632 93.0735 49.0528 94.3987C49.7974 96.8227 47.4827 99.1093 45.0871 99.8607C42.3758 100.669 39.4217 100.386 36.6376 100.669C33.8535 100.952 30.7376 102.131 29.6288 104.709C28.0992 108.329 31.1261 112.191 34.1287 114.736C40.1441 119.834 46.9867 123.87 54.362 126.67C57.0086 127.672 59.7927 128.553 61.905 130.427C64.0174 132.302 65.2719 135.518 63.9365 138.006C62.6011 140.495 59.2585 141.238 56.4825 140.705C53.7065 140.172 51.238 138.629 48.5996 137.602C43.6546 135.679 37.2689 135.922 33.9911 140.107C31.8545 142.854 31.6117 146.725 32.6153 150.054C33.6188 153.383 35.7231 156.267 37.9569 158.942C45.775 168.266 55.8593 175.829 67.3195 179.95C78.7796 184.07 89.4385 185.283 100.955 181.323" fill="#EBEBEB"/>
<path d="M99.547 181.752C96.512 170.884 88.2164 145.311 83.239 133.272L79.5403 124.384C78.3182 121.467 77.1123 118.582 75.7445 115.827C73.1164 110.553 70.1983 105.428 67.0038 100.475C63.9768 95.7076 60.9338 91.2959 58.1011 87.1832C55.2684 83.0705 52.4358 79.3133 49.7811 75.9762C45.5949 70.6885 40.9942 65.7414 36.0225 61.1818C34.2662 59.5658 32.8661 58.3538 31.903 57.5458L30.7537 56.56C30.5028 56.358 30.3652 56.261 30.3652 56.261C30.3652 56.261 30.4785 56.3822 30.7132 56.6004L31.7816 57.5538C32.7123 58.3618 34.0963 59.6223 35.8282 61.2626C40.7253 65.876 45.2702 70.8482 49.425 76.1378C52.0635 79.483 54.799 83.2644 57.6721 87.369C60.5453 91.4737 63.556 95.9015 66.5748 100.661C69.7493 105.615 72.6484 110.74 75.259 116.013C76.6105 118.76 77.8164 121.669 79.0385 124.553C80.2606 127.438 81.4665 130.444 82.7372 133.441C87.6822 145.464 96.0022 171.013 99.0614 181.848" fill="#E0E0E0"/>
<path d="M75.5742 115.77C75.7417 115.277 75.861 114.768 75.9303 114.251C76.1246 113.265 76.3674 111.827 76.6425 110.066C77.201 106.527 77.808 101.614 78.4635 96.1924C79.1191 90.7707 79.807 85.8823 80.4383 82.3594C80.7459 80.598 81.0129 79.1759 81.2476 78.1982C81.3742 77.6944 81.4581 77.1809 81.4985 76.663C81.3004 77.1431 81.1487 77.6409 81.0453 78.1498C80.7782 79.1194 80.4545 80.5738 80.0984 82.2948C79.3133 85.8015 78.5849 90.7061 77.9294 96.152C77.2738 101.598 76.7073 106.389 76.2702 110.042C76.0517 111.738 75.8656 113.152 75.7199 114.243C75.6282 114.747 75.5795 115.258 75.5742 115.77Z" fill="#E0E0E0"/>
<path d="M29.2324 106.519C29.387 106.568 29.5477 106.595 29.7099 106.599L31.0858 106.737C32.2836 106.858 34.0075 107.02 36.1279 107.286C40.3769 107.787 46.2284 108.7 52.6383 109.985C59.0483 111.27 64.7783 112.716 68.9059 113.871C70.9697 114.437 72.6289 114.938 73.7619 115.277L75.0892 115.665C75.2396 115.723 75.3978 115.759 75.5587 115.77C75.4239 115.682 75.2766 115.613 75.1216 115.568C74.7655 115.431 74.3123 115.269 73.8267 115.083C72.7017 114.679 71.0507 114.114 68.9707 113.467C64.8674 112.215 59.1211 110.72 52.7031 109.427C46.2851 108.135 40.466 107.319 36.1684 106.906C34.0399 106.688 32.2998 106.583 31.102 106.535H29.718C29.5575 106.509 29.3943 106.504 29.2324 106.519Z" fill="#E0E0E0"/>
<path d="M95.0312 166.957C95.1547 166.782 95.2604 166.595 95.3469 166.4L96.1562 164.784C96.8522 163.345 97.7749 161.244 98.9727 158.635C101.287 153.423 104.258 146.119 107.438 138.023C110.619 129.926 113.525 122.574 115.734 117.322L118.389 111.116C118.68 110.421 118.923 109.864 119.109 109.427C119.201 109.233 119.274 109.03 119.327 108.821C119.197 108.992 119.09 109.179 119.012 109.379L118.202 110.995C117.506 112.433 116.543 114.534 115.394 117.136C113.079 122.355 110.101 129.66 106.928 137.756C103.756 145.852 100.834 153.173 98.6085 158.425L95.9539 164.63L95.2417 166.319C95.1456 166.522 95.075 166.736 95.0312 166.957Z" fill="#E0E0E0"/>
<path d="M33.5781 146.426C33.7717 146.527 33.9751 146.608 34.1851 146.668L35.9738 147.274L42.5617 149.48C48.1218 151.338 55.77 153.997 64.2114 156.954C72.6527 159.911 80.3333 162.513 85.9258 164.283C88.718 165.163 90.9922 165.858 92.5623 166.311L94.3833 166.82C94.5934 166.891 94.8104 166.94 95.0308 166.965C94.8343 166.862 94.6283 166.778 94.4157 166.715L92.6271 166.109L86.0391 163.919C80.479 162.061 72.8308 159.402 64.3894 156.445C55.9481 153.488 48.2756 150.878 42.6831 149.116C39.8828 148.236 37.6167 147.541 36.0385 147.088L34.2256 146.571C34.0151 146.502 33.7982 146.453 33.5781 146.426Z" fill="#E0E0E0"/>
<path d="M411.755 56.859H513.788L493.83 71.0232V82.8523C493.785 88.6969 491.416 94.2845 487.246 98.3862C483.075 102.488 477.443 104.768 471.589 104.725H407.563C401.708 104.768 396.077 102.488 391.906 98.3862C387.735 94.2845 385.367 88.6969 385.322 82.8523C385.348 79.4127 386.052 76.0117 387.394 72.8437C388.736 69.6756 390.69 66.8027 393.145 64.3888C395.6 61.975 398.507 60.0676 401.7 58.7756C404.893 57.4836 408.31 56.8323 411.755 56.859Z" fill="#F5F5F5"/>
<path d="M476.616 72.6715C476.616 72.7846 459.62 72.8816 438.578 72.8816C417.535 72.8816 400.539 72.7846 400.539 72.6715C400.539 72.5584 417.535 72.4614 438.578 72.4614C459.62 72.4614 476.616 72.5503 476.616 72.6715Z" fill="#E0E0E0"/>
<path d="M476.616 80.5414C476.616 80.6546 459.62 80.7515 438.578 80.7515C417.535 80.7515 400.539 80.6546 400.539 80.5414C400.539 80.4283 417.535 80.3314 438.578 80.3314C459.62 80.3314 476.616 80.4202 476.616 80.5414Z" fill="#E0E0E0"/>
<path d="M256.955 299.299H136.219L155.886 313.504V341.38C155.886 342.145 156.037 342.902 156.33 343.608C156.623 344.315 157.053 344.956 157.595 345.497C158.137 346.037 158.78 346.465 159.488 346.757C160.196 347.049 160.955 347.199 161.721 347.198H256.955C257.721 347.199 258.48 347.049 259.188 346.757C259.895 346.465 260.539 346.037 261.081 345.497C261.623 344.956 262.053 344.315 262.346 343.608C262.639 342.902 262.79 342.145 262.79 341.38V305.117C262.788 303.573 262.173 302.094 261.078 301.003C259.984 299.912 258.501 299.299 256.955 299.299Z" fill="#F5F5F5"/>
<path d="M251.92 318.998C251.92 319.12 233.71 319.208 211.251 319.208C188.792 319.208 170.582 319.12 170.582 318.998C170.582 318.877 188.784 318.788 211.251 318.788C233.718 318.788 251.92 318.885 251.92 318.998Z" fill="#E0E0E0"/>
<path d="M251.92 329.704C251.92 329.818 233.71 329.914 211.251 329.914C188.792 329.914 170.582 329.818 170.582 329.704C170.582 329.591 188.784 329.494 211.251 329.494C233.718 329.494 251.92 329.591 251.92 329.704Z" fill="#E0E0E0"/>
<path d="M503.469 161.923H362.167C344.829 161.923 330.773 175.956 330.773 193.266V308.082C330.773 325.392 344.829 339.425 362.167 339.425H503.469C520.807 339.425 534.863 325.392 534.863 308.082V193.266C534.863 175.956 520.807 161.923 503.469 161.923Z" fill="#90CAF9"/>
<g opacity="0.4">
<path d="M503.469 161.923H362.167C344.829 161.923 330.773 175.956 330.773 193.266V308.082C330.773 325.392 344.829 339.425 362.167 339.425H503.469C520.807 339.425 534.863 325.392 534.863 308.082V193.266C534.863 175.956 520.807 161.923 503.469 161.923Z" fill="black"/>
</g>
<path d="M534.807 223.8H565.376L534.119 255.013L534.807 223.8Z" fill="#90CAF9"/>
<g opacity="0.4">
<path d="M534.807 223.8H565.376L534.119 255.013L534.807 223.8Z" fill="black"/>
</g>
<path d="M325.885 242.99L313.074 228.446C309.61 224.988 308.42 223.323 309.116 222.717C310.039 221.909 309.642 222.176 316.837 227.565C316.837 227.565 306.64 219.784 310.176 219.736C310.799 219.736 312.531 220.738 314.385 221.95C311.86 219.808 311.148 218.362 311.641 217.675C312.451 216.479 318.699 220.802 321.572 222.879C319.225 221.133 314.749 217.748 313.964 216.681C312.879 215.227 315.073 215.348 316.853 215.954C318.852 216.633 329.9 222.265 333.169 223.719C333.432 223.875 333.725 223.973 334.028 224.005C334.332 224.037 334.639 224.004 334.928 223.906C335.217 223.809 335.482 223.65 335.704 223.44C335.925 223.231 336.099 222.976 336.213 222.693C337.418 217.635 341.069 214.346 342.461 213.918C343.853 213.49 344.929 215.267 343.934 216.56C342.997 218.064 342.273 219.69 341.781 221.392C341.33 222.727 341.108 224.128 341.125 225.537C341.125 227.153 341.239 228.551 341.344 229.722L353.055 245.761L333.469 257.073L325.885 242.99Z" fill="#B78876"/>
<path d="M321.304 229.828C321.175 230.005 318.876 228.446 316.221 226.337C313.567 224.228 311.495 222.37 311.649 222.2C311.802 222.03 314.077 223.598 316.731 225.691C319.386 227.783 321.417 229.642 321.304 229.828Z" fill="#AA6550"/>
<path d="M323.782 227.274C323.652 227.46 321.135 225.925 318.157 223.856C315.179 221.788 312.864 219.954 312.993 219.776C313.123 219.598 315.64 221.117 318.618 223.186C321.597 225.254 323.911 227.088 323.782 227.274Z" fill="#AA6550"/>
<path d="M325.595 224.559C325.465 224.745 323.053 223.339 320.213 221.416C317.372 219.493 315.17 217.788 315.292 217.594C315.413 217.4 317.825 218.814 320.674 220.738C323.523 222.661 325.716 224.374 325.595 224.559Z" fill="#AA6550"/>
<path d="M342.436 231.896L389.118 290.993L378.427 315.839C378.427 315.839 365.623 313.011 361.738 307.63C357.853 302.249 325.885 242.99 325.885 242.99L342.436 231.896Z" fill="#B78876"/>
<path d="M460.938 149.221C464.297 152.13 464.289 157.253 463.9 161.673C463.512 166.092 463.212 171.126 466.28 174.342C468.813 176.992 473.402 178.148 473.985 181.76C474.123 182.608 473.994 183.479 473.616 184.251C473.239 185.024 472.631 185.661 471.876 186.075C471.121 186.488 470.256 186.658 469.4 186.561C468.545 186.464 467.74 186.105 467.097 185.533C468.085 188.385 467.405 191.948 464.928 193.678C462.452 195.407 458.3 194.34 457.531 191.423C457.657 191.91 457.681 192.418 457.601 192.915C457.522 193.411 457.341 193.886 457.069 194.31C456.798 194.733 456.442 195.097 456.024 195.377C455.605 195.657 455.134 195.848 454.638 195.938C454.143 196.029 453.634 196.016 453.143 195.901C452.653 195.786 452.191 195.571 451.788 195.271C451.384 194.97 451.047 194.589 450.797 194.152C450.547 193.716 450.39 193.232 450.336 192.732" fill="#263238"/>
<path d="M412.84 179.053C412.389 180.135 411.525 180.994 410.439 181.44C409.353 181.886 408.134 181.883 407.05 181.432C405.966 180.981 405.106 180.119 404.659 179.035C404.212 177.95 404.214 176.733 404.666 175.651C405.435 173.97 407.256 172.758 407.434 170.916C407.645 168.694 405.37 167.102 403.387 166.133C401.405 165.163 399.009 163.903 398.79 161.673C398.572 159.443 400.506 157.851 402.117 156.413C403.727 154.974 405.354 152.744 404.326 150.829C403.816 149.844 402.756 149.286 402.068 148.405C400.555 146.482 401.348 143.42 403.282 141.941C405.217 140.463 407.887 140.228 410.299 140.657C412.711 141.085 414.977 142.087 417.324 142.79C421.215 143.919 425.298 144.231 429.315 143.705C433.333 143.18 437.198 141.828 440.665 139.736" fill="#263238"/>
<path d="M427.173 231.161C431.354 232.003 435.7 231.171 439.272 228.843C442.843 226.515 445.355 222.878 446.265 218.718L457.75 166.149C458.467 163.114 458.566 159.965 458.043 156.891C457.52 153.816 456.385 150.877 454.705 148.248C453.024 145.619 450.833 143.353 448.26 141.584C445.687 139.815 442.785 138.58 439.726 137.95L438.528 137.772C432.677 136.913 426.717 138.287 421.835 141.618C416.953 144.95 413.507 149.996 412.184 155.75C409.627 166.844 406.948 179.134 406.139 185.169C404.463 197.669 416.66 201.434 416.66 201.434L414.467 211.938C414.032 214.031 414.015 216.189 414.418 218.288C414.821 220.388 415.636 222.387 416.815 224.171C417.994 225.954 419.515 227.488 421.29 228.684C423.065 229.879 425.058 230.713 427.157 231.136L427.173 231.161Z" fill="#B78876"/>
<path d="M414.435 164.024C414.364 164.488 414.476 164.961 414.748 165.344C415.02 165.727 415.43 165.99 415.892 166.076C416.116 166.127 416.347 166.133 416.574 166.093C416.8 166.054 417.016 165.969 417.209 165.845C417.402 165.721 417.568 165.559 417.697 165.37C417.827 165.181 417.918 164.968 417.964 164.743C418.039 164.28 417.93 163.805 417.659 163.422C417.388 163.038 416.977 162.776 416.515 162.691C416.291 162.64 416.058 162.634 415.832 162.674C415.605 162.713 415.388 162.798 415.195 162.922C415.001 163.046 414.834 163.207 414.704 163.397C414.573 163.586 414.482 163.799 414.435 164.024Z" fill="#263238"/>
<path d="M413.974 162.246C414.16 162.513 415.657 161.705 417.584 161.996C419.51 162.287 420.764 163.442 421.007 163.24C421.129 163.151 420.959 162.699 420.416 162.166C419.67 161.469 418.725 161.02 417.713 160.881C416.715 160.73 415.695 160.9 414.8 161.366C414.144 161.737 413.885 162.125 413.974 162.246Z" fill="#263238"/>
<path d="M433.204 167.094C433.13 167.559 433.242 168.033 433.514 168.416C433.786 168.8 434.197 169.062 434.66 169.147C434.885 169.198 435.117 169.203 435.344 169.163C435.57 169.123 435.787 169.037 435.98 168.912C436.173 168.787 436.339 168.625 436.468 168.435C436.597 168.245 436.687 168.031 436.732 167.805C436.805 167.342 436.694 166.869 436.421 166.487C436.149 166.105 435.738 165.844 435.275 165.761C435.052 165.709 434.819 165.703 434.593 165.742C434.366 165.781 434.15 165.865 433.957 165.99C433.763 166.114 433.597 166.276 433.468 166.466C433.338 166.655 433.249 166.869 433.204 167.094Z" fill="#263238"/>
<path d="M432.798 165.365C432.984 165.624 434.481 164.824 436.399 165.115C438.317 165.406 439.588 166.561 439.831 166.359C439.944 166.27 439.782 165.818 439.232 165.284C438.485 164.588 437.541 164.139 436.529 164C435.531 163.849 434.51 164.019 433.615 164.485C432.992 164.832 432.7 165.244 432.798 165.365Z" fill="#263238"/>
<path d="M423.742 178.568C423.742 178.455 422.6 178.075 420.707 177.55C420.221 177.429 419.776 177.259 419.744 176.912C419.777 176.403 419.963 175.916 420.278 175.514C420.92 174.399 421.586 173.227 422.277 171.999C425.069 166.981 427.133 162.836 426.963 162.723C426.793 162.61 424.332 166.585 421.54 171.611L419.598 175.15C419.206 175.699 419.017 176.368 419.064 177.041C419.113 177.219 419.202 177.385 419.324 177.524C419.446 177.664 419.598 177.775 419.768 177.849C420.027 177.96 420.299 178.038 420.577 178.083C421.608 178.375 422.671 178.538 423.742 178.568Z" fill="#263238"/>
<path d="M433.397 157.778C433.51 158.328 435.469 158.36 437.678 158.958C439.888 159.556 441.62 160.436 441.992 160.016C442.154 159.814 441.911 159.273 441.256 158.667C440.366 157.904 439.314 157.354 438.179 157.059C437.045 156.763 435.858 156.73 434.708 156.962C433.802 157.172 433.357 157.56 433.397 157.778Z" fill="#263238"/>
<path d="M415.495 156.8C415.77 157.285 417.113 157.027 418.732 157.237C420.351 157.447 421.629 157.964 421.969 157.552C422.139 157.35 421.969 156.881 421.468 156.38C420.749 155.771 419.865 155.388 418.928 155.282C417.992 155.175 417.044 155.35 416.207 155.782C415.624 156.146 415.373 156.566 415.495 156.8Z" fill="#263238"/>
<path d="M446.193 150.482L446.25 150.547C448.013 152.404 448.988 154.871 448.969 157.431V157.681C448.969 161.317 448.314 164.953 448.322 168.549C448.33 172.144 449.026 175.974 451.3 178.802C452.231 179.974 454.044 180.944 455.104 179.893C455.478 179.446 455.716 178.903 455.792 178.326C457.718 169.834 461.182 162.562 462.485 153.577C462.666 152.374 462.557 151.145 462.167 149.993C461.777 148.841 461.118 147.798 460.243 146.951C458.56 145.335 456.464 143.59 454.222 144.276C451.98 144.963 448.702 148.478 446.833 149.932" fill="#263238"/>
<path d="M452.708 171.175C452.935 171.11 461.667 169.89 460.138 178.382C458.608 186.874 450.426 183.594 450.426 183.343C450.426 183.093 452.708 171.175 452.708 171.175Z" fill="#B78876"/>
<path d="M453.599 180.596C453.599 180.596 453.729 180.725 453.955 180.879C454.282 181.095 454.679 181.176 455.064 181.105C456.019 180.935 457.031 179.651 457.346 178.124C457.509 177.403 457.509 176.655 457.346 175.934C457.313 175.655 457.212 175.387 457.053 175.155C456.894 174.923 456.68 174.733 456.432 174.601C456.27 174.524 456.086 174.508 455.912 174.554C455.739 174.599 455.588 174.705 455.485 174.851C455.331 175.061 455.355 175.247 455.307 175.247C455.258 175.247 455.153 175.077 455.307 174.738C455.391 174.537 455.542 174.371 455.736 174.269C456.001 174.134 456.309 174.108 456.594 174.197C456.932 174.331 457.231 174.551 457.461 174.834C457.69 175.117 457.843 175.454 457.905 175.813C458.129 176.602 458.16 177.433 457.994 178.237C457.629 179.942 456.464 181.38 455.177 181.517C454.936 181.543 454.693 181.514 454.464 181.433C454.236 181.352 454.029 181.22 453.858 181.049C453.575 180.798 453.567 180.604 453.599 180.596Z" fill="#AA6550"/>
<path d="M454.319 145.642C456.925 142.531 451.891 136.794 447.844 134.847C443.798 132.9 437.97 134.144 433.568 134.92C430.792 135.413 427.975 136.253 425.207 135.728C423.37 135.269 421.613 134.536 419.995 133.554C418.373 132.59 416.573 131.961 414.702 131.704C413.761 131.588 412.807 131.731 411.941 132.117C411.075 132.503 410.331 133.117 409.789 133.894C408.826 135.51 409.498 138.039 411.311 138.564C410.765 138.15 410.126 137.874 409.449 137.761C408.773 137.647 408.079 137.699 407.427 137.913C406.775 138.126 406.185 138.494 405.706 138.985C405.228 139.476 404.876 140.075 404.681 140.732C404.486 141.388 404.453 142.082 404.586 142.754C404.718 143.426 405.012 144.056 405.442 144.589C405.872 145.123 406.425 145.545 407.054 145.818C407.683 146.092 408.369 146.209 409.053 146.159C407.977 145.06 405.888 146.313 405.816 147.848C405.743 149.383 406.957 150.684 408.244 151.5C411.57 153.585 415.795 153.69 419.663 152.995C423.532 152.3 427.239 150.862 431.091 150.07C434.944 149.278 441.41 147.775 444.89 149.609C447.448 150.951 448.856 154.457 450.483 153.981C451.253 153.697 451.947 153.239 452.509 152.641C453.07 152.044 453.485 151.324 453.72 150.538C454.158 148.962 454.342 147.325 454.262 145.69" fill="#263238"/>
<path d="M470.966 185.032C471.125 184.996 471.276 184.93 471.411 184.838C471.811 184.581 472.131 184.217 472.333 183.788C472.647 183.1 472.743 182.333 472.609 181.59C472.399 180.612 471.862 179.735 471.087 179.101C470.167 178.345 469.132 177.742 468.02 177.316C466.77 176.86 465.569 176.281 464.434 175.586C463.246 174.753 462.34 173.578 461.836 172.217C461.283 170.752 461.027 169.192 461.084 167.628C461.165 164.396 462.063 161.366 462.281 158.513C462.5 155.661 462.136 152.987 460.922 151.136C460.009 149.648 458.562 148.564 456.875 148.106C456.423 147.993 455.957 147.946 455.491 147.969C455.329 147.972 455.169 147.996 455.014 148.042C455.628 148.038 456.24 148.114 456.835 148.268C458.438 148.774 459.798 149.853 460.655 151.298C461.78 153.092 462.168 155.694 461.885 158.481C461.602 161.269 460.736 164.299 460.638 167.62C460.587 169.241 460.862 170.857 461.448 172.371C461.989 173.808 462.958 175.046 464.224 175.918C465.386 176.614 466.614 177.193 467.89 177.647C468.973 178.048 469.986 178.615 470.893 179.328C471.632 179.912 472.156 180.725 472.382 181.638C472.53 182.334 472.462 183.058 472.188 183.715C471.937 184.277 471.508 184.74 470.966 185.032Z" fill="#455A64"/>
<path d="M411.036 138.362C410.922 138.277 410.797 138.209 410.664 138.16C410.512 138.085 410.355 138.023 410.194 137.974C409.97 137.898 409.74 137.841 409.506 137.804C408.739 137.683 407.954 137.739 407.21 137.965C406.467 138.192 405.785 138.585 405.217 139.113C404.641 139.814 404.209 140.622 403.948 141.49C403.687 142.358 403.601 143.27 403.695 144.171C403.804 145.291 404.136 146.378 404.673 147.368C405.21 148.357 405.939 149.229 406.819 149.932C408.842 151.559 411.305 152.547 413.893 152.769C416.703 153.01 419.533 152.838 422.294 152.26C426.671 151.403 430.862 149.784 434.677 147.476C436.312 146.466 438.021 145.583 439.791 144.834C441.335 144.208 442.982 143.872 444.647 143.84C447.072 143.788 449.47 144.343 451.624 145.456C452.402 145.891 453.156 146.369 453.882 146.886C453.234 146.251 452.501 145.707 451.705 145.27C449.546 144.069 447.111 143.448 444.639 143.468C442.933 143.481 441.243 143.807 439.654 144.43C437.865 145.178 436.136 146.062 434.482 147.072C430.695 149.332 426.543 150.921 422.213 151.767C419.493 152.342 416.704 152.519 413.933 152.292C411.425 152.084 409.034 151.139 407.062 149.577C406.214 148.908 405.508 148.076 404.986 147.132C404.463 146.187 404.134 145.148 404.019 144.074C403.92 143.215 403.992 142.344 404.231 141.512C404.47 140.68 404.871 139.903 405.411 139.226C405.951 138.712 406.598 138.324 407.306 138.091C408.015 137.858 408.766 137.785 409.506 137.877C410.03 137.992 410.542 138.154 411.036 138.362Z" fill="#455A64"/>
<path d="M415.771 131.292C415.741 131.941 415.843 132.59 416.07 133.199C416.701 134.883 417.882 136.305 419.421 137.239C420.455 137.912 421.604 138.388 422.812 138.645C424.196 138.923 425.614 138.997 427.02 138.863C429.991 138.645 433.098 137.627 436.36 136.786C439.622 135.946 442.883 135.502 445.7 136.253C448.2 136.914 450.423 138.355 452.045 140.366C453.161 141.701 453.987 143.253 454.473 144.923C454.797 146.111 454.837 146.806 454.894 146.797C454.905 146.631 454.905 146.463 454.894 146.296C454.849 145.82 454.771 145.348 454.659 144.882C454.227 143.16 453.423 141.552 452.304 140.172C450.666 138.079 448.395 136.568 445.829 135.865C442.916 135.057 439.565 135.518 436.287 136.366C433.009 137.215 429.926 138.233 427.02 138.467C425.651 138.608 424.269 138.551 422.917 138.297C421.747 138.06 420.629 137.616 419.615 136.988C418.114 136.105 416.939 134.762 416.264 133.158C416.048 132.551 415.882 131.927 415.771 131.292Z" fill="#455A64"/>
<path d="M419.905 184.911C420.011 185.745 420.232 186.561 420.56 187.335C420.732 187.717 420.983 188.059 421.297 188.338C421.611 188.616 421.981 188.825 422.381 188.951C422.815 189.04 423.265 189.02 423.689 188.892C424.113 188.763 424.498 188.531 424.809 188.216C425.43 187.563 425.829 186.732 425.951 185.84C426.08 185.032 425.951 184.022 425.141 183.763C424.814 183.683 424.473 183.683 424.146 183.763L419.662 184.571" fill="#AA6550"/>
<path d="M420.691 188.304C421.404 188.578 422.161 188.721 422.925 188.725C423.716 188.678 424.461 188.338 425.013 187.771C425.339 187.424 425.588 187.012 425.743 186.562C425.898 186.113 425.955 185.635 425.911 185.161C425.887 184.918 425.833 184.68 425.75 184.45C425.644 184.232 425.677 184.248 425.491 184.224C425.304 184.2 425.013 184.224 424.77 184.264L424.018 184.321C423.046 184.394 422.172 184.45 421.436 184.491C420.629 184.603 419.809 184.586 419.008 184.442C419.765 184.166 420.558 184.003 421.363 183.957C422.091 183.852 422.982 183.747 423.929 183.634L424.673 183.553C424.941 183.514 425.212 183.49 425.482 183.481C425.697 183.486 425.904 183.56 426.073 183.691C426.224 183.824 426.338 183.994 426.405 184.184C426.515 184.475 426.586 184.779 426.616 185.089C426.669 185.67 426.593 186.257 426.392 186.805C426.192 187.354 425.873 187.852 425.458 188.264C424.768 188.92 423.846 189.277 422.893 189.258C422.27 189.26 421.659 189.09 421.128 188.765C420.853 188.539 420.667 188.337 420.691 188.304Z" fill="#263238"/>
<path d="M416.677 201.434C416.677 201.434 424.835 204.521 432.774 202.242C432.774 202.242 426.785 207.26 415.859 205.337L416.677 201.434Z" fill="#AA6550"/>
<path d="M429.125 317.277C428.731 317.02 428.358 316.734 428.008 316.421C427.66 316.138 427.198 315.791 426.705 315.419C426.211 315.047 425.612 314.611 424.924 314.167C424.236 313.722 423.524 313.237 422.69 312.777C421.857 312.316 420.975 311.831 420.028 311.347C415.876 309.307 411.411 307.974 406.819 307.404C405.759 307.29 404.756 307.161 403.809 307.137C402.862 307.113 401.98 307.072 401.178 307.08C400.377 307.088 399.641 307.129 399.001 307.153C398.362 307.177 397.812 307.226 397.383 307.274C396.919 307.345 396.451 307.377 395.982 307.371C396.438 307.255 396.9 307.168 397.366 307.113C397.902 307.021 398.443 306.956 398.985 306.919C399.624 306.87 400.353 306.781 401.17 306.781C401.988 306.781 402.87 306.733 403.825 306.781C404.78 306.83 405.8 306.911 406.868 307.008C409.184 307.295 411.473 307.766 413.715 308.414C415.94 309.096 418.105 309.958 420.19 310.991C421.137 311.492 422.051 311.953 422.852 312.47C423.654 312.987 424.414 313.447 425.078 313.916C425.742 314.385 426.324 314.837 426.834 315.225C427.344 315.613 427.765 315.985 428.097 316.292C428.466 316.591 428.81 316.921 429.125 317.277Z" fill="#FAFAFA"/>
<path d="M381.559 275.778L388.196 247.07C390.737 236.275 393.748 225.901 398.806 224.672V228.01L396.637 310.03C396.637 310.03 383.113 325.382 365.883 316.865C360.492 314.191 350.659 295.405 350.659 295.405C350.659 295.405 327.779 254.649 328.734 252.799C329.689 250.949 343.666 232.963 345.091 232.066L381.559 275.778Z" fill="#90CAF9"/>
<path d="M449.851 216.544C463.043 219.065 477.894 226.749 484.733 246.44C487.226 253.631 505.387 306.644 505.387 306.644L474.414 305.998L469.412 295.082L471.84 312.817L473.937 338.108L395.723 339.425L396.273 301.319L397.026 225.529C397.026 225.529 397.9 224.382 411.391 216.956C419.76 212.342 449.851 216.544 449.851 216.544Z" fill="#90CAF9"/>
<g opacity="0.2">
<path d="M457.653 267.238C458.94 283.236 460.413 288.181 461.7 304.18C461.731 305.695 462.004 307.195 462.509 308.624C462.78 309.334 463.214 309.971 463.776 310.484C464.338 310.996 465.013 311.369 465.747 311.573C468.029 312.033 470.991 313.682 471.631 311.452L469.47 296.043C469.005 293.802 468.288 291.62 467.333 289.539C462.534 278.897 460.761 278.275 457.621 267.238" fill="black"/>
</g>
<path d="M411.383 225.157L411.642 223.493L414.143 207.527C414.215 207.063 414.46 206.643 414.829 206.352C415.199 206.061 415.665 205.921 416.134 205.959L446.929 208.529C447.859 208.605 448.721 209.045 449.328 209.754C449.934 210.462 450.235 211.381 450.166 212.31L449.478 221.586L439.863 234.11L426.016 236.267" fill="#90CAF9"/>
<path d="M395.917 255.174C396.039 255.174 396.128 267.682 396.128 283.107C396.128 298.532 396.039 311.04 395.917 311.04C395.796 311.04 395.707 298.532 395.707 283.107C395.707 267.682 395.804 255.174 395.917 255.174Z" fill="#263238"/>
<path d="M475.078 308.567C475.078 308.567 475.078 308.511 474.981 308.389C474.884 308.268 474.827 308.066 474.722 307.84L473.783 305.715L470.408 297.869L459.409 271.924C457.273 266.85 455.241 262.018 453.396 257.615C452.463 255.552 451.794 253.38 451.405 251.151C451.063 249.203 450.885 247.23 450.871 245.252C450.768 242.387 451.185 239.526 452.101 236.809L452.352 236.138L452.635 235.572C452.768 235.272 452.931 234.985 453.121 234.716L453.461 234.215C453.5 234.158 453.543 234.104 453.59 234.053C453.058 234.947 452.611 235.888 452.255 236.865C451.408 239.577 451.041 242.415 451.17 245.252C451.184 249.466 452.063 253.632 453.752 257.493L459.798 271.787L470.683 297.78L473.921 305.674L474.787 307.832L475.005 308.397C475.035 308.452 475.059 308.508 475.078 308.567Z" fill="#263238"/>
<path d="M459.45 219.364C459.167 219.651 458.867 219.921 458.552 220.172C457.642 220.865 456.649 221.443 455.598 221.893C453.931 222.587 452.187 223.076 450.402 223.347C448.043 223.713 445.665 223.948 443.28 224.05C440.625 224.163 437.728 224.115 434.62 224.172C431.319 224.166 428.029 224.568 424.827 225.367C421.279 226.204 418.068 228.095 415.617 230.789C414.395 232.256 413.521 233.98 413.059 235.831C412.565 237.73 412.599 239.727 413.156 241.608C413.466 242.536 413.922 243.409 414.508 244.194C415.098 244.955 415.842 245.583 416.693 246.036C417.518 246.487 418.459 246.684 419.396 246.602C420.313 246.508 421.161 246.075 421.776 245.39C422.323 244.668 422.712 243.84 422.918 242.959C423.125 242.078 423.143 241.164 422.973 240.275C422.839 239.397 422.566 238.546 422.164 237.754C421.765 236.981 421.285 236.252 420.732 235.58C418.568 233.091 415.654 231.37 412.428 230.676C409.632 230.017 406.718 230.051 403.938 230.773C401.651 231.363 399.468 232.298 397.463 233.544C395.937 234.495 394.496 235.576 393.158 236.776C392.049 237.746 391.264 238.586 390.73 239.136L390.131 239.782C390.065 239.859 389.992 239.93 389.912 239.992C390.865 238.79 391.921 237.674 393.069 236.655C394.393 235.431 395.829 234.333 397.358 233.375C399.382 232.089 401.594 231.124 403.914 230.514C406.739 229.758 409.708 229.708 412.557 230.369C415.867 231.066 418.86 232.822 421.08 235.37C421.645 236.045 422.139 236.776 422.553 237.552C422.961 238.384 423.234 239.276 423.362 240.194C423.503 241.13 423.487 242.083 423.313 243.014C423.139 243.983 422.712 244.889 422.075 245.64C421.395 246.402 420.454 246.884 419.437 246.989C418.416 247.086 417.39 246.875 416.491 246.383C415.587 245.902 414.796 245.236 414.168 244.428C413.55 243.605 413.069 242.689 412.743 241.713C412.162 239.759 412.128 237.682 412.646 235.71C413.119 233.794 414.024 232.011 415.293 230.498C417.804 227.749 421.087 225.82 424.713 224.963C427.952 224.173 431.277 223.787 434.612 223.816C437.728 223.768 440.625 223.816 443.263 223.743C445.639 223.661 448.009 223.447 450.361 223.105C452.136 222.851 453.874 222.39 455.541 221.731C456.587 221.307 457.581 220.765 458.503 220.115C458.827 219.897 459.045 219.695 459.207 219.582C459.281 219.502 459.362 219.429 459.45 219.364Z" fill="#FAFAFA"/>
<path d="M486.214 252.993C486.101 253.025 485.984 253.044 485.866 253.049C485.64 253.049 485.308 253.106 484.871 253.122C483.648 253.162 482.424 253.133 481.205 253.033C479.659 252.92 477.83 252.686 475.806 252.403C473.783 252.12 471.565 251.821 469.218 251.7C467.024 251.581 464.823 251.746 462.671 252.193C460.911 252.55 459.222 253.191 457.669 254.092C456.263 254.95 455.014 256.043 453.979 257.324C454.022 257.216 454.082 257.115 454.157 257.025C454.327 256.739 454.522 256.469 454.739 256.217C455.523 255.261 456.462 254.441 457.515 253.793C459.078 252.84 460.791 252.157 462.582 251.773C464.768 251.296 467.008 251.117 469.243 251.24C471.614 251.361 473.84 251.684 475.863 251.983C477.886 252.282 479.699 252.548 481.229 252.694C482.758 252.839 484.013 252.904 484.871 252.912C485.32 252.911 485.769 252.938 486.214 252.993Z" fill="#FAFAFA"/>
<path d="M466.767 289.216C465.245 288.862 463.681 288.729 462.121 288.82C460.292 288.943 458.482 289.266 456.723 289.781C454.659 290.339 452.353 291.155 449.763 291.955C446.951 292.907 444.007 293.416 441.038 293.466C437.619 293.465 434.236 292.763 431.1 291.405C427.614 289.934 424.513 287.684 422.035 284.828C420.695 283.336 419.602 281.639 418.798 279.802C417.942 277.901 417.62 275.804 417.867 273.734C418.149 271.648 419.168 269.731 420.74 268.329C421.521 267.649 422.458 267.171 423.468 266.939C424.456 266.73 425.479 266.758 426.454 267.021C427.429 267.283 428.328 267.773 429.076 268.45C429.808 269.119 430.316 269.996 430.533 270.963C430.743 271.909 430.666 272.896 430.315 273.799C429.974 274.667 429.459 275.456 428.801 276.118C427.546 277.373 426.029 278.336 424.358 278.938C423.571 279.236 422.758 279.461 421.93 279.608C421.525 279.681 421.121 279.77 420.724 279.827L419.518 279.972C416.561 280.265 413.575 280.054 410.688 279.35C408.308 278.784 406.013 277.904 403.866 276.732C402.242 275.856 400.719 274.805 399.325 273.597L398.516 272.894L397.852 272.223C397.494 271.885 397.159 271.523 396.849 271.141L396.266 270.446C396.199 270.37 396.14 270.289 396.088 270.203C396.166 270.27 396.239 270.343 396.306 270.421L396.913 271.084C397.234 271.455 397.578 271.805 397.941 272.134L398.613 272.789L399.422 273.476C400.822 274.65 402.344 275.672 403.963 276.522C406.099 277.662 408.377 278.515 410.737 279.059C413.595 279.739 416.548 279.93 419.47 279.625L420.651 279.479C421.048 279.414 421.46 279.326 421.849 279.253C422.658 279.107 423.452 278.885 424.22 278.59C425.836 278.003 427.304 277.067 428.518 275.851C429.137 275.226 429.622 274.481 429.942 273.662C430.26 272.829 430.33 271.923 430.145 271.052C429.905 270.162 429.426 269.354 428.76 268.716C428.094 268.078 427.266 267.634 426.365 267.432C425.443 267.166 424.468 267.139 423.532 267.352C422.597 267.565 421.731 268.013 421.015 268.652C419.517 269.985 418.549 271.812 418.288 273.799C418.056 275.791 418.363 277.808 419.178 279.641C419.961 281.434 421.021 283.095 422.318 284.561C424.754 287.365 427.799 289.576 431.221 291.025C434.308 292.371 437.638 293.074 441.006 293.094C443.945 293.058 446.861 292.567 449.65 291.64C452.231 290.832 454.506 290.072 456.634 289.531C458.411 289.032 460.238 288.731 462.081 288.634C462.752 288.592 463.425 288.592 464.096 288.634C464.671 288.723 465.164 288.763 465.553 288.852L466.435 289.07C466.552 289.103 466.664 289.152 466.767 289.216Z" fill="#FAFAFA"/>
<path d="M395.65 280.594C395.577 280.594 395.205 279.786 394.419 278.429C392.365 274.984 389.369 272.195 385.784 270.389C384.408 269.694 383.502 269.387 383.526 269.314C383.753 269.334 383.977 269.386 384.19 269.468C384.779 269.643 385.355 269.859 385.913 270.114C387.768 270.959 389.473 272.096 390.964 273.484C392.457 274.87 393.712 276.491 394.678 278.283C394.985 278.82 395.255 279.376 395.488 279.948C395.57 280.155 395.625 280.372 395.65 280.594Z" fill="#FAFAFA"/>
<path d="M364.248 315.177C364.248 315.177 364.192 315.112 364.119 314.975C364.046 314.837 363.925 314.619 363.787 314.369C363.496 313.835 363.075 313.035 362.557 312.001C361.053 309.081 359.813 306.034 358.85 302.895C358.207 300.714 357.818 298.467 357.693 296.197C357.628 294.929 357.68 293.658 357.847 292.399C358.048 291.067 358.367 289.756 358.802 288.48C359.746 285.723 361.382 283.253 363.552 281.305C364.712 280.243 366.075 279.427 367.559 278.906C369.043 278.386 370.618 278.171 372.188 278.275C373.819 278.397 375.343 279.137 376.445 280.344C376.97 280.94 377.351 281.649 377.56 282.414C377.769 283.18 377.8 283.984 377.651 284.763C377.476 285.528 377.076 286.223 376.502 286.759C375.941 287.272 375.263 287.641 374.527 287.834C373.102 288.204 371.59 288.022 370.294 287.325C369.092 286.677 368.041 285.782 367.211 284.699C366.415 283.696 365.758 282.589 365.26 281.41C364.384 279.295 364.021 277.002 364.2 274.72C364.363 272.837 364.914 271.008 365.819 269.347C366.489 268.094 367.346 266.949 368.36 265.953C368.994 265.321 369.691 264.755 370.44 264.264C370.691 264.095 370.901 263.99 371.039 263.909L371.249 263.804C371.249 263.804 370.99 263.99 370.488 264.337C369.766 264.852 369.091 265.43 368.473 266.066C367.504 267.071 366.686 268.212 366.045 269.452C365.185 271.092 364.67 272.89 364.532 274.736C364.375 276.974 364.752 279.217 365.632 281.281C366.124 282.425 366.766 283.498 367.542 284.473C368.348 285.51 369.362 286.366 370.521 286.985C371.73 287.635 373.142 287.803 374.47 287.454C375.152 287.295 375.776 286.951 376.274 286.461C376.773 285.97 377.126 285.352 377.295 284.675C377.423 283.961 377.39 283.227 377.196 282.528C377.003 281.829 376.655 281.182 376.178 280.635C375.145 279.51 373.721 278.822 372.196 278.712C370.684 278.612 369.167 278.819 367.737 279.32C366.307 279.821 364.994 280.607 363.876 281.628C361.758 283.531 360.157 285.938 359.223 288.626C358.786 289.873 358.464 291.158 358.259 292.464C358.091 293.7 358.035 294.95 358.089 296.197C358.203 298.442 358.572 300.668 359.19 302.83C360.123 305.961 361.314 309.01 362.751 311.945L363.909 314.369C364.03 314.627 364.127 314.837 364.208 314.999C364.289 315.16 364.248 315.177 364.248 315.177Z" fill="#FAFAFA"/>
<path d="M354.253 243.846C354.253 243.846 354.294 243.959 354.326 244.178C354.383 244.504 354.424 244.833 354.447 245.163C354.554 246.37 354.554 247.584 354.447 248.791C354.12 252.81 352.744 256.673 350.454 259.995C348.165 263.317 345.043 265.981 341.401 267.723C340.311 268.254 339.176 268.69 338.01 269.024C337.605 269.153 337.273 269.209 337.055 269.266C336.836 269.323 336.715 269.331 336.715 269.314C337.12 269.14 337.537 268.992 337.961 268.87C339.097 268.477 340.203 268.005 341.271 267.456C344.817 265.668 347.855 263.018 350.107 259.751C352.358 256.484 353.751 252.704 354.156 248.759C354.284 247.568 354.33 246.369 354.294 245.171C354.251 244.731 354.238 244.288 354.253 243.846Z" fill="#FAFAFA"/>
<path d="M493.296 278.881C492.092 279.634 491.034 280.598 490.172 281.725C489.363 282.768 488.553 284.149 487.639 285.604C486.636 287.232 485.479 288.761 484.183 290.169C481.814 292.725 479.004 294.835 475.887 296.399C474.949 296.873 473.981 297.286 472.99 297.635C472.628 297.777 472.254 297.885 471.873 297.958C472.208 297.767 472.56 297.607 472.925 297.481C473.605 297.182 474.592 296.762 475.75 296.132C478.774 294.509 481.508 292.399 483.843 289.886C485.125 288.5 486.277 286.999 487.283 285.402C488.087 284.067 488.966 282.777 489.913 281.54C490.571 280.71 491.355 279.987 492.236 279.398C492.475 279.24 492.726 279.102 492.989 278.986C493.199 278.905 493.296 278.865 493.296 278.881Z" fill="#FAFAFA"/>
<path d="M449.559 217.514C449.44 217.564 449.315 217.597 449.187 217.611L448.11 217.804C447.171 217.958 445.812 218.16 444.136 218.386C440.77 218.839 436.108 219.372 430.936 219.752C428.515 219.973 426.083 220.059 423.652 220.01C421.647 219.961 419.659 219.621 417.752 219C416.465 218.584 415.25 217.97 414.151 217.182C413.851 216.971 413.564 216.742 413.293 216.496C413.115 216.318 413.026 216.229 413.034 216.213C413.042 216.197 413.455 216.536 414.24 217.021C415.358 217.738 416.57 218.298 417.841 218.685C419.731 219.259 421.693 219.564 423.668 219.59C426.1 219.616 428.531 219.519 430.952 219.299C436.108 218.92 440.77 218.443 444.136 218.063L448.126 217.611C448.601 217.545 449.08 217.512 449.559 217.514Z" fill="#263238"/>
<path d="M505.023 312.365C505.632 315.491 505.545 318.712 504.768 321.8C503.99 324.889 502.542 327.769 500.526 330.236C498.509 332.704 495.974 334.698 493.099 336.078C490.224 337.458 487.081 338.189 483.891 338.221L422.584 337.542L424.203 317.722L476.696 309.852" fill="#B78876"/>
<path d="M427.958 318.586C427.674 318.675 424.138 317.092 420.965 315.629C417.6 314.072 413.905 313.357 410.201 313.544L395.584 314.288C395.584 314.288 396.483 316.712 398.012 317.52C399.542 318.328 408.712 318.586 408.712 318.586L408.242 319.063C406.325 321.035 403.71 322.177 400.958 322.247H399.558C398.522 322.165 397.498 321.964 396.507 321.649L392.905 320.194C391.813 319.709 390.664 319.782 390.186 320.881C389.709 321.98 390.073 323.24 393.051 324.735C394.71 325.543 400.877 327.701 400.877 327.701C400.92 328.577 401.042 329.448 401.242 330.302C401.509 331.199 403.929 332.096 403.929 332.096C404.557 333.426 405.277 334.711 406.081 335.942C406.365 336.265 408.558 336.952 410.897 337.607C414.668 338.66 418.66 338.629 422.414 337.518L427.982 335.853V318.885" fill="#B78876"/>
<path d="M407.969 329.664C405.393 329.599 402.869 328.935 400.596 327.725C400.596 327.628 402.214 328.242 404.262 328.767C406.31 329.292 407.977 329.543 407.969 329.664Z" fill="#AA6550"/>
<path d="M407.45 333.066C406.764 333.208 406.051 333.155 405.394 332.912C404.707 332.786 404.069 332.473 403.549 332.007C404.211 332.139 404.86 332.326 405.491 332.565C406.156 332.681 406.811 332.849 407.45 333.066Z" fill="#AA6550"/>
<path d="M410.12 317.269C409.801 317.719 409.422 318.124 408.996 318.473C408.026 319.397 406.957 320.21 405.807 320.897C404.648 321.572 403.388 322.058 402.076 322.335C401.548 322.476 401.002 322.536 400.457 322.513C402.266 322.098 404.013 321.449 405.653 320.582C406.777 319.905 407.846 319.141 408.85 318.295C409.242 317.916 409.667 317.573 410.12 317.269Z" fill="#AA6550"/>
<path d="M429.448 315.928L427.959 338.342H485.705C489.626 338.345 493.473 337.28 496.833 335.263C500.636 332.982 503.643 329.586 505.445 325.538C507.246 321.49 507.755 316.986 506.901 312.639C506.071 308.383 504.824 304.218 503.178 300.204L474.14 304.98L475.07 308.583L429.448 315.928Z" fill="#90CAF9"/>
<path d="M488.448 306.701C488.257 306.756 488.062 306.799 487.866 306.83L486.174 307.137L479.934 308.171L459.409 311.403L438.86 314.546L432.629 315.451L430.929 315.678C430.73 315.705 430.53 315.721 430.33 315.726C430.522 315.659 430.72 315.613 430.921 315.589L432.604 315.29L438.82 314.247L459.345 311.015L479.934 307.848L486.166 306.943L487.866 306.717C488.059 306.691 488.254 306.685 488.448 306.701Z" fill="#263238"/>
<path d="M458.892 338.358C458.787 338.358 459.24 336.742 459.297 334.1C459.309 333.382 459.28 332.665 459.208 331.951C459.138 331.136 459.019 330.327 458.852 329.527C458.451 327.683 457.82 325.897 456.974 324.21C456.108 322.531 455.049 320.958 453.818 319.524L453.008 318.578C452.733 318.271 452.434 318.005 452.159 317.73C451.616 317.172 451.042 316.728 450.54 316.3C448.476 314.684 447.011 313.876 447.06 313.803C447.418 313.946 447.762 314.122 448.088 314.328C448.49 314.538 448.88 314.773 449.253 315.031C449.682 315.338 450.216 315.637 450.726 316.073C451.309 316.509 451.866 316.979 452.393 317.479C452.677 317.754 452.992 318.013 453.275 318.287L454.158 319.241C455.425 320.685 456.512 322.278 457.395 323.984C458.252 325.706 458.883 327.531 459.273 329.414C459.438 330.237 459.547 331.072 459.596 331.91C459.648 332.637 459.648 333.366 459.596 334.092C459.581 334.695 459.527 335.297 459.434 335.894C459.39 336.343 459.312 336.789 459.2 337.227C459.13 337.612 459.027 337.991 458.892 338.358Z" fill="#FAFAFA"/>
<path d="M494.049 336.669C493.147 336.664 492.249 336.558 491.37 336.354C490.335 336.117 489.33 335.762 488.376 335.296C487.11 334.668 485.968 333.819 485.001 332.791C483.827 331.53 482.975 330.006 482.516 328.347C482.26 327.425 482.116 326.475 482.087 325.519C482.028 324.508 482.11 323.494 482.33 322.505C482.546 321.453 482.952 320.448 483.528 319.54C484.128 318.577 484.964 317.782 485.956 317.229C486.981 316.632 488.161 316.35 489.347 316.421C489.956 316.463 490.551 316.628 491.095 316.906C491.638 317.183 492.12 317.568 492.511 318.037C492.916 318.499 493.22 319.04 493.403 319.626C493.587 320.211 493.647 320.829 493.58 321.439C493.48 322.031 493.25 322.593 492.905 323.085C492.561 323.577 492.111 323.986 491.589 324.283C489.63 325.307 487.374 325.616 485.211 325.155C482.141 324.678 479.335 323.143 477.279 320.818C475.223 318.492 474.046 315.522 473.953 312.421C473.901 311.521 473.978 310.618 474.18 309.739C474.105 310.628 474.083 311.521 474.115 312.413C474.266 314.845 475.062 317.193 476.422 319.217C477.435 320.702 478.742 321.965 480.261 322.928C481.781 323.891 483.482 324.533 485.26 324.816C487.326 325.259 489.483 324.974 491.362 324.008C491.832 323.743 492.236 323.377 492.547 322.937C492.858 322.497 493.067 321.993 493.159 321.463C493.206 320.91 493.144 320.353 492.976 319.824C492.808 319.295 492.536 318.804 492.178 318.38C491.819 317.956 491.38 317.607 490.886 317.352C490.392 317.098 489.852 316.943 489.298 316.898C488.201 316.823 487.106 317.073 486.15 317.617C485.251 318.153 484.478 318.877 483.884 319.739C483.291 320.6 482.89 321.58 482.71 322.61C482.491 323.569 482.407 324.553 482.459 325.535C482.482 326.461 482.615 327.38 482.856 328.274C483.283 329.889 484.093 331.378 485.219 332.613C486.145 333.627 487.24 334.472 488.456 335.11C489.389 335.585 490.372 335.957 491.386 336.217C493.086 336.597 494.057 336.613 494.049 336.669Z" fill="#FAFAFA"/>
<path d="M264.984 92.4918H120.364C111.911 92.4918 103.805 95.8441 97.8277 101.811C91.8507 107.779 88.4928 115.872 88.4928 124.311V175.764H57.293L88.4928 206.913V241.891C88.4928 250.33 91.8507 258.423 97.8277 264.39C103.805 270.358 111.911 273.71 120.364 273.71H264.984C273.437 273.71 281.544 270.358 287.521 264.39C293.498 258.423 296.856 250.33 296.856 241.891V124.311C296.856 115.872 293.498 107.779 287.521 101.811C281.544 95.8441 273.437 92.4918 264.984 92.4918Z" fill="#90CAF9"/>
<path d="M205.903 97.9296C204.988 100.297 206.558 102.875 208.331 104.701C210.103 106.527 212.224 108.256 212.782 110.728C213.243 112.805 212.474 114.962 212.661 117.079C212.847 119.196 214.02 121.192 214.684 123.26C215.89 127.01 215.404 131.106 214.328 134.896C213.552 138.045 212.068 140.976 209.99 143.468C208.943 144.703 207.646 145.701 206.183 146.398C204.721 147.094 203.128 147.473 201.508 147.508C201.05 147.537 200.591 147.472 200.159 147.316C199.728 147.16 199.333 146.918 198.999 146.604C198.545 145.95 198.294 145.177 198.279 144.382C196.425 128.112 196.425 111.686 198.279 95.4167" fill="#263238"/>
<path d="M204.195 150.361C211.236 150.054 217.743 156.784 217.185 163.798C224.315 165.535 229.325 173.364 227.957 180.556C227.496 182.931 226.435 185.194 226.29 187.601C226.128 190.236 227.099 192.797 227.577 195.382C228.493 200.095 228.003 204.972 226.168 209.409C225.06 212.084 222.988 214.847 220.09 214.928C219.109 214.887 218.152 214.605 217.305 214.108C216.458 213.61 215.747 212.912 215.234 212.076C214.225 210.382 213.56 208.507 213.276 206.557C212.021 200.239 211.657 193.75 209.909 187.553C208.161 181.356 204.761 175.247 199.153 172.104C196.053 170.359 192.33 169.535 189.862 166.973C188.62 165.575 187.792 163.86 187.47 162.019C187.149 160.179 187.346 158.285 188.041 156.55C188.768 154.83 189.85 153.283 191.217 152.009C192.584 150.736 194.204 149.764 195.972 149.157" fill="#263238"/>
<path d="M155.456 103.723C155.375 100.717 158.151 98.3982 160.952 97.259C163.752 96.1197 166.868 95.7399 169.361 94.027C171.578 92.5402 173.059 90.2213 174.929 88.371C177.238 86.0337 180.128 84.3519 183.302 83.4983C186.477 82.6447 189.822 82.65 192.994 83.5137C196.166 84.3774 199.051 86.0683 201.352 88.4129C203.653 90.7575 205.288 93.6712 206.088 96.855C207.165 101.129 206.428 106.187 203.053 109.032C199.136 112.328 193.341 111.593 188.299 110.567C183.257 109.541 177.592 108.531 173.399 111.48C170.874 113.249 169.417 116.142 167.872 118.816C166.326 121.491 164.391 124.214 161.47 125.224C158.548 126.234 154.574 124.489 154.461 121.41" fill="#263238"/>
<path d="M167.321 104.337C166.068 104.472 164.911 105.072 164.08 106.017C163.248 106.963 162.802 108.186 162.829 109.444L165.832 177.316C165.961 185.331 177.697 189.832 186.292 189.63C194.976 189.428 195.251 185.177 195.365 177.55C195.543 164.816 195.526 160.032 195.534 160.105C195.543 160.178 206.501 158.263 208.743 143.945C209.852 136.843 209.471 125.192 208.848 115.665C208.29 107.092 202.576 96.5883 194.021 97.5094L167.321 104.337Z" fill="#FFBE9D"/>
<path d="M206.381 124.666C206.386 125.143 206.204 125.603 205.875 125.949C205.545 126.294 205.094 126.498 204.617 126.517C204.386 126.537 204.153 126.51 203.932 126.44C203.712 126.369 203.507 126.255 203.331 126.105C203.155 125.954 203.01 125.77 202.906 125.564C202.801 125.357 202.739 125.132 202.723 124.901C202.716 124.423 202.897 123.962 203.227 123.616C203.557 123.27 204.009 123.067 204.487 123.05C204.718 123.03 204.951 123.057 205.172 123.127C205.392 123.198 205.597 123.312 205.773 123.462C205.949 123.613 206.094 123.797 206.198 124.003C206.303 124.21 206.365 124.435 206.381 124.666Z" fill="#263238"/>
<path d="M206.332 121.758C206.105 122 204.713 120.95 202.738 120.95C200.764 120.95 199.315 121.951 199.096 121.709C198.991 121.604 199.226 121.168 199.857 120.707C200.709 120.115 201.725 119.801 202.763 119.81C203.79 119.804 204.794 120.124 205.628 120.723C206.235 121.2 206.445 121.652 206.332 121.758Z" fill="#263238"/>
<path d="M187.401 124.666C187.405 125.143 187.223 125.603 186.894 125.949C186.565 126.294 186.114 126.498 185.636 126.517C185.405 126.537 185.173 126.51 184.952 126.44C184.731 126.369 184.527 126.255 184.35 126.105C184.174 125.954 184.03 125.77 183.925 125.564C183.821 125.357 183.759 125.132 183.742 124.901C183.736 124.423 183.917 123.962 184.246 123.616C184.576 123.27 185.029 123.067 185.507 123.05C185.738 123.03 185.97 123.057 186.191 123.127C186.412 123.198 186.616 123.312 186.793 123.462C186.969 123.613 187.113 123.797 187.218 124.003C187.322 124.21 187.384 124.435 187.401 124.666Z" fill="#263238"/>
<path d="M186.957 122.17C186.731 122.412 185.338 121.362 183.364 121.362C181.389 121.362 179.94 122.364 179.73 122.121C179.625 122.016 179.851 121.58 180.482 121.119C181.334 120.525 182.349 120.209 183.388 120.214C184.417 120.211 185.42 120.533 186.253 121.135C186.82 121.628 187.03 122.065 186.957 122.17Z" fill="#263238"/>
<path d="M194.118 136.778C194.118 136.665 195.332 136.455 197.356 136.196C197.858 136.14 198.335 136.035 198.424 135.696C198.461 135.175 198.343 134.655 198.084 134.201L196.579 130.371C194.499 124.917 192.985 120.432 193.212 120.352C193.439 120.271 195.3 124.626 197.38 130.048L198.821 133.902C199.134 134.509 199.229 135.205 199.088 135.873C199.017 136.049 198.907 136.208 198.767 136.336C198.627 136.465 198.46 136.561 198.278 136.617C198.015 136.689 197.743 136.727 197.469 136.73C195.365 136.875 194.126 136.891 194.118 136.778Z" fill="#263238"/>
<path d="M195.535 160.113C188.795 160.229 182.154 158.476 176.354 155.047C176.354 155.047 181.023 164.856 195.349 163.483L195.535 160.113Z" fill="#EB996E"/>
<path d="M193.293 141.529C192.912 141.051 192.414 140.68 191.846 140.45C191.279 140.221 190.662 140.142 190.055 140.22C189.62 140.259 189.196 140.386 188.811 140.593C188.426 140.8 188.086 141.083 187.814 141.424C187.55 141.754 187.395 142.156 187.369 142.577C187.343 142.998 187.447 143.416 187.668 143.776C187.985 144.13 188.401 144.382 188.863 144.497C189.325 144.612 189.811 144.586 190.258 144.422C191.189 144.091 192.045 143.578 192.775 142.911C192.999 142.755 193.191 142.557 193.341 142.329C193.415 142.221 193.455 142.093 193.455 141.962C193.455 141.83 193.415 141.702 193.341 141.594" fill="#EB996E"/>
<path d="M188.309 138.168C188.633 138.168 188.641 140.293 190.478 141.804C192.315 143.315 194.597 143.081 194.614 143.42C194.614 143.557 194.104 143.84 193.141 143.864C191.884 143.887 190.661 143.467 189.685 142.677C188.751 141.914 188.15 140.819 188.009 139.622C187.92 138.677 188.163 138.168 188.309 138.168Z" fill="#263238"/>
<path d="M187.766 118.711C187.572 119.253 185.597 119.002 183.283 119.285C180.968 119.568 179.09 120.206 178.783 119.721C178.645 119.495 178.969 118.986 179.722 118.469C180.727 117.824 181.865 117.416 183.052 117.276C184.238 117.136 185.441 117.268 186.569 117.661C187.451 118.041 187.88 118.461 187.766 118.711Z" fill="#263238"/>
<path d="M205.57 116.053C205.222 116.497 203.863 116.053 202.22 116.053C200.577 116.053 199.201 116.36 198.885 115.891C198.74 115.665 198.958 115.221 199.565 114.793C200.377 114.285 201.322 114.029 202.279 114.056C203.237 114.084 204.165 114.393 204.947 114.946C205.57 115.374 205.74 115.835 205.57 116.053Z" fill="#263238"/>
<path d="M157.326 151.346C159.3 151.745 161.34 151.669 163.278 151.125C165.216 150.581 166.997 149.585 168.474 148.219C169.951 146.853 171.081 145.156 171.771 143.268C172.462 141.38 172.692 139.355 172.445 137.36C171.999 133.845 170.106 130.282 171.328 126.953C172.946 122.566 179.105 121.216 180.74 116.829C181.687 114.284 180.837 111.302 181.914 108.805C182.925 106.462 185.402 105.113 187.814 104.24C190.226 103.367 192.799 102.77 194.823 101.202C196.846 99.6345 198.1 96.6772 196.797 94.4714C186.108 95.7517 175.61 98.2987 165.525 102.058C163.186 102.931 160.734 103.982 159.35 106.05C157.893 108.248 157.966 111.076 158.087 113.71C158.686 126.541 156.727 138.556 157.326 151.387" fill="#263238"/>
<path d="M153.92 147.323C153.839 147.31 153.76 147.286 153.685 147.25C153.454 147.17 153.234 147.061 153.03 146.927C152.242 146.418 151.622 145.686 151.249 144.826C150.637 143.466 150.473 141.946 150.78 140.487C151.267 138.591 152.153 136.82 153.378 135.292C154.632 133.546 156.227 131.777 157.311 129.522C157.89 128.377 158.213 127.12 158.258 125.838C158.211 124.477 157.938 123.134 157.449 121.863C156.903 120.488 156.615 119.026 156.599 117.548C156.677 115.966 157.143 114.428 157.954 113.067C158.765 111.707 159.898 110.565 161.253 109.743C162.706 108.951 164.318 108.493 165.971 108.401C167.571 108.323 169.155 108.052 170.69 107.593C172.13 107.049 173.314 105.985 174.008 104.612C174.669 103.261 175.195 101.848 175.578 100.394C175.987 98.9989 176.529 97.6461 177.197 96.354C178.414 93.9043 180.267 91.8254 182.563 90.3344C184.59 89.062 186.962 88.4467 189.353 88.573C191.333 88.6752 193.22 89.4475 194.703 90.7626C195.808 91.7545 196.631 93.0199 197.09 94.431C197.388 95.3143 197.501 96.2494 197.422 97.1782C197.405 97.5012 197.351 97.8212 197.26 98.1316C197.26 98.1316 197.317 97.8003 197.341 97.1701C197.38 96.2556 197.242 95.3422 196.936 94.4794C196.379 92.8916 195.356 91.5077 194.001 90.5077C192.646 89.5077 191.021 88.9378 189.337 88.8719C187.012 88.7697 184.711 89.3847 182.749 90.6334C180.514 92.0991 178.715 94.1359 177.537 96.5318C176.883 97.8242 176.357 99.1773 175.966 100.572C175.571 102.052 175.029 103.489 174.348 104.862C173.973 105.573 173.483 106.217 172.899 106.769C172.295 107.327 171.585 107.759 170.811 108.038C169.234 108.523 167.603 108.811 165.955 108.894C164.362 108.978 162.808 109.417 161.407 110.179C160.111 110.963 159.028 112.052 158.25 113.351C157.473 114.649 157.026 116.118 156.947 117.629C156.962 119.061 157.236 120.479 157.756 121.814C158.272 123.124 158.559 124.512 158.606 125.919C158.552 127.253 158.209 128.559 157.603 129.749C156.47 132.06 154.859 133.789 153.596 135.542C152.378 137.027 151.49 138.754 150.99 140.608C150.668 142.019 150.801 143.495 151.371 144.826C151.721 145.674 152.305 146.405 153.054 146.935C153.596 147.21 153.928 147.29 153.92 147.323Z" fill="#455A64"/>
<path d="M195.512 85.0178C195.708 85.0322 195.899 85.0902 196.07 85.1874C196.556 85.3932 197.011 85.6651 197.422 85.9954C198.832 87.0877 199.766 88.6806 200.03 90.4428C200.293 92.2051 199.867 94.001 198.838 95.4571C198.539 95.8911 198.186 96.2848 197.786 96.6287C197.495 96.8711 197.317 96.9762 197.3 96.9519C197.757 96.4356 198.186 95.8962 198.587 95.3359C199.499 93.9161 199.865 92.2143 199.616 90.5459C199.368 88.8775 198.522 87.3555 197.236 86.2621C196.685 85.8145 196.11 85.399 195.512 85.0178Z" fill="#455A64"/>
<path d="M227.221 183.085C227.392 182.588 227.53 182.08 227.634 181.566C227.824 180.155 227.578 178.72 226.93 177.453C225.932 175.592 224.343 174.115 222.414 173.251C221.285 172.718 220.106 172.299 218.893 171.999C217.631 171.676 216.295 171.409 214.96 170.973C213.616 170.607 212.377 169.932 211.342 169.001C210.415 168.075 209.816 166.872 209.635 165.575C209.416 164.371 209.343 163.232 209.076 162.214C208.837 161.272 208.392 160.395 207.773 159.645C206.868 158.546 205.666 157.73 204.309 157.293C203.346 157.002 202.771 157.002 202.771 156.954C202.909 156.94 203.047 156.94 203.184 156.954C203.58 156.981 203.973 157.043 204.358 157.14C205.777 157.531 207.046 158.339 208 159.459C208.666 160.233 209.15 161.147 209.416 162.133C209.707 163.192 209.797 164.347 210.023 165.511C210.189 166.737 210.759 167.874 211.642 168.743C212.634 169.622 213.817 170.261 215.098 170.609C216.401 171.029 217.736 171.304 219.007 171.635C220.235 171.935 221.429 172.363 222.568 172.912C224.561 173.823 226.187 175.381 227.181 177.332C227.829 178.657 228.039 180.154 227.78 181.606C227.703 181.993 227.581 182.37 227.416 182.729C227.363 182.854 227.298 182.973 227.221 183.085Z" fill="#455A64"/>
<path d="M164.966 157.778C157.682 155.839 151.451 148.753 148.909 141.699C146.368 134.645 146.368 126.945 147.023 119.479C147.493 114.073 148.448 108.353 152.041 104.28C157.464 98.1397 163.372 95.0046 171.53 95.2632" fill="#263238"/>
<path d="M207.294 173.534L200.536 171.837C201.273 171.332 201.81 170.586 202.055 169.727C202.3 168.869 202.238 167.952 201.879 167.135C201.452 166.087 200.744 165.176 199.833 164.502C198.923 163.829 197.845 163.417 196.716 163.313L165.913 159.839C165.374 159.767 164.827 159.878 164.359 160.153C163.891 160.428 163.529 160.853 163.331 161.358C161.966 164.827 161.92 167.682 163.193 169.922H163.048L157.107 171.102L147.039 259.772L212.984 256.694L207.294 173.534Z" fill="#F5F5F5"/>
<path d="M197.599 172.177C197.194 172.295 196.78 172.376 196.36 172.419C195.551 172.548 194.394 172.686 192.953 172.831C185.414 173.53 177.813 173.152 170.381 171.708C168.956 171.425 167.815 171.167 167.03 170.957C166.618 170.877 166.214 170.758 165.824 170.601C166.242 170.632 166.657 170.699 167.062 170.803C167.872 170.957 169.013 171.175 170.437 171.417C177.862 172.693 185.414 173.067 192.929 172.532C194.369 172.435 195.535 172.33 196.344 172.249C196.76 172.192 197.179 172.168 197.599 172.177Z" fill="#263238"/>
<path d="M167.791 186.268C168.44 184.923 169.212 183.641 170.098 182.438C170.871 181.159 171.762 179.956 172.76 178.843C172.11 180.189 171.335 181.471 170.446 182.673C169.677 183.952 168.788 185.156 167.791 186.268Z" fill="#E0E0E0"/>
<path d="M189.043 187.771C186.986 185.662 185.135 183.363 183.516 180.903C184.594 181.911 185.575 183.017 186.445 184.208C187.425 185.309 188.295 186.502 189.043 187.771Z" fill="#E0E0E0"/>
<path d="M179.17 199.043C178.704 197.605 178.371 196.129 178.174 194.631C177.837 193.158 177.645 191.657 177.6 190.147C178.066 191.584 178.399 193.06 178.595 194.558C178.923 196.033 179.115 197.534 179.17 199.043Z" fill="#E0E0E0"/>
<path d="M195.397 199.738C194.255 201.156 193.004 202.485 191.658 203.713C190.408 205.042 189.054 206.272 187.611 207.389C188.754 205.97 190.004 204.641 191.35 203.414C192.606 202.09 193.959 200.861 195.397 199.738Z" fill="#E0E0E0"/>
<path d="M173.634 214.847C170.652 213.068 168.223 210.498 166.617 207.422C166.73 207.349 167.969 209.288 169.919 211.332C171.87 213.377 173.715 214.742 173.634 214.847Z" fill="#E0E0E0"/>
<path d="M180.627 226.515C180.627 226.636 178.781 227.226 176.645 228.365C174.508 229.504 172.946 230.7 172.865 230.595C173.884 229.506 175.101 228.621 176.451 227.985C177.734 227.23 179.153 226.731 180.627 226.515Z" fill="#E0E0E0"/>
<path d="M191.997 227.266C191.515 226.858 191.083 226.394 190.711 225.884C189.966 224.996 188.971 223.727 187.935 222.281C186.899 220.834 186.025 219.485 185.418 218.483C185.056 217.965 184.758 217.407 184.527 216.819C184.958 217.28 185.34 217.783 185.669 218.322L188.283 222.038L190.945 225.707C191.35 226.188 191.703 226.711 191.997 227.266Z" fill="#E0E0E0"/>
<path d="M193.14 237.221C191.567 237.771 189.939 238.151 188.284 238.352C186.647 238.693 184.979 238.858 183.307 238.845C184.923 238.439 186.564 238.137 188.219 237.94C189.844 237.603 191.487 237.363 193.14 237.221Z" fill="#E0E0E0"/>
<path d="M174.727 170.924C174.67 170.924 175.059 170.44 175.391 169.583C175.802 168.462 175.924 167.257 175.747 166.076C175.546 164.887 175.195 163.728 174.703 162.626C174.464 162.175 174.279 161.698 174.152 161.204C174.49 161.591 174.764 162.031 174.962 162.505C175.55 163.6 175.952 164.785 176.151 166.012C176.347 167.264 176.176 168.547 175.658 169.704C175.477 170.195 175.153 170.62 174.727 170.924Z" fill="#E0E0E0"/>
<path d="M187.045 164.283C187.622 165.076 188.035 165.976 188.258 166.931C188.482 167.885 188.513 168.875 188.348 169.842C188.227 169.842 188.211 168.557 187.846 167.03C187.482 165.503 186.956 164.347 187.045 164.283Z" fill="#E0E0E0"/>
<path d="M242.607 227.46L273.28 173.672L276.979 164.339C276.979 164.339 286.545 143.816 287.209 141.715C287.978 139.291 289.329 139.097 290.203 139.437C291.563 139.978 292 141.998 291.401 144.091C291.191 144.81 287.476 156.089 287.476 156.089C288.475 155.23 289.535 154.444 290.649 153.738C293.004 152.122 297.317 152.203 301.316 153.625C305.314 155.047 306.301 155.799 305.824 157.366C305.718 157.66 305.548 157.927 305.325 158.147C305.102 158.366 304.833 158.533 304.537 158.635C303.595 159.027 302.54 159.05 301.583 158.699C295.157 156.518 292.308 159.41 292.308 159.41L291.83 160.63C291.83 160.63 296.686 159.087 299.406 161.269C299.812 161.589 300.152 161.984 300.409 162.432C301.289 162.719 302.079 163.231 302.7 163.916C303.321 164.601 303.753 165.436 303.951 166.339C304.15 167.242 304.109 168.181 303.833 169.063C303.557 169.945 303.054 170.74 302.376 171.369C302.081 171.704 301.691 171.943 301.257 172.052C300.824 172.162 300.367 172.138 299.948 171.983C299.555 171.716 299.24 171.351 299.033 170.924C298.901 170.711 298.753 170.508 298.588 170.318L296.759 173.55C296.759 173.55 292.251 180.58 290.632 183.868L269.509 240.049C268.814 241.898 267.758 243.591 266.401 245.028C265.044 246.465 263.413 247.618 261.605 248.419C259.797 249.22 257.846 249.654 255.869 249.694C253.891 249.734 251.924 249.381 250.085 248.654C248.1 247.872 246.306 246.673 244.826 245.138C243.345 243.604 242.212 241.77 241.503 239.76C240.794 237.751 240.525 235.612 240.716 233.49C240.906 231.368 241.551 229.312 242.607 227.46Z" fill="#FFBE9D"/>
<path d="M275.393 173.486C276.477 174.197 277.974 173.712 278.946 172.872C279.917 172.031 280.564 170.876 281.503 169.963C284.231 167.24 288.787 166.981 291.401 164.129C291.765 163.733 292.089 163.127 291.774 162.691C291.458 162.254 290.875 162.335 290.39 162.432L277.837 164.913" fill="#FFBE9D"/>
<path d="M277.836 164.913C278.259 164.722 278.705 164.586 279.163 164.509C280.029 164.291 281.291 164.008 282.845 163.701L288.316 162.545L289.935 162.214C290.559 161.986 291.246 162.009 291.853 162.279C292.026 162.407 292.157 162.584 292.23 162.787C292.302 162.99 292.311 163.209 292.258 163.418C292.174 163.76 292.008 164.077 291.772 164.339C291.349 164.806 290.874 165.224 290.356 165.583C288.268 167.03 285.977 167.62 284.148 168.581C283.276 168.993 282.473 169.538 281.769 170.197C281.121 170.819 280.612 171.53 280.077 172.136C279.693 172.671 279.196 173.115 278.621 173.438C278.047 173.76 277.408 173.953 276.751 174.003C275.788 174.003 275.391 173.526 275.424 173.518C275.845 173.662 276.289 173.731 276.735 173.72C277.332 173.621 277.902 173.4 278.409 173.071C278.916 172.741 279.349 172.31 279.681 171.805C280.199 171.099 280.753 170.419 281.34 169.769C282.073 169.043 282.918 168.438 283.841 167.975C285.727 166.957 288.009 166.359 289.935 164.986C290.399 164.656 290.828 164.28 291.214 163.862C291.57 163.466 291.691 162.99 291.44 162.852C291.19 162.715 290.631 162.78 290.073 162.893L288.454 163.192L282.95 164.202C281.38 164.476 280.11 164.687 279.228 164.816C278.772 164.921 278.302 164.953 277.836 164.913Z" fill="#EB996E"/>
<path d="M291.66 160.647C291.981 159.897 292.474 159.232 293.1 158.707C293.801 158.183 294.653 157.899 295.528 157.899C296.629 157.906 297.721 158.086 298.765 158.433C299.832 158.792 300.933 159.041 302.051 159.176C302.99 159.284 303.94 159.138 304.803 158.756C305.1 158.619 305.361 158.415 305.565 158.16C305.768 157.904 305.909 157.605 305.977 157.285C306.038 157.06 306.038 156.823 305.977 156.598C305.928 156.598 305.928 156.841 305.807 157.245C305.718 157.517 305.57 157.767 305.375 157.976C305.179 158.186 304.94 158.35 304.674 158.457C303.85 158.763 302.963 158.862 302.092 158.748C301.006 158.577 299.939 158.307 298.903 157.94C297.822 157.585 296.69 157.41 295.552 157.423C294.597 157.445 293.677 157.786 292.938 158.392C292.449 158.799 292.072 159.325 291.846 159.919C291.643 160.396 291.627 160.638 291.66 160.647Z" fill="#EB996E"/>
<path d="M291.62 143.283C291.302 144.005 291.048 144.754 290.859 145.521C290.382 147.072 289.815 148.914 289.184 150.951C288.553 152.987 287.929 154.813 287.428 156.356C287.135 157.088 286.91 157.845 286.756 158.618C287.158 157.938 287.489 157.218 287.743 156.469C288.277 155.112 288.957 153.237 289.637 151.096C290.317 148.955 290.843 147.056 291.183 145.61C291.41 144.851 291.557 144.072 291.62 143.283Z" fill="#EB996E"/>
<path d="M293.393 164.024C293.64 164.059 293.89 164.059 294.137 164.024C294.448 163.971 294.766 163.985 295.07 164.066C295.375 164.147 295.658 164.293 295.901 164.493C296.042 164.641 296.142 164.823 296.192 165.021C296.241 165.219 296.239 165.427 296.185 165.624C296.054 166.12 295.861 166.598 295.61 167.046C295.286 167.608 295.179 168.269 295.311 168.904C295.421 169.241 295.609 169.547 295.859 169.798C296.109 170.049 296.415 170.238 296.751 170.351C297.083 170.456 297.433 170.492 297.78 170.457C298.126 170.423 298.462 170.318 298.767 170.149C299.333 169.86 299.799 169.406 300.102 168.848C300.54 167.927 300.84 166.947 300.992 165.939C301.11 165.263 301.11 164.571 300.992 163.895C300.967 163.641 300.868 163.399 300.709 163.2C300.668 163.2 300.774 163.458 300.814 163.919C300.849 164.578 300.792 165.239 300.644 165.882C300.452 166.838 300.137 167.764 299.705 168.638C299.442 169.13 299.023 169.521 298.513 169.75C298.004 169.98 297.433 170.035 296.889 169.906C296.622 169.82 296.379 169.673 296.18 169.477C295.98 169.28 295.83 169.04 295.74 168.775C295.634 168.247 295.723 167.699 295.991 167.232C296.242 166.743 296.433 166.224 296.557 165.688C296.611 165.432 296.599 165.166 296.521 164.916C296.443 164.665 296.302 164.439 296.112 164.258C295.831 164.036 295.501 163.882 295.15 163.809C294.799 163.736 294.435 163.746 294.089 163.838C293.848 163.862 293.613 163.925 293.393 164.024Z" fill="#EB996E"/>
<path d="M298.686 169.68C298.686 169.68 298.532 169.89 298.548 170.343C298.571 170.66 298.668 170.968 298.831 171.241C298.994 171.515 299.218 171.747 299.487 171.918C299.902 172.156 300.372 172.282 300.851 172.282C301.329 172.282 301.799 172.156 302.214 171.918C303.213 171.343 303.949 170.405 304.27 169.3C304.622 168.218 304.622 167.053 304.27 165.971C303.983 165.097 303.466 164.316 302.773 163.709C302.316 163.301 301.786 162.983 301.211 162.772C301.006 162.674 300.782 162.624 300.555 162.626C301.276 162.975 301.946 163.421 302.546 163.951C303.225 164.613 303.705 165.451 303.931 166.37C304.157 167.29 304.12 168.255 303.825 169.155C303.536 170.148 302.886 170.997 302.004 171.538C301.651 171.745 301.252 171.859 300.843 171.871C300.434 171.882 300.029 171.79 299.665 171.603C299.424 171.463 299.215 171.273 299.053 171.045C298.892 170.818 298.78 170.559 298.726 170.286C298.645 169.93 298.726 169.68 298.686 169.68Z" fill="#EB996E"/>
<path d="M288.472 174.754C288.151 174.538 287.774 174.423 287.387 174.423C286.4 174.327 285.408 174.563 284.571 175.094L284.919 175.328C285.028 174.795 285.104 174.255 285.145 173.712C285.429 170.593 284.433 168.185 284.336 168.25C284.647 170.039 284.764 171.857 284.684 173.672C284.645 174.189 284.577 174.704 284.482 175.215L284.384 175.74L284.83 175.441C285.588 174.947 286.473 174.683 287.379 174.682C288.051 174.698 288.455 174.811 288.472 174.754Z" fill="#EB996E"/>
<path d="M294.856 155.588C294.727 155.588 294.905 156.558 295.763 157.301C296.621 158.045 297.584 158.109 297.584 157.972C297.584 157.835 296.815 157.6 296.078 156.946C295.342 156.291 294.986 155.54 294.856 155.588Z" fill="#EB996E"/>
<path d="M199.096 272.094L231.186 272.409L225.804 249.163L227.609 253.55C229.272 257.601 232.105 261.066 235.747 263.505C239.389 265.944 243.675 267.246 248.06 267.246C258.209 267.246 265.226 259.707 269.516 250.528C279.552 229.068 289.223 194.51 289.223 194.51L269.661 177.348C255.498 204.093 242.193 227.315 242.193 227.315C242.193 227.315 238.348 215.655 235.378 205.248C232.408 194.841 232.432 189.379 227.876 184.192C220.859 176.209 210.88 174.229 201.588 171.837L201.24 215.017L199.096 272.094Z" fill="#90CAF9"/>
<path d="M162.376 239.976L220.81 251.288L223.651 273.702H134.058C131.605 273.732 129.173 273.251 126.917 272.29C124.661 271.33 122.631 269.91 120.956 268.122C119.28 266.333 117.996 264.216 117.187 261.905C116.377 259.593 116.059 257.139 116.252 254.698C117.539 238.36 118.939 218.241 120.008 209.733C120.817 203.099 123.488 196.239 126.62 190.341C131.144 181.84 146.222 170.949 159.438 170.383L161.939 225.949" fill="#90CAF9"/>
<g opacity="0.4">
<path d="M199.096 272.094L231.186 272.409L225.804 249.163L227.609 253.55C229.272 257.601 232.105 261.066 235.747 263.505C239.389 265.944 243.675 267.246 248.06 267.246C258.209 267.246 265.226 259.707 269.516 250.528C279.552 229.068 289.223 194.51 289.223 194.51L269.661 177.348C255.498 204.093 242.193 227.315 242.193 227.315C242.193 227.315 238.348 215.655 235.378 205.248C232.408 194.841 232.432 189.379 227.876 184.192C220.859 176.209 210.88 174.229 201.588 171.837L201.24 215.017L199.096 272.094Z" fill="black"/>
<path d="M162.376 239.976L215.08 249.624C216.154 249.822 217.145 250.334 217.927 251.095C218.709 251.856 219.248 252.831 219.475 253.898L223.651 273.75H134.058C131.605 273.781 129.173 273.3 126.917 272.339C124.661 271.378 122.631 269.958 120.956 268.17C119.28 266.382 117.996 264.264 117.187 261.953C116.377 259.642 116.059 257.187 116.252 254.746C117.539 238.408 118.939 218.289 120.008 209.781C120.817 203.147 123.488 196.287 126.62 190.389C131.144 181.889 146.222 170.997 159.438 170.431L161.939 225.998" fill="black"/>
</g>
<path d="M151.249 238.312C151.228 238.134 151.228 237.955 151.249 237.778C151.249 237.382 151.249 236.873 151.249 236.251C151.249 234.869 151.249 232.963 151.249 230.595C151.249 225.852 151.16 219.283 150.795 212.068C150.609 208.448 150.375 205.006 150.124 201.887C150.006 199.118 149.613 196.368 148.95 193.678C148.487 191.882 147.605 190.22 146.376 188.83C145.901 188.344 145.398 187.886 144.871 187.456C145.489 187.773 146.05 188.191 146.53 188.692C147.84 190.073 148.784 191.759 149.274 193.597C149.981 196.309 150.404 199.087 150.536 201.887C150.812 205.014 151.054 208.456 151.241 212.076C151.613 219.348 151.653 225.884 151.572 230.66C151.524 233.035 151.459 234.958 151.402 236.316L151.313 237.843C151.31 238.001 151.289 238.158 151.249 238.312Z" fill="#263238"/>
<path d="M219.677 252.904C219.061 252.224 218.343 251.644 217.549 251.183C216.604 250.669 215.602 250.27 214.562 249.995C213.356 249.648 211.94 249.381 210.378 249.066C204.13 247.789 195.51 246.02 185.96 244.218C176.41 242.416 167.718 240.986 161.429 239.984L153.975 238.796L151.952 238.457C151.714 238.428 151.478 238.379 151.248 238.312C151.487 238.313 151.725 238.334 151.96 238.376L154 238.635C155.764 238.869 158.322 239.225 161.47 239.693C167.775 240.63 176.475 242.02 186.033 243.806C195.591 245.592 204.211 247.402 210.435 248.743C211.997 249.082 213.413 249.373 214.627 249.745C215.678 250.042 216.687 250.471 217.63 251.021C218.235 251.363 218.782 251.799 219.248 252.314C219.373 252.442 219.486 252.58 219.588 252.726C219.645 252.823 219.685 252.904 219.677 252.904Z" fill="#263238"/>
<path d="M151.427 238.312C151.427 238.384 150.351 238.635 148.684 239.313C147.71 239.715 146.764 240.179 145.851 240.703C144.747 241.36 143.694 242.101 142.703 242.917C141.738 243.752 140.84 244.659 140.016 245.632C139.338 246.434 138.716 247.282 138.154 248.169C137.199 249.696 136.762 250.73 136.689 250.698C136.74 250.438 136.824 250.185 136.94 249.947C137.216 249.283 137.535 248.638 137.895 248.016C138.436 247.093 139.044 246.213 139.716 245.382C141.378 243.347 143.41 241.644 145.705 240.364C146.635 239.84 147.607 239.394 148.611 239.031C149.286 238.779 149.978 238.577 150.683 238.425C150.924 238.352 151.175 238.314 151.427 238.312Z" fill="#263238"/>
<path d="M226.88 252.274C226.824 252.092 226.784 251.905 226.758 251.716C226.694 251.312 226.605 250.779 226.499 250.1C226.273 248.702 225.973 246.682 225.634 244.178C224.954 239.176 224.128 232.243 223.432 224.567C222.736 216.891 222.323 209.926 222.097 204.876C221.983 202.356 221.919 200.311 221.886 198.897C221.886 198.224 221.886 197.685 221.886 197.281C221.869 197.093 221.869 196.904 221.886 196.716C221.93 196.901 221.952 197.091 221.951 197.281L222.056 198.897C222.145 200.352 222.259 202.38 222.404 204.86C222.704 209.902 223.173 216.859 223.861 224.527C224.549 232.195 225.334 239.128 225.941 244.137C226.241 246.61 226.491 248.622 226.669 250.076C226.742 250.747 226.807 251.28 226.856 251.692C226.888 251.884 226.896 252.08 226.88 252.274Z" fill="#263238"/>
<path d="M246.256 243.588C246.256 243.588 246.07 243.41 245.787 243.054C245.395 242.539 245.035 241.999 244.71 241.438C242.539 237.738 241.537 233.468 241.837 229.189C241.878 228.546 241.965 227.906 242.096 227.274C242.125 227.038 242.185 226.808 242.274 226.587C242.347 226.587 242.193 227.589 242.137 229.205C242.001 233.423 242.978 237.603 244.969 241.325C245.73 242.723 246.321 243.539 246.256 243.588Z" fill="#263238"/>
<path d="M151.015 208.286C151.015 208.286 150.909 208.327 150.715 208.351C150.423 208.398 150.128 208.427 149.833 208.44C148.747 208.485 147.66 208.398 146.596 208.181C145.014 207.864 143.471 207.382 141.99 206.743C140.315 206.048 138.535 205.127 136.673 204.23C134.931 203.356 133.126 202.611 131.275 202C129.772 201.496 128.211 201.189 126.629 201.087C125.164 201.039 123.7 201.205 122.283 201.58C122.37 201.522 122.466 201.478 122.566 201.451C122.829 201.336 123.099 201.241 123.376 201.168C124.431 200.886 125.522 200.76 126.613 200.796C128.229 200.847 129.83 201.118 131.372 201.604C133.247 202.206 135.072 202.958 136.827 203.85C138.696 204.771 140.461 205.676 142.112 206.379C143.565 207.024 145.078 207.527 146.628 207.882C148.071 208.177 149.542 208.312 151.015 208.286Z" fill="#FAFAFA"/>
<path d="M161.058 206.323C159.503 206.795 157.912 207.136 156.299 207.341C154.702 207.688 153.077 207.891 151.443 207.947C152.998 207.474 154.59 207.134 156.202 206.929C157.799 206.581 159.425 206.378 161.058 206.323Z" fill="#FAFAFA"/>
<path d="M150.65 223.662C150.277 223.872 149.884 224.043 149.476 224.172C148.708 224.47 147.583 224.874 146.182 225.327C142.521 226.5 138.784 227.423 134.997 228.09C132.78 228.478 130.651 228.761 128.709 228.955C126.986 229.177 125.245 229.223 123.513 229.092C122.338 228.997 121.194 228.671 120.146 228.131C119.861 227.983 119.59 227.81 119.337 227.614C119.243 227.55 119.159 227.474 119.086 227.387C119.086 227.387 119.474 227.638 120.211 227.985C121.26 228.458 122.388 228.732 123.537 228.793C125.248 228.882 126.964 228.806 128.66 228.567C130.595 228.349 132.707 228.058 134.916 227.67C138.685 227.003 142.414 226.126 146.085 225.044C147.494 224.624 148.627 224.236 149.412 224.018C149.815 223.869 150.229 223.75 150.65 223.662Z" fill="#FAFAFA"/>
<path d="M160.79 227.921C159.332 228.152 157.856 228.247 156.38 228.203C154.908 228.296 153.431 228.25 151.969 228.066C153.427 227.835 154.904 227.74 156.38 227.783C157.851 227.691 159.328 227.737 160.79 227.921Z" fill="#FAFAFA"/>
<path d="M119.143 264.733C119.152 264.584 119.182 264.437 119.232 264.297C119.313 263.974 119.426 263.578 119.555 263.085L119.798 262.212C119.903 261.897 120.041 261.566 120.17 261.202C120.461 260.377 120.796 259.568 121.174 258.778L121.83 257.396C122.064 256.912 122.364 256.443 122.639 255.942C123.249 254.883 123.914 253.855 124.63 252.864C127.936 248.3 132.247 244.554 137.231 241.915C138.315 241.343 139.428 240.828 140.566 240.372C141.108 240.17 141.61 239.936 142.12 239.774L143.584 239.313C144.424 239.046 145.278 238.828 146.142 238.659C146.522 238.578 146.87 238.489 147.194 238.433L148.101 238.312L149.347 238.158C149.492 238.137 149.639 238.137 149.784 238.158C149.646 238.211 149.502 238.246 149.355 238.263L148.125 238.497L147.235 238.651L146.19 238.909C145.446 239.111 144.572 239.281 143.673 239.62L142.233 240.105C141.731 240.275 141.229 240.509 140.703 240.719C139.582 241.184 138.486 241.704 137.417 242.279C134.984 243.623 132.692 245.209 130.578 247.014C128.491 248.853 126.593 250.897 124.913 253.114C124.185 254.164 123.464 255.15 122.914 256.144C122.631 256.637 122.331 257.098 122.105 257.574L121.425 258.932C120.964 259.788 120.68 260.612 120.373 261.356C120.235 261.711 120.089 262.042 119.976 262.35L119.693 263.206L119.296 264.394C119.258 264.512 119.206 264.626 119.143 264.733Z" fill="#FAFAFA"/>
<path d="M159.73 239.911C158.377 241.085 157.252 242.499 156.412 244.081C155.529 245.81 154.902 247.658 154.55 249.567C154.132 251.915 153.862 254.287 153.741 256.669C153.64 259.069 153.37 261.458 152.932 263.82C152.535 265.756 151.851 267.622 150.9 269.355C150.266 270.517 149.446 271.567 148.472 272.466C148.207 272.711 147.923 272.935 147.623 273.136C147.42 273.274 147.307 273.346 147.299 273.33C148.677 272.182 149.825 270.784 150.682 269.209C151.579 267.49 152.222 265.65 152.592 263.747C153.023 261.401 153.293 259.028 153.401 256.645C153.506 254.243 153.777 251.851 154.211 249.486C154.587 247.55 155.253 245.682 156.185 243.943C156.821 242.771 157.641 241.707 158.613 240.792C158.868 240.548 159.138 240.322 159.423 240.113C159.516 240.033 159.619 239.965 159.73 239.911Z" fill="#FAFAFA"/>
<path d="M173.545 273.839C173.432 273.839 173.545 266.874 173.845 258.293C174.144 249.712 174.452 242.756 174.565 242.756C174.678 242.756 174.565 249.72 174.265 258.31C173.966 266.899 173.658 273.847 173.545 273.839Z" fill="#FAFAFA"/>
<path d="M195.511 272.643C195.359 272.32 195.24 271.981 195.155 271.633C195.024 271.235 194.913 270.831 194.823 270.421C194.718 269.945 194.572 269.403 194.483 268.805C194.232 267.38 194.088 265.938 194.054 264.491C193.975 260.935 194.523 257.393 195.673 254.027C196.142 252.656 196.713 251.322 197.381 250.036C197.648 249.478 197.947 249.009 198.19 248.589C198.396 248.223 198.623 247.87 198.87 247.531C199.05 247.222 199.265 246.935 199.509 246.674C199.582 246.715 198.7 247.967 197.64 250.173C197.011 251.46 196.47 252.788 196.021 254.148C194.912 257.48 194.366 260.972 194.402 264.483C194.421 265.913 194.532 267.341 194.734 268.757C195.139 271.165 195.592 272.619 195.511 272.643Z" fill="#FAFAFA"/>
<path d="M158.209 183.343C158.209 183.408 156.93 182.85 154.826 182.172C149.345 180.405 143.536 179.892 137.83 180.669C135.645 180.968 134.309 181.307 134.293 181.234C134.583 181.095 134.891 180.994 135.208 180.935C136.054 180.702 136.914 180.516 137.781 180.378C143.531 179.424 149.429 179.944 154.923 181.889C155.748 182.18 156.559 182.511 157.351 182.883C157.655 183 157.943 183.155 158.209 183.343Z" fill="#FAFAFA"/>
<path d="M222.146 217.352C221.145 217.404 220.142 217.388 219.143 217.304C217.29 217.231 214.733 217.134 211.908 217.069C209.083 217.005 206.526 216.964 204.673 216.948C203.67 216.98 202.667 216.945 201.67 216.843C201.935 216.78 202.207 216.748 202.479 216.746C202.997 216.746 203.75 216.673 204.681 216.649C206.534 216.592 209.092 216.576 211.924 216.649C214.757 216.722 217.314 216.867 219.208 217.021C220.131 217.093 220.875 217.158 221.393 217.223C221.648 217.239 221.901 217.282 222.146 217.352Z" fill="#FAFAFA"/>
<path d="M238.123 214.29C238.123 214.362 237.111 214.71 235.533 215.486C231.405 217.513 227.908 220.625 225.417 224.487C224.462 225.965 224 226.951 223.936 226.911C223.981 226.655 224.068 226.41 224.195 226.183C224.478 225.541 224.802 224.918 225.166 224.317C226.353 222.319 227.844 220.517 229.585 218.976C231.321 217.43 233.283 216.158 235.404 215.203C236.044 214.915 236.7 214.667 237.37 214.459C237.613 214.37 237.866 214.313 238.123 214.29Z" fill="#FAFAFA"/>
<path d="M230.24 188.393C228.846 188.346 227.455 188.54 226.128 188.967C224.696 189.466 223.307 190.082 221.976 190.809C220.333 191.718 218.617 192.489 216.845 193.112C213.57 194.16 210.087 194.384 206.704 193.766C205.688 193.582 204.689 193.312 203.718 192.958C203.355 192.845 203.005 192.693 202.674 192.506C202.674 192.425 204.195 193.064 206.72 193.476C210.056 193.996 213.467 193.733 216.683 192.708C218.435 192.089 220.137 191.338 221.774 190.462C223.129 189.744 224.545 189.149 226.007 188.684C227.001 188.369 228.04 188.219 229.082 188.24C229.354 188.248 229.624 188.275 229.892 188.321C230.143 188.353 230.248 188.377 230.24 188.393Z" fill="#FAFAFA"/>
<path d="M226.201 242.545C225.907 242.732 225.592 242.881 225.262 242.99C224.954 243.119 224.574 243.273 224.121 243.418C223.668 243.564 223.158 243.757 222.583 243.903C221.228 244.28 219.849 244.566 218.455 244.759C216.749 244.98 215.028 245.069 213.308 245.026C211.588 244.962 209.876 244.77 208.185 244.452C206.813 244.175 205.46 243.806 204.138 243.345C203.564 243.168 203.07 242.949 202.633 242.772C202.196 242.594 201.824 242.424 201.516 242.279C201.194 242.145 200.888 241.977 200.602 241.778C200.602 241.705 201.969 242.352 204.235 243.063C205.562 243.479 206.914 243.814 208.282 244.064C211.63 244.683 215.052 244.787 218.431 244.372C219.811 244.202 221.178 243.949 222.526 243.612C224.809 243.03 226.176 242.473 226.201 242.545Z" fill="#FAFAFA"/>
<path d="M244.8 266.462C244.684 266.389 244.578 266.303 244.484 266.204C244.298 266.018 243.991 265.767 243.675 265.396C242.698 264.352 241.84 263.203 241.117 261.97C238.782 257.838 237.54 253.18 237.508 248.436C237.513 243.725 238.131 239.034 239.345 234.482C239.782 232.736 240.154 231.33 240.454 230.369C240.591 229.924 240.705 229.561 240.794 229.262C240.883 228.963 240.923 228.874 240.939 228.882C240.938 229.017 240.916 229.15 240.875 229.278C240.81 229.585 240.721 229.957 240.616 230.409C240.373 231.452 240.041 232.833 239.636 234.554C238.519 239.092 237.951 243.747 237.945 248.42C237.971 253.088 239.141 257.679 241.352 261.792C242.046 263.024 242.859 264.185 243.78 265.258C244.42 266.034 244.824 266.43 244.8 266.462Z" fill="#FAFAFA"/>
<path d="M274.25 239.023C272.957 237.999 271.513 237.181 269.969 236.599C268.28 236.015 266.548 235.564 264.789 235.249C262.604 234.881 260.442 234.388 258.314 233.771C254.472 232.523 250.965 230.417 248.06 227.614C247.184 226.768 246.372 225.857 245.632 224.891C245.365 224.551 245.187 224.268 245.057 224.083C244.928 223.897 244.871 223.792 244.887 223.784C245.2 224.098 245.492 224.433 245.762 224.786C246.538 225.708 247.374 226.58 248.262 227.395C251.18 230.098 254.651 232.136 258.436 233.367C260.542 233.98 262.679 234.482 264.838 234.869C266.611 235.209 268.355 235.693 270.05 236.316C271.195 236.748 272.269 237.347 273.238 238.093C273.503 238.292 273.752 238.511 273.983 238.748C274.185 238.926 274.266 239.014 274.25 239.023Z" fill="#FAFAFA"/>
<path d="M283.51 212.06C283.198 211.837 282.908 211.585 282.644 211.308C282.377 211.058 282.053 210.751 281.648 210.411C281.244 210.072 280.839 209.668 280.289 209.28C279.093 208.317 277.839 207.429 276.533 206.622C273.331 204.644 269.85 203.157 266.206 202.21C264.717 201.827 263.206 201.533 261.682 201.329C261.035 201.224 260.444 201.184 259.926 201.135C259.408 201.087 258.955 201.047 258.59 201.03C258.208 201.029 257.826 200.994 257.449 200.925C257.827 200.867 258.209 200.848 258.59 200.869C259.041 200.846 259.492 200.846 259.942 200.869C260.46 200.869 261.067 200.909 261.722 200.998C263.263 201.166 264.791 201.436 266.295 201.806C268.139 202.278 269.946 202.883 271.702 203.616C273.443 204.374 275.126 205.26 276.736 206.266C278.045 207.1 279.297 208.021 280.483 209.022C281.001 209.434 281.422 209.83 281.81 210.217C282.142 210.519 282.458 210.837 282.757 211.171C283.039 211.439 283.291 211.737 283.51 212.06Z" fill="#FAFAFA"/>
<path d="M212.694 174.972C212.218 175.289 211.701 175.536 211.156 175.708C209.879 176.208 208.567 176.613 207.231 176.92C205.899 177.233 204.547 177.449 203.184 177.566C202.621 177.651 202.048 177.651 201.484 177.566C201.484 177.437 204.05 177.227 207.15 176.491C210.249 175.756 212.645 174.851 212.694 174.972Z" fill="#FAFAFA"/>
<path d="M241.401 288.771C241.506 289.132 241.519 289.513 241.439 289.879C241.358 290.246 241.187 290.587 240.941 290.871C240.694 291.154 240.381 291.372 240.028 291.504C239.676 291.635 239.296 291.676 238.924 291.623C238.492 291.562 238.088 291.377 237.76 291.09C237.433 290.803 237.196 290.427 237.079 290.007L236.391 287.47H236.496C236.566 287.837 236.548 288.214 236.443 288.572C236.338 288.93 236.149 289.258 235.892 289.529C235.636 289.8 235.318 290.006 234.965 290.13C234.613 290.253 234.236 290.292 233.866 290.242C232.806 290.242 231.891 288.698 231.583 287.882C230.783 287.96 229.977 287.817 229.252 287.47C228.527 287.122 227.912 286.583 227.472 285.911L222.721 278.51L213.924 272.086L219.249 253.106L238.18 265.339C238.924 265.921 239.037 266.147 240.219 267.254L252.44 278.477C251.056 279.285 249.882 279.245 247.956 278.477C246.03 277.71 237.597 272.013 237.597 272.013L241.401 288.698" fill="#FFBE9D"/>
<path d="M225.206 273.161C225.206 273.161 225.425 273.258 225.765 273.492L226.396 273.928C226.696 274.116 226.968 274.344 227.205 274.607C227.486 274.928 227.705 275.298 227.853 275.698C227.998 276.126 228.152 276.562 228.314 277.023L229.35 280.061C230.07 282.226 230.702 284.182 231.139 285.612C231.415 286.37 231.624 287.152 231.762 287.947C231.394 287.226 231.091 286.475 230.855 285.701C230.345 284.295 229.666 282.356 228.945 280.198C228.597 279.124 228.257 278.097 227.942 277.152C227.796 276.683 227.658 276.239 227.521 275.819C227.4 275.449 227.216 275.102 226.979 274.793C226.774 274.54 226.54 274.313 226.283 274.114L225.7 273.621C225.352 273.346 225.19 273.185 225.206 273.161Z" fill="#EB996E"/>
<path d="M236.593 287.907C236.473 287.649 236.383 287.377 236.326 287.099L235.719 284.933C235.201 283.107 234.513 280.578 233.631 277.823C232.749 275.067 231.826 272.611 230.717 271.092C230.304 270.485 229.779 269.962 229.172 269.549C228.727 269.274 228.443 269.193 228.451 269.145C228.526 269.143 228.601 269.157 228.67 269.185C228.871 269.237 229.067 269.31 229.253 269.403C229.925 269.778 230.507 270.293 230.96 270.914C232.166 272.45 233.137 274.954 234.028 277.693C234.918 280.433 235.565 283.01 236.002 284.86C236.221 285.782 236.383 286.533 236.488 287.058C236.566 287.334 236.601 287.62 236.593 287.907Z" fill="#EB996E"/>
<path d="M241.481 289.054C241.335 288.786 241.223 288.501 241.149 288.206C240.947 287.559 240.696 286.775 240.397 285.846C239.781 283.85 238.964 281.087 238.082 278.033C237.2 274.979 236.463 272.296 235.856 270.195C235.647 269.417 235.193 268.726 234.561 268.224C234.305 268.059 234.034 267.918 233.752 267.804C233.832 267.784 233.915 267.784 233.995 267.804C234.222 267.854 234.438 267.945 234.634 268.07C235.341 268.555 235.863 269.264 236.115 270.082C236.779 272.078 237.564 274.841 238.462 277.895C239.361 280.95 240.121 283.737 240.664 285.749C240.906 286.686 241.117 287.486 241.279 288.173C241.377 288.459 241.445 288.754 241.481 289.054Z" fill="#EB996E"/>
<path d="M356.488 113.839C356.488 114.398 356.654 114.945 356.966 115.41C357.277 115.875 357.719 116.238 358.237 116.452C358.755 116.666 359.324 116.722 359.874 116.613C360.423 116.504 360.928 116.234 361.324 115.839C361.72 115.443 361.99 114.939 362.099 114.391C362.208 113.842 362.152 113.274 361.938 112.757C361.724 112.24 361.361 111.798 360.895 111.488C360.429 111.177 359.881 111.011 359.321 111.011C358.57 111.011 357.849 111.309 357.318 111.839C356.787 112.37 356.488 113.089 356.488 113.839Z" fill="#455A64"/>
<path d="M347.981 116.667C349.546 116.667 350.814 115.401 350.814 113.839C350.814 112.277 349.546 111.011 347.981 111.011C346.417 111.011 345.148 112.277 345.148 113.839C345.148 115.401 346.417 116.667 347.981 116.667Z" fill="#455A64"/>
<path d="M333.843 112.425C333.563 112.909 333.432 113.466 333.469 114.024C333.505 114.582 333.707 115.117 334.048 115.561C334.389 116.005 334.854 116.338 335.384 116.518C335.915 116.698 336.487 116.717 337.028 116.572C337.57 116.427 338.056 116.126 338.425 115.705C338.795 115.284 339.031 114.764 339.104 114.209C339.177 113.655 339.084 113.091 338.836 112.589C338.588 112.088 338.197 111.671 337.712 111.391C337.39 111.204 337.034 111.083 336.665 111.034C336.296 110.985 335.921 111.009 335.562 111.105C335.202 111.201 334.866 111.367 334.571 111.594C334.276 111.82 334.028 112.103 333.843 112.425Z" fill="#455A64"/>
<path d="M347.804 80.8C347.615 80.7858 347.426 80.7858 347.237 80.8L345.554 80.8485C345.181 80.8485 344.744 80.8485 344.307 80.905L342.826 81.1151L341.094 81.3656L339.152 81.8423C335.824 82.667 332.656 84.0318 329.772 85.8823C325.506 88.5938 321.918 92.2427 319.281 96.5502C316.644 100.858 315.028 105.71 314.556 110.736C314.429 112.244 314.399 113.758 314.467 115.269C314.524 116.029 314.508 116.813 314.621 117.58C314.734 118.348 314.856 119.132 314.969 119.915C315.562 123.126 316.625 126.233 318.125 129.135C319.723 132.175 321.754 134.967 324.155 137.425C326.713 139.936 329.645 142.038 332.847 143.654C336.16 145.347 339.747 146.441 343.441 146.886C344.377 147.026 345.32 147.104 346.266 147.121C347.216 147.192 348.17 147.211 349.123 147.177C351.044 147.098 352.956 146.857 354.837 146.458C358.897 145.58 362.759 143.955 366.224 141.667L365.884 141.707L377.482 146.353L378.17 146.628L377.975 145.917L374.56 133.538L374.503 133.837C377.652 129.675 379.773 124.831 380.695 119.697C381.139 117.3 381.291 114.858 381.148 112.425C381.12 111.258 381.01 110.094 380.816 108.943C380.73 108.372 380.641 107.806 380.549 107.246C380.452 106.688 380.282 106.147 380.144 105.63C378.201 98.0174 373.612 91.3421 367.195 86.7954C364.827 85.103 362.237 83.7436 359.498 82.7554L357.758 82.1332L356.14 81.713L354.634 81.3414C354.149 81.2525 353.679 81.204 353.242 81.1313C352.368 81.0262 351.624 80.8727 350.919 80.8404L349.22 80.7838H348.176C348.057 80.7751 347.938 80.7751 347.82 80.7838C347.935 80.8204 348.055 80.8368 348.176 80.8323L349.212 80.9212L350.903 81.0343C351.575 81.0828 352.336 81.2525 353.21 81.3818C359.506 82.4738 365.348 85.3669 370.029 89.71C374.71 94.053 378.027 99.6592 379.578 105.848C379.699 106.381 379.869 106.915 379.966 107.464C380.064 108.013 380.128 108.563 380.217 109.128C380.403 110.259 380.505 111.401 380.525 112.546C380.652 114.924 380.495 117.308 380.055 119.649C379.116 124.67 377.012 129.401 373.913 133.465L373.807 133.603L373.856 133.772C374.935 137.769 376.063 141.898 377.239 146.159L377.733 145.723L366.135 141.061L365.957 140.988L365.787 141.093C360.813 144.383 355.028 146.245 349.066 146.474C348.135 146.507 347.203 146.491 346.274 146.426C345.35 146.409 344.428 146.331 343.514 146.191C339.902 145.755 336.395 144.686 333.155 143.032C330.022 141.45 327.151 139.398 324.64 136.948C322.286 134.553 320.291 131.832 318.716 128.868C317.255 126.02 316.219 122.974 315.641 119.826C315.519 119.018 315.398 118.299 315.285 117.54C315.171 116.78 315.187 116.021 315.131 115.269C315.055 113.788 315.076 112.304 315.195 110.825C315.636 105.878 317.2 101.095 319.767 96.841C322.335 92.5865 325.839 88.9715 330.014 86.2702C332.849 84.3985 335.967 82.9961 339.249 82.117L341.159 81.608L342.875 81.3252L344.348 81.0828C344.801 81.0343 345.214 81.0182 345.578 80.9939L347.253 80.8727C347.439 80.8678 347.623 80.8434 347.804 80.8Z" fill="#455A64"/>
</svg>
