[
  {
    "_id": "3d6ca3a1-c93f-48ff-8bc7-08a686adcefb",
    "name": "(Local Env)",
    "default": false,
    "global": true,
    "local": true,
    "sortNum": -1,
    "created": "2022-10-27T11:59:36.862Z",
    "modified": "2022-10-27T11:59:36.862Z",
    "data": []
  },
  {
    "_id": "a7315d5b-c8ca-49c2-86e5-dfae8f4f83c6",
    "name": "(Global Env)",
    "default": false,
    "global": true,
    "sortNum": -2,
    "created": "2022-10-27T13:41:55.850Z",
    "modified": "2022-11-07T15:40:30.203Z",
    "data": [
      {
        "name": "CARL_API_ORIGIN",
        "value": "silab"
      },
      {
        "name": "CARL_API_ENTITY_ENDPOINT",
        "value": "/entities/v1"
      },
      {
        "name": "CARL_API_AUTH_ENDPOINT",
        "value": "/auth/v1"
      }
    ],
    "envFile": "../.env.test.local"
  }
]