{
    "_id": "3d6ca3a1-c93f-48ff-8bc7-08a686adcefb",
    "name": "(Local Env)",
    "default": false,
    "global": true,
    "local": true,
    "sortNum": -1,
    "created": "2022-10-27T11:59:36.862Z",
    "modified": "2022-10-27T11:59:36.862Z",
    "data": []
}