{
    "name": "osinum-diag/images-carousel",
    "title": "Carousel images",
    "category": "formatting",
    "icon": "admin-comments",
    "apiVersion": 2,
    "keywords": [
        "carousel",
        "images"
    ],
    "acf": {
        "mode": "preview",
        "renderTemplate": "images-carousel.php"
    },
    "attributes": {
        "post_type": {
            "type": "string",
            "default": "post"
        }
    }
}