<?xml version="1.0" encoding="UTF-8"?>
<svg width="15" height="15" viewBox="0 0 15 15" xmlns="http://www.w3.org/2000/svg" id="basketball">
  <path stroke="param(stroke) none" stroke-width="param(stroke-width) 0"
     style="fill:param(fill);fill-opacity:param(fill-opacity);" d="M3.66001 7H2.03C2.11012 6.02077 2.45969 5.05281 3.04001 4.26C3.39039 5.12432 3.59972 6.0693 3.66001 7ZM4.73501 7H7V2C5.78985 2.1061 4.72468 2.61284 3.83501 3.44C4.36491 4.54578 4.67079 5.77549 4.73501 7ZM8 2V7H10.265C10.3292 5.77549 10.6351 4.54578 11.165 3.44C10.2753 2.61284 9.21014 2.1061 8 2ZM11.96 4.26C11.6096 5.12432 11.4003 6.0693 11.34 7H12.97C12.8899 6.02077 12.5403 5.05281 11.96 4.26ZM14 8.49919C14 8.77489 13.7765 8.99838 13.5008 8.99838H11.72L10.96 10.5184V12.8984C10.9578 12.9736 10.934 13.0466 10.8915 13.1087C10.8489 13.1707 10.7894 13.2192 10.72 13.2484C10.6743 13.2607 10.6273 13.2674 10.58 13.2684C10.5312 13.2706 10.4825 13.2619 10.4375 13.2428C10.3925 13.2238 10.3524 13.195 10.32 13.1584L9.3 12.1484L7.71 13.2084C7.64698 13.2476 7.57423 13.2684 7.5 13.2684C7.42577 13.2684 7.35303 13.2476 7.29 13.2084L5.7 12.1484L4.68 13.1584C4.62956 13.211 4.56471 13.2477 4.49357 13.2637C4.42243 13.2797 4.34814 13.2744 4.28 13.2484C4.21063 13.2192 4.1511 13.1707 4.10854 13.1087C4.06599 13.0466 4.04219 12.9736 4.04 12.8984V10.5184L3.28 8.99838H1.49919C1.2235 8.99838 1 8.77489 1 8.4992C0.999998 8.2235 1.22349 8 1.49919 8H13.5008C13.7765 8 14 8.2235 14 8.49919ZM6.86 8.99838H4.12L4.75 10.2684C4.7772 10.3173 4.791 10.3725 4.79 10.4284V11.9884L5.35 11.4384L6.86 8.99838ZM8.84 11.5484L7.5 9.38838L6.16 11.5484L7.5 12.4484L8.84 11.5484ZM10.89 8.99838H8.14L9.65 11.4384L10.21 11.9884V10.4284C10.209 10.3725 10.2228 10.3173 10.25 10.2684L10.89 8.99838Z"/>
</svg>