<?xml version="1.0" encoding="UTF-8"?>
<svg width="15" height="15" viewBox="0 0 15 15" xmlns="http://www.w3.org/2000/svg" id="marker-stroked">
  <path stroke="param(stroke) none" stroke-width="param(stroke-width) 0"
     style="fill:param(fill);fill-opacity:param(fill-opacity);" d="M5.11697 2.81756C5.76952 2.26561 6.65195 2 7.5 2C8.34805 2 9.23048 2.26561 9.88303 2.81756C10.5075 3.34579 11 4.20017 11 5.56759C11 5.94031 10.8461 6.52407 10.5105 7.29145C10.1859 8.03354 9.73523 8.85087 9.24257 9.65811C8.64175 10.6426 7.999 11.5793 7.48195 12.3097C6.96023 11.5798 6.31599 10.6233 5.71947 9.62296C5.2343 8.80934 4.79303 7.98717 4.47608 7.24844C4.14708 6.48162 4 5.91216 4 5.56759C4 4.20017 4.49248 3.34579 5.11697 2.81756ZM8.10767 13.1554C9.45904 11.2632 12 7.54181 12 5.56759C12 2.2883 9.57688 1 7.5 1C5.42312 1 3 2.2883 3 5.56759C3 7.44926 5.47533 11.2572 6.86751 13.1671C7.12165 13.5157 7.3397 13.8011 7.5 14C7.55627 13.9215 7.62241 13.8299 7.697 13.7266C7.81469 13.5636 7.95343 13.3714 8.10767 13.1554Z"/>
</svg>