<?xml version="1.0" encoding="UTF-8"?>
<svg height="15" viewBox="0 0 15 15" width="15" xmlns="http://www.w3.org/2000/svg" id="fuel">
  <path stroke="param(stroke) none" stroke-width="param(stroke-width) 0"
     style="fill:param(fill);fill-opacity:param(fill-opacity);" d="m14 6v5.5c0 .2761-.2239.5-.5.5s-.5-.2239-.5-.5v-2c0-.8284-.6716-1.5-1.5-1.5h-1.5v-6c0-.5523-.4477-1-1-1h-6c-.5523 0-1 .4477-1 1v11c0 .5523.4477 1 1 1h6c.5523 0 1-.4477 1-1v-4h1.5c.2761 0 .5.2239.5.5v2c0 .8284.6716 1.5 1.5 1.5s1.5-.6716 1.5-1.5v-6.5c0-.5523-.4477-1-1-1v-1.51c-.0054-.2722-.2277-.4901-.5-.49-.2816.0047-.5062.2367-.5015.5184.0002.0105.0007.0211.0015.0316v2.45c0 .5523.4477 1 1 1s1-.4477 1-1-.4477-1-1-1zm-5 .5c0 .2761-.2239.5-.5.5h-5c-.2761 0-.5-.2239-.5-.5v-3c0-.2761.2239-.5.5-.5h5c.2761 0 .5.2239.5.5z"/>
</svg>