<?xml version="1.0" encoding="UTF-8"?>
<svg height="15" viewBox="0 0 15 15" width="15" xmlns="http://www.w3.org/2000/svg" id="barrier">
  <path stroke="param(stroke) none" stroke-width="param(stroke-width) 0"
     style="fill:param(fill);fill-opacity:param(fill-opacity);" d="m13 2h-11c-.26522 0-.51957.10536-.70711.29289-.18753.18754-.29289.44189-.29289.70711v6c0 .26522.10536.51957.29289.70711.18754.18753.44189.29289.70711.29289h1v2.5c0 .1326.05268.2598.14645.3536.09376.0937.22094.1464.35355.1464s.25979-.0527.35355-.1464c.09377-.0938.14645-.221.14645-.3536v-.5h7v.5c0 .1326.0527.2598.1464.3536.0938.0937.221.1464.3536.1464s.2598-.0527.3536-.1464c.0937-.0938.1464-.221.1464-.3536v-2.5h1c.2652 0 .5196-.10536.7071-.29289.1875-.18754.2929-.44189.2929-.70711v-6c0-.26522-.1054-.51957-.2929-.70711-.1875-.18753-.4419-.29289-.7071-.29289zm0 1v2l-2-2zm-3.5 0 3.5 3.5v2.5l-6-6zm-4 6-3.5-3.5v-2.5l6 6zm-3.5 0v-2l2 2zm9 2h-7v-1h7zm-.207-2h-1.293l-6-6h2l6 6z"/>
</svg>