<?xml version="1.0" encoding="UTF-8"?>
<svg width="14" height="14" version="1.0" viewBox="0 0 14 14" xmlns="http://www.w3.org/2000/svg" xmlns:cc="http://creativecommons.org/ns#" xmlns:dc="http://purl.org/dc/elements/1.1/" xmlns:rdf="http://www.w3.org/1999/02/22-rdf-syntax-ns#">
 <metadata>
  <rdf:RDF>
   <cc:Work>
    <dc:format>image/svg+xml</dc:format>
    <dc:type rdf:resource="http://purl.org/dc/dcmitype/StillImage"/>
    <dc:title/>
    <cc:license rdf:resource="http://creativecommons.org/publicdomain/zero/1.0/"/>
   </cc:Work>
   <cc:License rdf:about="http://creativecommons.org/publicdomain/zero/1.0/">
    <cc:permits rdf:resource="http://creativecommons.org/ns#Reproduction"/>
    <cc:permits rdf:resource="http://creativecommons.org/ns#Distribution"/>
    <cc:permits rdf:resource="http://creativecommons.org/ns#DerivativeWorks"/>
   </cc:License>
  </rdf:RDF>
 </metadata>
 <rect id="canvas" width="14" height="14" fill="none" visibility="hidden"/>
 <path d="m6 0h2c2 0 3 0 3 1v1h-8v-1c0-1 1-1 3-1zm-2 3c-1e-7 2-2.0219 1-2.0156 3l0.015625 5c0.00312 1 1 3 3 3h4c2 0 3-2 3-3v-5c0-2-2-1-2-3zm6 4v3h-6v-3z"
 style="fill:param(fill);fill-opacity:1;" stroke="param(stroke) none" stroke-width="param(stroke-width) 0"/>
</svg>
