<?xml version="1.0" encoding="utf-8"?>
<!-- Generator: Adobe Illustrator 25.0.1, SVG Export Plug-In . SVG Version: 6.00 Build 0)  -->
<svg version="1.1" id="Calque_1" xmlns="http://www.w3.org/2000/svg" xmlns:xlink="http://www.w3.org/1999/xlink" x="0px" y="0px"
	 viewBox="0 0 100 100" style="enable-background:new 0 0 100 100;" xml:space="preserve">
<style type="text/css">
	.st0{fill:#187CC6;}
</style>
<g>
	<g>
		<path class="st0" d="M50,0.63L9.61,18.58v26.93c0,24.91,17.23,48.2,40.39,53.86c23.16-5.66,40.39-28.95,40.39-53.86V18.58L50,0.63
			z M81.42,45.51c0,8.3-2.29,16.38-6.19,23.38l-6.51-6.51c5.79-8.71,4.8-20.56-2.87-28.23c-8.75-8.75-22.98-8.75-31.73,0
			s-8.75,22.98,0,31.73c7.67,7.67,19.52,8.62,28.23,2.87l7.72,7.72C64.72,82.85,57.81,87.75,50,90.13
			C31.96,84.51,18.58,65.8,18.58,45.51V24.42L50,10.46l31.42,13.96V45.51z M50,63.46c-7.45,0-13.46-6.01-13.46-13.46
			S42.55,36.54,50,36.54S63.46,42.55,63.46,50S57.45,63.46,50,63.46z"/>
	</g>
</g>
</svg>
