<?xml version="1.0" encoding="utf-8"?>
<!-- Generator: Adobe Illustrator 25.0.1, SVG Export Plug-In . SVG Version: 6.00 Build 0)  -->
<svg version="1.1" id="Calque_1" xmlns="http://www.w3.org/2000/svg" xmlns:xlink="http://www.w3.org/1999/xlink" x="0px" y="0px"
	 viewBox="0 0 100 100" style="enable-background:new 0 0 100 100;" xml:space="preserve">
<style type="text/css">
	.st0{fill:none;}
	.st1{fill:#020203;}
</style>
<g>
	<path class="st0" d="M-11.04-11.04h122.07v122.07H-11.04V-11.04z"/>
	<path class="st1" d="M86.32,54.78c0.2-1.53,0.31-3.1,0.31-4.78c0-1.63-0.1-3.26-0.36-4.78l10.33-8.04c0.92-0.71,1.17-2.09,0.61-3.1
		l-9.77-16.89c-0.61-1.12-1.88-1.48-3-1.12l-12.16,4.88c-2.54-1.93-5.24-3.56-8.24-4.78L62.21,3.26c-0.2-1.22-1.22-2.09-2.44-2.09
		H40.23c-1.22,0-2.19,0.86-2.39,2.09l-1.83,12.92c-3,1.22-5.75,2.9-8.24,4.78l-12.16-4.88c-1.12-0.41-2.39,0-3,1.12L2.9,34.08
		c-0.61,1.07-0.41,2.39,0.61,3.1l10.33,8.04c-0.25,1.53-0.46,3.2-0.46,4.78s0.1,3.26,0.36,4.78L3.41,62.82
		c-0.92,0.71-1.17,2.09-0.61,3.1l9.77,16.89c0.61,1.12,1.88,1.48,3,1.12l12.16-4.88c2.54,1.93,5.24,3.56,8.24,4.78l1.83,12.92
		c0.25,1.22,1.22,2.09,2.44,2.09h19.53c1.22,0,2.24-0.86,2.39-2.09l1.83-12.92c3-1.22,5.75-2.85,8.24-4.78l12.16,4.88
		c1.12,0.41,2.39,0,3-1.12l9.77-16.89c0.61-1.12,0.36-2.39-0.61-3.1L86.32,54.78z M50,68.31c-10.07,0-18.31-8.24-18.31-18.31
		S39.93,31.69,50,31.69S68.31,39.93,68.31,50S60.07,68.31,50,68.31z"/>
</g>
</svg>
