<?xml version="1.0" encoding="utf-8"?>
<!-- Generator: Adobe Illustrator 25.0.1, SVG Export Plug-In . SVG Version: 6.00 Build 0)  -->
<svg version="1.1" id="Calque_1" xmlns="http://www.w3.org/2000/svg" xmlns:xlink="http://www.w3.org/1999/xlink" x="0px" y="0px"
	 viewBox="0 0 100 100" style="enable-background:new 0 0 100 100;" xml:space="preserve">
<style type="text/css">
	.st0{fill:#187CC6;}
</style>
<path class="st0" d="M59.85,0.77H20.46c-5.42,0-9.8,4.43-9.8,9.85l-0.05,78.77c0,5.42,4.38,9.85,9.8,9.85h59.13
	c5.42,0,9.85-4.43,9.85-9.85V30.31L59.85,0.77z M20.46,89.39V10.61h34.46v24.62h24.62v54.16H20.46z"/>
</svg>
