<svg width="50" height="50" viewBox="0 0 50 50" fill="none" xmlns="http://www.w3.org/2000/svg">
<path fill-rule="evenodd" clip-rule="evenodd" d="M26.5875 19.3412L26.3217 17.6488C25.121 10.0031 18.5687 4.1698 10.6792 4.1698H4.02516C2.90669 4.1698 2 5.07649 2 6.19496V10.5346C2 19.384 9.09983 26.543 17.8396 26.543H23.4811V45.8302H26.5189V33.7757H33.3538C41.4348 33.7757 48 27.1568 48 18.9727V15.8386C48 14.7201 47.0933 13.8134 45.9748 13.8134H38.1274C34.0966 13.8134 30.444 15.4591 27.7949 18.1258L26.5875 19.3412ZM44.9623 16.8994V18.9727C44.9623 25.4349 39.7725 30.6897 33.3538 30.6897H26.5189V28.6163C26.5189 22.1542 31.7086 16.8994 38.1274 16.8994H44.9623ZM5.03774 7.25575H10.6792C17.7567 7.25575 23.4811 13.0506 23.4811 20.1782V23.457H17.8396C10.7621 23.457 5.03774 17.6622 5.03774 10.5346V7.25575Z" fill="#D83436"/>
</svg>
