<svg xmlns="http://www.w3.org/2000/svg" width="36" height="36" fill="none">
  <path fill="#464A57" d="M22.3617 13.2106c.8348-.3209 1.6389.5317 1.2696 1.3463l-5.4489 12.0206c-.4317.9524-1.851.6869-1.9092-.3571l-.3207-5.7465-5.7444-.5616c-1.04976-.1026-1.24606-1.5502-.26154-1.9287l12.41514-4.773z"/>
</svg>
