<svg width="154" height="148" viewBox="0 0 154 148" fill="none" xmlns="http://www.w3.org/2000/svg">
<g clip-path="url(#clip0_679_2661)">
<path opacity="0.25" d="M105.351 84.2528H93.6215L73.291 74.1113H42.7953L3.4375 93.3542L22.9861 102.976L5.00138 111.817L53.2211 136L77.8311 148L153.831 108.436L105.351 84.2528Z" fill="#1995C2"/>
<path d="M0.832031 93.0937L6.30563 67.3499L7.60886 66.5698L2.91721 54.608L1.61397 38.7457L8.65145 34.8451L38.1046 19.5029L39.6685 35.3652L44.8814 49.1472L70.1642 61.109L64.9513 64.2294L68.6003 87.8929L62.3448 91.2734L57.9138 67.3499L35.7588 79.3117L39.4078 104.535L33.1523 107.916L28.9819 78.2715L10.9973 69.6902L6.56627 90.2333L0.832031 93.0937Z" fill="#306FB5"/>
<path d="M39.9289 49.4073L21.6836 64.4895L34.1947 71.2505L48.2696 74.631L38.1044 99.8547L43.0567 101.675H47.7483L48.7909 100.635V99.3346L43.578 96.2142L48.5303 89.7132L64.6904 69.9503L39.9289 49.4073Z" fill="#020203"/>
<path d="M56.6106 71.7709L43.8389 99.855L46.706 104.536L51.9189 107.656V108.956L50.8763 109.996H46.4453L41.2324 108.176L39.4079 106.616L38.6259 107.136L35.4981 106.356L36.0194 102.455L37.5833 99.0749L42.5356 80.3521L44.3602 77.4917L17.7741 66.8301L16.9922 61.6294L19.8593 51.2278L33.1523 52.7881L56.6106 71.7709Z" fill="#020203"/>
<path d="M18.2949 59.0284L38.1041 64.4892L41.7532 59.0284L48.2694 64.2292L52.7004 60.0686L46.7055 55.3879L22.9866 56.168L19.0769 55.3879L18.2949 59.0284Z" fill="#020203"/>
<path d="M15.6884 24.1829L7.34766 32.7642L13.3425 55.3875L30.8059 58.768L42.0138 57.4678L44.3596 50.9669L42.7957 38.485L32.8911 22.3627L23.7684 18.4621L15.6884 24.1829Z" fill="#31B7EA"/>
<path d="M30.8065 10.6609L31.8491 23.9229L30.2852 29.6437L25.0723 22.6227L30.8065 10.6609Z" fill="#020203"/>
<path d="M19.8592 22.1039L14.125 27.5647L28.4606 34.0656L27.6787 26.0044L25.5935 22.884L25.8541 21.0637L28.2 22.1039L29.7638 21.3238L31.5884 15.6029L31.0671 13.0025L31.3277 10.4021L20.9018 8.84192L18.556 21.8438L19.8592 22.1039Z" fill="#FFE4DB"/>
<path d="M23.7689 13.0019C23.7689 13.0019 24.0295 24.9637 24.0295 34.8451C21.1624 28.3442 14.1249 28.8642 14.1249 28.8642L11.2578 28.6042L13.0823 14.3021C13.0823 14.3021 13.0823 11.1816 13.0823 9.36138C13.0823 5.98088 14.9069 0 22.4656 0C30.0244 0 31.849 5.4608 31.849 10.4015C29.5031 11.1816 26.3754 13.0019 26.3754 13.0019L23.7689 11.4417V13.0019Z" fill="#020203"/>
<path d="M23.7687 12.4815C23.7687 13.5217 21.9442 14.3018 21.9442 14.3018L20.1196 12.4815L18.8164 13.5217L19.5983 15.3419L21.4229 15.862L24.0294 30.6842L26.6358 17.4222L23.7687 12.4815Z" fill="#FFE4DB"/>
<path d="M25.8547 52.0071L19.0779 49.6667L15.6895 37.4449L23.7695 41.6055L34.7167 35.3646L34.9774 43.4258L41.2329 50.4468L36.8019 55.3876L25.8547 52.0071Z" fill="#1D718C"/>
<path d="M40.9708 43.9471L40.1889 46.2874L40.4495 48.8878L42.2741 47.0676L43.8379 52.7884L44.3592 52.0083L44.8805 49.1479L47.487 46.8075L46.9657 42.6469L42.5347 38.7463L39.4069 39.2664L38.625 42.3869L40.9708 43.9471Z" fill="#FFE4DB"/>
<path d="M51.1367 92.0541V132.36" stroke="#306FB5" stroke-miterlimit="10" stroke-linecap="round"/>
<path d="M118.645 58.5086V98.8145" stroke="#306FB5" stroke-miterlimit="10" stroke-linecap="round"/>
<path d="M10.7363 72.0309V112.337" stroke="#306FB5" stroke-miterlimit="10" stroke-linecap="round"/>
<path d="M77.9844 38.226V78.5319" stroke="#306FB5" stroke-miterlimit="10" stroke-linecap="round"/>
<path d="M125.683 57.7291L79.8093 34.8458L3.96094 72.8114L49.3136 95.4347L125.683 57.7291Z" fill="#77B6E5"/>
<path d="M86.5859 65.269L76.4206 60.0682L59.4785 68.6495L69.6438 73.5902L86.5859 65.269Z" fill="#203C71"/>
<path d="M68.3402 55.3885L60.2601 51.2278L37.0625 62.9296L44.8819 66.8301L68.3402 55.3885Z" fill="#DA322F"/>
<path d="M22.2051 57.2087L37.3226 60.0691L44.6208 57.9888L38.6259 56.1686L41.2323 53.8282L36.28 53.0481L34.1949 54.8684L23.2477 51.2278L22.2051 57.2087Z" fill="#FFE4DB"/>
<path d="M89.9742 20.0233L56.6113 36.6657V69.6906L58.6965 70.7307L92.0594 54.0883V33.0252V21.3234L89.9742 20.0233Z" fill="#77B6E5"/>
<path d="M92.0582 21.3234L58.6953 37.7058V70.7307L92.0582 54.0882V33.0251V21.3234Z" fill="#4786C6"/>
<path d="M56.6113 36.6648L58.6965 37.7049V70.7298L56.6113 69.6897V36.6648Z" fill="#1C639E"/>
<path d="M89.9742 20.0233L56.6113 36.6657V69.6906L58.6965 70.7307L92.0594 54.0883V33.0252V21.3234L89.9742 20.0233Z" fill="#77B6E5"/>
<path d="M92.0582 21.3234L58.6953 37.7058V70.7307L92.0582 54.0882V33.0251V21.3234Z" fill="#4786C6"/>
<path d="M56.6113 36.6648L58.6965 37.7049V70.7298L56.6113 69.6897V36.6648Z" fill="#1C639E"/>
<path d="M79.2875 46.0271L72.25 49.4076V70.7307L73.5532 71.5108L80.8514 67.8703V54.3483V46.5472L79.2875 46.0271Z" fill="#4786C6"/>
<path d="M80.8509 46.5474L73.5527 50.188V71.5111L80.8509 67.8706V54.3486V46.5474Z" fill="#1C639E"/>
<path d="M72.25 49.4073L73.5532 50.1874V71.5105L72.25 70.7304V49.4073Z" fill="#203C71"/>
</g>
<defs>
<clipPath id="clip0_679_2661">
<rect width="153" height="148" fill="white" transform="translate(0.832031)"/>
</clipPath>
</defs>
</svg>
