<svg width="50" height="50" viewBox="0 0 50 50" fill="none" xmlns="http://www.w3.org/2000/svg">
<path d="M25.2405 18.7347C23.4598 22.6265 19.186 25.2799 14.9122 23.5994C14.0218 23.2456 13.3095 22.7149 13.7547 21.6535L15.8026 15.9043C16.4258 14.0468 16.871 12.9854 17.4053 12.1009H9.74805L5.20714 25.6337L11.1726 29.7024C13.1315 28.3757 15.8026 29.3486 16.5149 31.6483C18.3847 31.2945 20.0764 32.4444 20.5216 34.3903C23.2817 33.948 24.6173 36.3362 24.3502 38.7243C25.4186 39.255 27.8226 40.0511 28.802 38.8128L25.8638 36.69C24.7063 35.8939 25.9528 34.2134 27.1103 35.0094L31.117 37.9283C32.2745 38.3705 33.6991 38.1052 33.9662 36.7784L29.1582 32.9751C28.0897 32.0906 29.3363 30.4985 30.4937 31.2945L35.4798 35.0979C36.6373 35.0979 37.9729 34.6556 38.0619 33.4173L33.2539 29.7909C32.3635 29.0833 31.5622 27.9334 31.028 26.9605C30.3157 25.7222 32.1855 24.7492 32.8978 25.8991C33.3429 26.6067 33.9662 27.5796 34.5895 28.1103L39.4865 32.0021C40.9111 32.0906 41.8905 30.9407 41.4453 29.614L29.5143 18.5578C28.5349 17.6733 26.2199 18.0271 25.2405 18.7347ZM41.2673 9.18209C41.8905 9.18209 42.5138 9.62434 42.6919 10.2435L47.9451 25.6337C48.1231 26.2529 47.856 26.9605 47.3218 27.3143L44.2945 29.4371C44.7397 31.9137 43.137 34.3903 40.555 34.8325C40.0207 36.6015 38.329 37.7514 36.4592 38.0167C35.5689 40.3164 33.0758 41.3778 30.6718 40.7587C28.8911 42.793 25.8638 42.4392 23.5488 41.4663C21.7681 43.0583 18.8299 42.9699 17.2272 41.1125C15.5355 41.3778 13.8438 40.4049 12.9534 39.0781C10.9946 39.255 9.03575 38.1052 8.32345 36.3362C6.63174 35.9824 4.94003 35.0094 4.31677 33.3289C3.69351 31.8252 4.04966 30.2331 4.94003 28.9064L2.7141 27.4027C2.17987 27.0489 1.82372 26.3413 2.09083 25.7222L7.34404 10.3319C7.52211 9.71279 8.05634 9.27054 8.76863 9.27054H21.3229L23.8159 8.20914C26.1309 7.23619 28.0007 7.23619 30.4047 7.76689C33.6991 8.47449 37.8838 9.27054 41.2673 9.18209ZM23.2817 16.7003C25.4186 15.1082 29.2472 14.4891 31.2951 16.435L42.7809 27.1374L44.9178 25.6337L40.2879 12.0125C36.8154 11.924 33.0758 11.2164 29.6924 10.4204C27.9117 9.97814 26.5761 9.88969 24.8844 10.6857L21.679 12.1009C20.6996 12.5432 20.2544 12.8085 19.8983 13.3392C19.4531 13.9584 19.097 15.0198 18.4737 16.7888L16.871 21.2113C19.3641 21.6535 21.59 19.7076 22.6585 17.5848C22.8365 17.231 22.8365 16.9657 23.2817 16.7003ZM9.56997 32.0906L7.34404 30.4985C6.36463 32.179 7.34404 33.2404 9.03575 33.5942L9.56997 32.0906ZM16.2478 33.948L15.1793 36.9553C15.4464 38.0167 16.5149 38.7243 17.5833 38.1052L18.3847 35.717C18.8299 34.4787 17.4943 33.0635 16.2478 33.948ZM13.2205 36.1593L14.467 32.5328C14.1109 31.0292 12.2411 30.8523 11.7069 32.2675L10.9055 34.7441C11.0836 35.8055 12.2411 36.69 13.2205 36.1593ZM20.3435 36.5131L19.3641 39.1666C19.6312 39.7857 20.8777 39.8742 21.4119 39.6088C22.1242 39.1666 22.2133 38.3705 22.1242 37.5745C21.9462 36.5131 21.4119 36.2477 20.3435 36.5131Z" fill="#D83436"/>
</svg>
