{
    "version": 8,
    "sources": {
        "raster-tiles": {
            "type": "raster",
            "tiles": [
                "https://openstreetmap.data.grandlyon.com/3857/tms/1.0.0/osm_grandlyon@GoogleMapsCompatible/{z}/{x}/{y}.png?"
            ],
            "scheme": "tms",
            "tileSize": 256,
            "minzoom": 0,
            "maxzoom": 17
        }
    },
    "glyphs": "https://openmaptiles.geo.data.gouv.fr/fonts/{fontstack}/{range}.pbf",
    "layers": [
        {
            "id": "simple-tiles",
            "type": "raster",
            "source": "raster-tiles"
        }
    ]
}