<?xml version="1.0" encoding="utf-8"?>
<!-- Generator: Adobe Illustrator 23.0.2, SVG Export Plug-In . SVG Version: 6.00 Build 0)  -->
<svg version="1.1" id="Calque_1" xmlns="http://www.w3.org/2000/svg" xmlns:xlink="http://www.w3.org/1999/xlink" x="0px" y="0px"
	 viewBox="0 0 30.3 30.3" enable-background="new 0 0 30.3 30.3" xml:space="preserve">
<g>
	<path fill="#B4B4B4" d="M12.4,11.1c0.4-0.6,1.1-0.9,2-0.9c0.9,0,1.6,0.3,2,0.9c0.4,0.6,0.7,1.5,0.7,2.8s-0.2,2.2-0.7,2.7
		c-0.4,0.5-1.1,0.8-2,0.8c-0.9,0-1.6-0.3-2-0.8c-0.4-0.5-0.7-1.5-0.7-2.7S11.9,11.7,12.4,11.1z M15.6,13.8c0-0.9-0.1-1.5-0.3-1.8
		c-0.2-0.3-0.5-0.5-0.9-0.5c-0.4,0-0.7,0.2-0.9,0.5c-0.2,0.3-0.3,1-0.3,1.8c0,0.9,0.1,1.5,0.3,1.8c0.2,0.3,0.5,0.5,0.9,0.5
		c0.4,0,0.7-0.2,0.9-0.5C15.5,15.3,15.6,14.7,15.6,13.8z"/>
</g>
<g>
	<path fill="#242b3f" d="M27.7,24.9l-4.5-4.5c-0.1-0.1-0.1-0.1-0.2-0.1c-0.2,0.4-0.6,0.9-1.1,1.3c-0.4,0.4-0.9,0.7-1.3,0.8
		c0,0.1,0.1,0.3,0.2,0.4l4.5,4.5c0.3,0.3,0.8,0.3,1.1,0l1.3-1.3c0.2-0.2,0.2-0.3,0.2-0.6C28,25.2,27.9,25.1,27.7,24.9z"/>
</g>
<path fill="#818080" d="M21.1,19.9l0.4-0.5c1.3-1.6,1.9-3.5,1.9-5.6c0-1.6-0.4-3.2-1.2-4.5c-0.8-1.4-1.9-2.5-3.3-3.3
	c-1.4-0.8-2.9-1.2-4.5-1.2c-1.6,0-3.2,0.4-4.6,1.2C8.4,6.9,7.3,8,6.5,9.4c-0.8,1.4-1.2,2.9-1.2,4.5c0,1.6,0.4,3.2,1.2,4.6
	c0.8,1.4,1.9,2.4,3.3,3.3c1.4,0.8,2.9,1.2,4.6,1.2c2.1,0,3.9-0.6,5.6-1.9l0.5-0.4v1.3c0,0.1,0,0.1,0,0.2c0.4-0.2,0.8-0.4,1.3-0.8
	c0.5-0.4,0.9-0.9,1.1-1.3c-0.1-0.1-0.2-0.1-0.4-0.1H21.1z M14.4,21.1c-4,0-7.2-3.2-7.2-7.2s3.2-7.2,7.2-7.2s7.2,3.2,7.2,7.2
	S18.4,21.1,14.4,21.1z"/>
</svg>
