<svg xmlns="http://www.w3.org/2000/svg" width="18" height="17" fill="none" viewBox="0 0 18 17">
    <path stroke="#242B3F" stroke-linecap="round" stroke-width="2" d="M1-1h20.411" transform="matrix(-.71394 -.7002 -.71394 .7002 16 17)"/>
    <path stroke="#242B3F" stroke-linecap="round" stroke-width="2" d="M1-1h20.411" transform="matrix(-.71394 .7002 -.71394 -.7002 16 0)"/>
</svg>
