<svg width="50" height="50" viewBox="0 0 50 50" fill="none" xmlns="http://www.w3.org/2000/svg">
<path fill-rule="evenodd" clip-rule="evenodd" d="M45.3317 14.2857L45.3267 14.2833L25.535 4.73598C25.1976 4.5701 24.7974 4.57256 24.46 4.73842L4.67333 14.2833C4.24838 14.4922 3.97917 14.9245 3.97917 15.398V15.4409C3.97917 16.1651 4.56618 16.7521 5.2903 16.7521H44.7097C45.4338 16.7521 46.0208 16.1651 46.0208 15.4409V15.3924C46.0208 14.9223 45.7536 14.4931 45.3317 14.2857ZM25 7.1833L36.9528 12.9343L40.1769 14.3602H10.3958L13.0472 12.9343L25 7.1833ZM7.9375 38.4075H7.15428C6.49378 38.4075 5.95833 38.9429 5.95833 39.6034C5.95833 40.2639 6.49377 40.7994 7.15428 40.7994H42.8457C43.5062 40.7994 44.0417 40.2639 44.0417 39.6034C44.0417 38.9429 43.5062 38.4075 42.8457 38.4075H42.0625V20.1772C42.0625 19.4983 41.5122 18.948 40.8333 18.948C40.1545 18.948 39.6042 19.4983 39.6042 20.1772V38.4075H34.1458V20.1772C34.1458 19.4983 33.5955 18.948 32.9167 18.948C32.2378 18.948 31.6875 19.4983 31.6875 20.1772V38.4075H26.2292V20.1772C26.2292 19.4983 25.6789 18.948 25 18.948C24.3211 18.948 23.7708 19.4983 23.7708 20.1772V38.4075H18.3125V20.1772C18.3125 19.4983 17.7622 18.948 17.0833 18.948C16.4045 18.948 15.8542 19.4983 15.8542 20.1772V38.4075H10.3958V20.1772C10.3958 19.4983 9.84552 18.948 9.16667 18.948C8.48782 18.948 7.9375 19.4983 7.9375 20.1772V38.4075ZM46.8041 45.3872C47.4646 45.3872 48 44.8518 48 44.1913C48 43.5308 47.4646 42.9953 46.8041 42.9953H3.19595C2.53544 42.9953 2 43.5308 2 44.1913C2 44.8518 2.53544 45.3872 3.19595 45.3872H46.8041Z" fill="#D83436"/>
</svg>
