<svg xmlns="http://www.w3.org/2000/svg" width="16" height="16" fill="none" viewBox="0 0 16 16">
    <path fill="#fff" d="M14.286 0H1.714C1.238 0 .834.167.5.5.167.833 0 1.238 0 1.714v12.572c0 .476.167.88.5 1.214.333.333.738.5 1.214.5h12.572c.476 0 .88-.167 1.214-.5.333-.333.5-.738.5-1.214V1.714c0-.476-.167-.88-.5-1.214a1.653 1.653 0 0 0-1.214-.5zM4 13.714c-.476 0-.88-.166-1.214-.5a1.653 1.653 0 0 1-.5-1.214c0-.476.166-.881.5-1.214.333-.334.738-.5 1.214-.5s.881.166 1.214.5c.334.333.5.738.5 1.214s-.166.881-.5 1.214c-.333.334-.738.5-1.214.5zm5.643 0h-1.25a.475.475 0 0 1-.286-.107.386.386 0 0 1-.107-.286 5.506 5.506 0 0 0-.857-2.571A5.539 5.539 0 0 0 5.25 8.857 5.506 5.506 0 0 0 2.679 8a.386.386 0 0 1-.286-.107.475.475 0 0 1-.107-.286v-1.25c0-.095.035-.178.107-.25a.444.444 0 0 1 .321-.143 7.574 7.574 0 0 1 3.572 1.107 7.796 7.796 0 0 1 2.643 2.643 7.574 7.574 0 0 1 1.107 3.572c0 .119-.048.226-.143.321a.342.342 0 0 1-.25.107zm3.678 0h-1.25a.475.475 0 0 1-.285-.107.386.386 0 0 1-.107-.286 9.328 9.328 0 0 0-1.322-4.428 9.237 9.237 0 0 0-3.25-3.25A9.327 9.327 0 0 0 2.68 4.32a.386.386 0 0 1-.286-.107.475.475 0 0 1-.107-.285v-1.25c0-.096.035-.179.107-.25a.444.444 0 0 1 .321-.143A11.39 11.39 0 0 1 8.18 3.893a11.29 11.29 0 0 1 3.928 4c1 1.643 1.536 3.44 1.607 5.393 0 .119-.047.226-.143.321a.342.342 0 0 1-.25.107z"/>
</svg>
