<svg xmlns="http://www.w3.org/2000/svg" viewBox="0 0 15 9">
  <path d="M7.5 7.5c-.1 0-.3-.1-.4-.1l-6-6C1 1.1 1 .8 1.1.6s.5-.2.7 0l5.6 5.6L13 .6c.2-.2.5-.2.7 0s.2.5 0 .7l-6 6c.1.1-.1.2-.2.2z" class="brandcolor"/>
  <path d="M7.5 7.5c-.1 0-.3-.1-.4-.1l-6-6C1 1.1 1 .8 1.1.6s.5-.2.7 0l5.6 5.6L13 .6c.2-.2.5-.2.7 0s.2.5 0 .7l-6 6c.1.1-.1.2-.2.2z" class="brandcolor"/>
</svg>
