<svg width="7" height="12" fill="none" version="1.1" viewBox="0 0 6 10" xmlns="http://www.w3.org/2000/svg">
 <path d="m0.99277 8.9964 4.0072-3.9927-3.9927-4.0072" stroke="#ffffff" stroke-linecap="round" stroke-linejoin="round"/>
</svg>
