<svg xmlns="http://www.w3.org/2000/svg" viewBox="0 0 36 36">
  <g fill="#464a57">
    <path d="M9.9 11.8l4.9 4.3c.3.3.8.3 1.1 0 .3-.3.3-.7 0-1L11 10.9h2.7c.4 0 .8-.3.8-.7 0-.4-.3-.7-.8-.7H9.1c-.4 0-.8.3-.8.7v4c0 .3.2.6.6.7.5.1.9-.3.9-.7l.1-2.4zM13.6 25.1H11l4.9-4.3c.3-.3.3-.7 0-1-.3-.3-.8-.3-1.1 0l-4.9 4.3v-2.3c0-.4-.4-.8-.9-.7-.4.1-.6.4-.6.7v4c0 .4.3.7.8.7h4.5c.4 0 .7-.2.8-.6 0-.4-.4-.8-.9-.8zM22.4 10.9H25l-4.9 4.3c-.3.3-.3.7 0 1 .3.3.8.3 1.1 0l4.9-4.3v2.3c0 .4.3.7.8.7.4 0 .8-.3.8-.7v-4c0-.4-.3-.7-.8-.7h-4.5c-.4 0-.7.2-.8.6-.1.4.3.8.8.8zM27.7 25.8v-4c0-.4-.3-.7-.8-.7-.4 0-.8.3-.8.7v2.3l-4.9-4.3c-.3-.3-.8-.3-1.1 0-.3.3-.3.7 0 1l4.9 4.3h-2.7c-.4 0-.8.3-.8.7s.3.7.8.7h4.5c.5 0 .9-.3.9-.7z"/>
  </g>
</svg>
