<svg xmlns="http://www.w3.org/2000/svg" width="82" height="81" fill="none" viewBox="0 0 82 81">
    <mask id="a" width="82" height="81" x="0" y="0" maskUnits="userSpaceOnUse">
        <ellipse cx="41" cy="40.5" fill="#C4C4C4" rx="41" ry="40.5"/>
    </mask>
    <g mask="url(#a)">
        <path fill="#F2F2F2" d="M-10-8H92v92.832H-10z"/>
        <path fill="#B4B4B4" d="M12 58.65l30.08 15.04L69 60.293 38.667 45.126 12 53.216v5.434z"/>
        <path fill="#464A57" d="M38.668 66.612v1.896l26.92-13.397v-1.896l-26.92 13.397z"/>
        <path fill="#818080" d="M38.667 68.508l1.77.758 26.92-13.397-1.77-.758-26.92 13.397z"/>
        <path fill="#464A57" d="M40.437 69.266v1.77l26.92-13.397v-1.77l-26.92 13.397z"/>
        <path fill="#818080" d="M40.437 71.035l1.643.885L69 58.523l-1.643-.884-26.92 13.396z"/>
        <path fill="#464A57" d="M42.08 71.92v1.77L69 60.293v-1.77L42.08 71.92z"/>
        <path fill="#818080" d="M12 53.215l26.667 13.397 26.92-13.397-26.92-13.27L12 53.215z"/>
        <path fill="#B4B4B4" d="M23.248 41.082v12.639l15.42 7.71 14.913-7.458V34.257L38.667 26.8l-15.419 7.457v6.825z"/>
        <path fill="#818080" d="M38.667 61.43V41.588l14.914-7.33V53.72l-1.517 1.01-4.297 2.15-4.55 2.274-1.011.506-3.539 1.77z"/>
        <path fill="#818080" d="M27.798 34.763l12.639 6.193 10.743-5.309-12.639-6.192-10.743 5.308z"/>
        <path fill="#818080" d="M49.284 34.89l-8.341-4.172-2.402-1.264-10.743 5.309L30.2 35.9l8.341-4.044 8.215 4.17 2.528-1.137z"/>
        <path fill="#818080" d="M38.541 28.696v3.16L51.18 38.3v-2.78L38.54 28.696z"/>
        <path fill="#DA322F" d="M51.344 27.462c-2.716 6.003-9.6 8.598-15.602 5.882-6.003-2.716-8.598-9.6-5.882-15.602 2.716-6.003 9.6-8.598 15.602-5.882 6.003 2.716 8.598 9.6 5.882 15.602z"/>
        <path fill="#fff" d="M43.446 23.889c-.143.316-.602.489-.775.03l-3.22-2.98c-.316-.142-.489-.601-.03-.774l2.98-3.22c-1.408-.255-3.243.437-4.13 1.557-1.347 1.294-1.573 3.476-.738 4.995l-5.5 6.266c.662 1.061 1.783 1.949 3.047 2.52l5.5-6.265c1.722.398 3.73.165 5.22-1.445.888-1.12 1.287-2.843 1.083-4.077l-3.438 3.393z"/>
        <path fill="#B4B4B4" d="M25.144 33.373l15.798 7.583.758 13.65-12.133-3.792-5.687-9.48 1.264-7.962z"/>
        <path fill="#B4B4B4" d="M41.7 41.84c0-.505-.506-.884-1.264-1.01-1.011-.127-2.022.126-2.275.758 0 .126-.127.252-.127.252v19.211c0 .505.506.885 1.264 1.011 1.011.127 2.023-.126 2.275-.758 0-.127.127-.127.127-.253v-19.21z"/>
        <path fill="#464A57" d="M41.7 41.84c0-.505-.505-.884-1.263-1.01h-.506v21.358c.759 0 1.517-.252 1.77-.758 0-.126.126-1.01.126-1.01v.757V42.6l-.126-.759z"/>
        <path fill="#B4B4B4" d="M41.574 42.092c-.252.505-1.263.884-2.274.758-1.012-.126-1.517-.758-1.264-1.264.252-.505 1.264-.885 2.274-.758 1.012.126 1.644.758 1.264 1.264zM46.124 39.565c0-.505-.505-.884-1.263-1.01-1.011-.127-2.023.126-2.275.758 0 .126-.127.252-.127.252v19.211c0 .506.506.885 1.264 1.011 1.011.127 2.022-.126 2.275-.758 0-.127.126-.127.126-.253v-19.21z"/>
        <path fill="#464A57" d="M46.124 39.566c0-.506-.505-.885-1.264-1.012h-.505v21.36c.758 0 1.517-.253 1.77-.759 0-.126.126-.758.126-.758v.506-18.58l-.127-.758z"/>
        <path fill="#B4B4B4" d="M45.998 39.817c-.253.505-1.264.884-2.275.758s-1.517-.758-1.264-1.264c.253-.505 1.264-.885 2.275-.758 1.011.126 1.517.758 1.264 1.264zM50.421 37.417c0-.506-.505-.885-1.264-1.011-1.01-.127-2.022.126-2.274.758 0 .127-.127.253-.127.253v19.21c0 .506.506.885 1.264 1.012 1.011.126 2.022-.127 2.275-.759 0-.126.126-.126.126-.252V37.417z"/>
        <path fill="#464A57" d="M50.421 37.417c0-.506-.505-.885-1.264-1.011h-.505v21.359c.758 0 1.517-.253 1.77-.758 0-.127.126-.38.126-.506v.253-18.579l-.127-.758z"/>
        <path fill="#B4B4B4" d="M50.421 37.67c-.252.505-1.264.884-2.275.758-1.01-.126-1.516-.758-1.264-1.264.253-.505 1.264-.885 2.276-.758 1.01.126 1.516.632 1.263 1.264zM54.845 35.142c0-.506-.506-.885-1.264-1.011-1.011-.127-2.022.126-2.275.758 0 .127-.126.253-.126.253v19.21c0 .506.505.885 1.264 1.012 1.01.126 2.022-.127 2.274-.759 0-.126.127-.126.127-.252V35.142z"/>
        <path fill="#464A57" d="M54.845 35.142c0-.506-.506-.885-1.264-1.011h-.506v21.36c.759 0 1.517-.254 1.77-.76 0-.126.126-.126.126-.252V35.9l-.126-.758z"/>
        <path fill="#B4B4B4" d="M54.844 35.395c-.253.505-1.264.884-2.275.758s-1.517-.758-1.264-1.264c.253-.505 1.264-.885 2.275-.758.885.126 1.517.758 1.264 1.264z"/>
    </g>
</svg>
