<svg width="50" height="50" viewBox="0 0 50 50" fill="none" xmlns="http://www.w3.org/2000/svg">
<path fill-rule="evenodd" clip-rule="evenodd" d="M43.0402 25.2431V40.9979H48V43.6237H35.8436H23.6871H2V40.9979H7.25159V8.6131C7.25159 7.44608 8.2241 6.37631 9.48837 6.37631H25.8266C26.9937 6.37631 28.0634 7.34883 28.0634 8.6131V15.129L28.6469 14.6427C29.5222 13.9619 30.8837 13.9619 31.759 14.6427L41.7759 22.6173C42.5539 23.2008 43.0402 24.2706 43.0402 25.2431ZM25.4376 9.00211H9.87738V41.0951H17.463V25.2431C17.463 24.2706 18.0465 23.2008 18.7273 22.6173L25.4376 17.2685V9.00211ZM33.2178 33.6068H26.3129V40.9979H33.2178V33.6068ZM23.6871 40.9979V30.981H27.2852V28.7442H32.1477V30.981H35.8436V40.9979H40.4144V25.1459C40.4144 25.0486 40.2199 24.7569 40.1226 24.6596L30.203 16.7822L20.3806 24.7569C20.2833 24.7569 20.0888 25.1459 20.0888 25.2431V40.9979H23.6871ZM15.4218 13.4757H12.1152V16.7823H15.4218V13.4757ZM12.1152 19.3108H15.4218V22.6174H12.1152V19.3108ZM21.4491 13.4757H18.1426V16.7823H21.4491V13.4757Z" fill="#D83436"/>
</svg>
