<?xml version="1.0" encoding="utf-8"?>
<!-- Generator: Adobe Illustrator 23.0.6, SVG Export Plug-In . SVG Version: 6.00 Build 0)  -->
<svg version="1.1" id="Calque_1" xmlns="http://www.w3.org/2000/svg" xmlns:xlink="http://www.w3.org/1999/xlink" x="0px" y="0px"
	 viewBox="0 0 20 26" style="enable-background:new 0 0 20 26;" xml:space="preserve">
<style type="text/css">
	.st0{fill:#FFFFFF;}
	.st1{fill:#464A57;}
</style>
<g>
	<path class="st0" d="M9.8,19c-4.1,0-7.4-2-7.9-4.6c0.5-2.6,3.9-4.6,7.9-4.6c4.1,0,7.4,2,7.9,4.6C17.2,17,13.9,19,9.8,19z"/>
	<path class="st1" d="M9.8,17.5c1.7,0,3-1.3,3-3s-1.3-3-3-3s-3,1.3-3,3S8.1,17.5,9.8,17.5z"/>
	<path class="st1" d="M19.5,10.8l-0.8-0.7l-1.5,1.5c-0.8-0.8-1.7-1.4-2.9-1.9l1.2-2.3L14.7,7l-1.2,2.4c-1-0.3-2-0.5-3.1-0.5V5.9h-1
		v2.9C8.2,8.8,7,9.1,5.9,9.4L4.5,6.9L3.7,7.4L5,9.8c-1.1,0.5-2,1.1-2.7,1.9l-1.6-1.6L0,10.8l1.7,1.7c-0.4,0.6-0.7,1.2-0.8,1.9
		C1.4,17.7,5.2,20,9.8,20s8.4-2.5,8.9-5.6c-0.1-0.7-0.4-1.4-0.8-2L19.5,10.8z M9.8,19c-4.1,0-7.4-2-7.9-4.6c0.5-2.6,3.9-4.6,7.9-4.6
		c4.1,0,7.4,2,7.9,4.6C17.2,17,13.9,19,9.8,19z"/>
</g>
</svg>
