<svg width="153" height="150" viewBox="0 0 153 150" fill="none" xmlns="http://www.w3.org/2000/svg">
<g clip-path="url(#clip0_679_2490)">
<path d="M117.082 26.646V104.681L58.8727 131.485L0.835182 104.681V26.8046L58.8727 0L117.082 26.646Z" fill="#557C7C"/>
<path d="M117.082 26.8049L58.8727 53.7681V131.644L117.082 104.839V26.8049Z" fill="#B5D0D1"/>
<path d="M0.835659 26.8049L59.0449 53.7681L58.8732 131.644L0.835659 104.839V26.8049Z" fill="#6C9FA0"/>
</g>
<g clip-path="url(#clip1_679_2490)">
<g opacity="0.2">
<path opacity="0.5" d="M142.494 110.215C141.804 107.112 140.08 104.009 137.493 101.251C134.906 98.4922 131.284 96.0787 126.973 94.1823C122.662 92.2859 117.488 90.7343 111.797 89.8723C106.106 89.0103 100.242 88.8379 94.7236 89.1827C89.205 89.5275 83.6864 90.5619 78.8576 92.1135C74.0288 93.6651 69.5449 95.7339 66.0958 98.3198C62.4742 100.733 59.7149 103.664 57.9903 106.94C56.2658 110.215 55.7484 113.491 56.4382 116.594C57.128 119.697 58.8526 122.8 61.4395 125.559C64.0263 128.317 67.6479 130.731 71.9593 132.627C76.2707 134.523 81.4444 136.075 87.1355 136.937C92.8266 137.799 98.6901 137.971 104.209 137.627C109.727 137.282 115.246 136.247 120.075 134.696C124.904 133.144 129.387 131.075 132.837 128.49C136.458 126.076 139.217 123.145 140.942 119.87C142.667 116.594 143.184 113.318 142.494 110.215Z" fill="#2FB8EB"/>
</g>
<path d="M73.3398 124.698V79.3569L99.7257 66.0823V111.595L73.3398 124.698Z" fill="#6C9FA0"/>
<path d="M73.3398 98.8379V79.3569L99.7257 66.0823V111.595L73.3398 98.8379Z" fill="#557C7C"/>
<path d="M94.3789 68.8406L99.7251 66.0823V111.595L94.3789 109.182V68.8406Z" fill="#6C9FA0"/>
<path d="M101.104 65.3923L127.49 78.6669V124.352L126.11 125.042L101.104 110.905L99.7246 66.0819L101.104 65.3923Z" fill="#6C9FA0"/>
<path d="M99.7246 66.0823L126.11 79.3569V125.042L99.7246 111.595V66.0823Z" fill="#B5D0D1"/>
<mask id="mask0_679_2490" style="mask-type:alpha" maskUnits="userSpaceOnUse" x="73" y="58" width="80" height="97">
<rect x="73.2031" y="58.5087" width="79.2942" height="96.2308" fill="#C4C4C4"/>
</mask>
<g mask="url(#mask0_679_2490)">
<path d="M85.5851 119.526C83.8606 121.767 80.7563 122.112 78.5144 120.56C76.2725 118.836 75.7551 115.733 77.4797 113.492C79.2042 111.251 82.3084 110.733 84.5504 112.457C86.7923 114.181 87.3097 117.284 85.5851 119.526Z" fill="#DA322F"/>
<path d="M82.4815 117.285C82.309 117.457 82.1366 117.285 82.1366 117.285L81.1019 115.906C80.9294 115.733 81.1019 115.561 81.1019 115.561L82.654 114.354C81.9641 114.182 81.2743 114.182 80.7569 114.699C80.0671 115.216 79.7222 116.078 79.8947 116.768L76.9629 118.836C77.1353 119.354 77.4803 119.698 77.9976 120.216L80.9294 118.147C81.6192 118.492 82.4815 118.492 83.1713 117.974C83.6887 117.63 84.0336 116.94 84.0336 116.25L82.4815 117.285Z" fill="white"/>
<path d="M84.55 135.041C82.8254 137.283 79.7212 137.627 77.4792 136.076C75.2373 134.352 74.7199 131.249 76.4445 129.008C78.1691 126.766 81.2733 126.422 83.5152 127.973C85.7572 129.525 86.2745 132.8 84.55 135.041Z" fill="#DA322F"/>
<path d="M81.6182 132.801C81.4458 132.973 81.2733 132.801 81.2733 132.801L80.2386 131.422C80.0661 131.249 80.2386 131.077 80.2386 131.077L81.7907 129.87C81.1009 129.698 80.411 129.698 79.8937 130.215C79.2038 130.732 78.8589 131.594 79.0314 132.284L76.0996 134.18C76.2721 134.697 76.617 135.042 77.1343 135.559L80.0661 133.49C80.7559 133.835 81.6182 133.835 82.308 133.318C82.8254 132.973 83.1703 132.284 83.1703 131.594L81.6182 132.801Z" fill="white"/>
<path d="M95.0698 111.939C96.277 114.525 95.2423 117.456 92.6554 118.663C90.0686 119.87 87.1368 118.835 85.9296 116.249C84.7224 113.663 85.7572 110.732 88.344 109.526C90.9309 108.319 93.8626 109.353 95.0698 111.939Z" fill="#DA322F"/>
<path d="M91.6204 113.491C91.6204 113.664 91.6204 113.836 91.448 113.836L89.7234 114.181C89.5509 114.181 89.3785 114.181 89.3785 114.008L89.0336 111.94C88.5162 112.457 88.3438 112.974 88.3438 113.664C88.5162 114.525 89.0336 115.215 89.8959 115.387L90.4132 119.008C90.9306 119.008 91.448 119.008 92.1378 118.835L91.6204 115.215C92.3103 114.87 92.6552 114.008 92.4827 113.146C92.3103 112.457 91.9653 111.94 91.448 111.595L91.6204 113.491Z" fill="white"/>
<path d="M91.4485 110.216C88.6892 110.216 86.4473 107.975 86.4473 105.216C86.4473 102.458 88.6892 100.217 91.4485 100.217C94.2078 100.217 96.4498 102.458 96.4498 105.216C96.4498 107.975 94.2078 110.216 91.4485 110.216Z" fill="#DA322F"/>
<path d="M91.4485 106.423C91.2761 106.423 91.2761 106.25 91.2761 106.078L91.7934 104.354C91.7934 104.182 91.9659 104.182 92.1383 104.182L94.0354 104.699C93.8629 104.009 93.3455 103.664 92.6557 103.32C91.7934 103.147 90.9311 103.32 90.4138 104.009L86.9646 102.975C86.7922 103.492 86.6197 104.009 86.4473 104.526L89.8964 105.561C90.0689 106.423 90.5862 107.112 91.2761 107.285C91.9659 107.457 92.6557 107.285 93.1731 106.94L91.4485 106.423Z" fill="white"/>
<path d="M111.626 143.316C108.867 143.316 106.625 141.075 106.625 138.317C106.625 135.559 108.867 133.317 111.626 133.317C114.386 133.317 116.627 135.559 116.627 138.317C116.8 141.075 114.558 143.316 111.626 143.316Z" fill="#DA322F"/>
<path d="M111.626 139.523C111.454 139.523 111.454 139.351 111.454 139.179L111.971 137.455C111.971 137.282 112.144 137.282 112.316 137.282L114.213 137.799C114.041 137.11 113.523 136.765 112.833 136.42C111.971 136.248 111.109 136.42 110.592 137.11L107.142 136.075C106.97 136.593 106.797 137.11 106.625 137.627L110.074 138.661C110.247 139.523 110.764 140.213 111.454 140.385C112.144 140.558 112.833 140.385 113.351 140.041L111.626 139.523Z" fill="white"/>
<path d="M82.481 100.906C82.481 103.665 80.2391 105.906 77.4798 105.906C74.7205 105.906 72.4785 103.665 72.4785 100.906C72.4785 98.1479 74.7205 95.9067 77.4798 95.9067C80.2391 95.9067 82.481 98.1479 82.481 100.906Z" fill="#DA322F"/>
<path d="M78.6874 100.907C78.6874 101.079 78.515 101.079 78.3425 101.079L76.6179 100.562C76.4455 100.562 76.4455 100.389 76.4455 100.217L76.9628 98.3207C76.273 98.4931 75.7557 99.0103 75.5832 99.6999C75.4107 100.562 75.5832 101.424 76.273 101.941L75.2383 105.389C75.7557 105.561 76.273 105.734 76.7904 105.906L77.8251 102.458C78.6874 102.286 79.3772 101.769 79.5497 101.079C79.7222 100.389 79.5497 99.6999 79.2048 99.1827L78.6874 100.907Z" fill="white"/>
<path d="M81.4458 83.8385C81.4458 86.5969 79.2039 88.8381 76.4446 88.8381C73.6853 88.8381 71.4434 86.5969 71.4434 83.8385C71.4434 81.0802 73.6853 78.839 76.4446 78.839C79.2039 78.839 81.4458 81.0802 81.4458 83.8385Z" fill="#DA322F"/>
<path d="M77.6523 83.839C77.6523 84.0114 77.4798 84.0114 77.3073 84.0114L75.5828 83.4942C75.4103 83.4942 75.4103 83.3218 75.4103 83.1494L75.9277 81.253C75.2379 81.4254 74.7205 81.9426 74.548 82.6322C74.3756 83.4942 74.548 84.3562 75.2379 84.8734L74.2031 88.3213C74.7205 88.4937 75.2379 88.6661 75.7552 88.8385L76.79 85.3905C77.6523 85.2181 78.3421 84.701 78.5145 84.0114C78.687 83.3218 78.5145 82.6322 78.1696 82.115L77.6523 83.839Z" fill="white"/>
<path d="M92.1373 124.525C91.1026 127.111 88.1708 128.318 85.5839 127.284C82.9971 126.249 81.7899 123.318 82.8246 120.732C83.8594 118.146 86.7911 116.94 89.378 117.974C91.7924 119.008 93.172 121.939 92.1373 124.525Z" fill="#DA322F"/>
<path d="M87.9507 120.239L87.7836 120.661C87.6937 120.888 87.5977 121.071 87.4954 121.211C87.3931 121.351 87.2851 121.453 87.1714 121.518C87.0577 121.583 86.9384 121.616 86.8136 121.616C86.6906 121.616 86.5619 121.589 86.4276 121.536C86.3211 121.494 86.2281 121.442 86.1487 121.379C86.0692 121.317 86.0049 121.243 85.9557 121.156C85.9084 121.068 85.8781 120.967 85.8651 120.852C85.852 120.736 85.859 120.606 85.8861 120.46C85.9132 120.313 85.9626 120.15 86.0344 119.969L86.2016 119.546C86.2914 119.32 86.387 119.138 86.4883 119C86.5908 118.863 86.6985 118.764 86.8111 118.701C86.9243 118.638 87.0422 118.607 87.1647 118.608C87.2885 118.61 87.417 118.638 87.5501 118.69C87.6578 118.733 87.7514 118.785 87.8309 118.848C87.9121 118.909 87.9769 118.982 88.0253 119.068C88.0742 119.151 88.1048 119.25 88.1171 119.363C88.1311 119.476 88.1249 119.605 88.0983 119.75C88.0717 119.894 88.0225 120.057 87.9507 120.239ZM87.4074 120.578L87.6204 120.04C87.6696 119.916 87.7052 119.804 87.7271 119.704C87.7508 119.603 87.762 119.514 87.7607 119.436C87.7595 119.357 87.7456 119.289 87.719 119.23C87.6938 119.172 87.657 119.122 87.6088 119.081C87.5623 119.039 87.5048 119.005 87.4364 118.977C87.3527 118.944 87.2723 118.931 87.1951 118.937C87.1184 118.942 87.0446 118.969 86.9736 119.019C86.9039 119.069 86.8361 119.144 86.7701 119.244C86.7041 119.344 86.6403 119.472 86.5785 119.628L86.3655 120.166C86.3163 120.29 86.2798 120.402 86.2561 120.503C86.2337 120.604 86.2233 120.695 86.2248 120.776C86.2269 120.856 86.24 120.927 86.2643 120.988C86.2885 121.048 86.3236 121.1 86.3696 121.144C86.4174 121.186 86.4748 121.22 86.542 121.247C86.6282 121.281 86.7101 121.294 86.7878 121.287C86.8655 121.28 86.9397 121.25 87.0104 121.197C87.0829 121.144 87.1517 121.066 87.2169 120.964C87.2827 120.861 87.3461 120.732 87.4074 120.578ZM90.026 119.697L88.9238 122.48L88.572 122.341L89.5003 119.997L88.6888 119.974L88.8145 119.657L89.9709 119.675L90.026 119.697Z" fill="white"/>
<path d="M127.665 129.524C126.63 132.11 123.698 133.317 121.111 132.282C118.524 131.248 117.317 128.317 118.352 125.731C119.387 123.145 122.318 121.938 124.905 122.973C127.492 124.007 128.699 126.938 127.665 129.524Z" fill="#DA322F"/>
<path d="M123.554 125.108L123.387 125.53C123.297 125.757 123.201 125.94 123.099 126.08C122.997 126.22 122.889 126.322 122.775 126.387C122.661 126.452 122.542 126.485 122.417 126.485C122.294 126.485 122.165 126.458 122.031 126.405C121.925 126.363 121.832 126.311 121.752 126.249C121.673 126.186 121.608 126.112 121.559 126.025C121.512 125.937 121.482 125.836 121.469 125.721C121.456 125.606 121.463 125.475 121.49 125.329C121.517 125.183 121.566 125.019 121.638 124.838L121.805 124.416C121.895 124.189 121.99 124.007 122.092 123.87C122.194 123.733 122.302 123.633 122.415 123.571C122.528 123.507 122.646 123.476 122.768 123.478C122.892 123.48 123.02 123.507 123.154 123.56C123.261 123.602 123.355 123.655 123.434 123.717C123.516 123.778 123.58 123.852 123.629 123.937C123.678 124.021 123.708 124.119 123.721 124.233C123.735 124.345 123.728 124.474 123.702 124.619C123.675 124.764 123.626 124.927 123.554 125.108ZM123.011 125.447L123.224 124.909C123.273 124.785 123.309 124.673 123.331 124.573C123.354 124.473 123.366 124.383 123.364 124.305C123.363 124.227 123.349 124.158 123.323 124.099C123.297 124.041 123.261 123.991 123.212 123.95C123.166 123.908 123.108 123.874 123.04 123.847C122.956 123.814 122.876 123.8 122.799 123.806C122.722 123.811 122.648 123.838 122.577 123.888C122.507 123.938 122.44 124.013 122.374 124.113C122.308 124.213 122.244 124.341 122.182 124.497L121.969 125.035C121.92 125.159 121.883 125.271 121.86 125.372C121.837 125.473 121.827 125.564 121.828 125.645C121.83 125.725 121.844 125.796 121.868 125.857C121.892 125.918 121.927 125.97 121.973 126.013C122.021 126.055 122.078 126.09 122.146 126.116C122.232 126.15 122.314 126.164 122.391 126.156C122.469 126.149 122.543 126.119 122.614 126.066C122.686 126.013 122.755 125.935 122.82 125.834C122.886 125.731 122.95 125.602 123.011 125.447ZM125.63 124.566L124.527 127.349L124.176 127.21L125.104 124.866L124.292 124.844L124.418 124.526L125.574 124.544L125.63 124.566Z" fill="white"/>
<path d="M101.106 124.87C102.83 127.111 102.485 130.214 100.243 131.938C98.0015 133.662 94.8973 133.317 93.1727 131.076C91.4481 128.835 91.793 125.732 94.035 124.008C96.1045 122.284 99.3811 122.801 101.106 124.87Z" fill="#DA322F"/>
<path d="M95.2278 126.305L95.5082 126.662C95.659 126.854 95.769 127.029 95.8383 127.188C95.9076 127.347 95.9416 127.492 95.9405 127.622C95.9393 127.753 95.9075 127.873 95.845 127.981C95.7827 128.087 95.6947 128.185 95.5811 128.274C95.491 128.345 95.3991 128.398 95.3053 128.436C95.2115 128.473 95.1147 128.491 95.0148 128.49C94.9152 128.486 94.8124 128.461 94.7063 128.415C94.6003 128.368 94.4909 128.296 94.3783 128.199C94.2657 128.102 94.1491 127.977 94.0287 127.824L93.7482 127.467C93.5975 127.275 93.4883 127.101 93.4207 126.944C93.3542 126.787 93.3224 126.643 93.3252 126.515C93.3272 126.385 93.3598 126.267 93.4229 126.162C93.487 126.057 93.5754 125.959 93.688 125.871C93.7791 125.8 93.8716 125.745 93.9654 125.708C94.0594 125.669 94.1554 125.65 94.2534 125.651C94.3505 125.651 94.4511 125.674 94.5552 125.72C94.6596 125.765 94.7677 125.835 94.8794 125.931C94.9912 126.027 95.1073 126.152 95.2278 126.305ZM95.247 126.945L94.8895 126.49C94.807 126.385 94.7281 126.298 94.6529 126.229C94.5779 126.158 94.5064 126.103 94.4381 126.065C94.3699 126.026 94.3037 126.004 94.2394 125.997C94.1763 125.989 94.1148 125.996 94.055 126.017C93.9954 126.036 93.9367 126.068 93.8788 126.114C93.808 126.169 93.7558 126.232 93.7222 126.302C93.6877 126.37 93.674 126.448 93.6812 126.534C93.6893 126.62 93.72 126.716 93.7731 126.823C93.8263 126.931 93.9046 127.05 94.0082 127.182L94.3657 127.637C94.4483 127.742 94.527 127.83 94.602 127.901C94.678 127.972 94.7515 128.027 94.8225 128.066C94.8926 128.105 94.9601 128.129 95.025 128.139C95.0898 128.148 95.1525 128.144 95.2129 128.126C95.2735 128.106 95.3323 128.074 95.3891 128.029C95.462 127.972 95.5148 127.908 95.5476 127.837C95.5804 127.767 95.5918 127.687 95.582 127.6C95.5723 127.51 95.54 127.412 95.485 127.304C95.4291 127.196 95.3497 127.076 95.247 126.945ZM95.8051 124.24L97.6545 126.594L97.357 126.827L95.7994 124.845L95.3713 125.535L95.1603 125.266L95.7584 124.277L95.8051 124.24Z" fill="white"/>
<path d="M81.1001 109.871C81.1001 112.63 78.8582 114.871 76.0989 114.871C73.3396 114.871 71.0977 112.63 71.0977 109.871C71.0977 107.113 73.3396 104.872 76.0989 104.872C78.8582 104.872 81.1001 107.113 81.1001 109.871Z" fill="#DA322F"/>
<path d="M75.6261 107.427V107.881C75.6261 108.125 75.6042 108.331 75.5606 108.499C75.517 108.666 75.4543 108.801 75.3725 108.904C75.2907 109.006 75.1919 109.08 75.076 109.127C74.9615 109.172 74.832 109.194 74.6875 109.194C74.573 109.194 74.4674 109.18 74.3706 109.151C74.2738 109.122 74.1866 109.077 74.1089 109.014C74.0325 108.95 73.9671 108.867 73.9126 108.765C73.8581 108.662 73.8165 108.538 73.7878 108.392C73.7592 108.247 73.7449 108.076 73.7449 107.881V107.427C73.7449 107.183 73.7667 106.979 73.8103 106.814C73.8553 106.649 73.9187 106.517 74.0005 106.417C74.0823 106.316 74.1804 106.244 74.2949 106.201C74.4108 106.157 74.5403 106.135 74.6834 106.135C74.7993 106.135 74.9056 106.149 75.0024 106.178C75.1006 106.205 75.1878 106.25 75.2641 106.311C75.3405 106.371 75.4052 106.451 75.4584 106.552C75.5129 106.652 75.5545 106.774 75.5831 106.918C75.6117 107.063 75.6261 107.232 75.6261 107.427ZM75.2457 107.943V107.364C75.2457 107.23 75.2376 107.113 75.2212 107.012C75.2062 106.91 75.1837 106.823 75.1537 106.751C75.1237 106.678 75.0856 106.62 75.0392 106.575C74.9942 106.53 74.9418 106.497 74.8818 106.477C74.8232 106.455 74.757 106.444 74.6834 106.444C74.5935 106.444 74.5137 106.461 74.4442 106.495C74.3747 106.528 74.3161 106.58 74.2684 106.652C74.222 106.725 74.1866 106.819 74.162 106.937C74.1375 107.054 74.1252 107.196 74.1252 107.364V107.943C74.1252 108.076 74.1327 108.194 74.1477 108.296C74.1641 108.399 74.1879 108.487 74.2193 108.562C74.2506 108.636 74.2888 108.696 74.3338 108.744C74.3788 108.792 74.4306 108.827 74.4892 108.851C74.5492 108.872 74.6153 108.883 74.6875 108.883C74.7802 108.883 74.8613 108.866 74.9309 108.83C75.0004 108.795 75.0583 108.739 75.1047 108.664C75.1524 108.588 75.1878 108.491 75.211 108.372C75.2342 108.252 75.2457 108.109 75.2457 107.943ZM77.3559 106.16V109.153H76.9776V106.632L76.2149 106.91V106.569L77.2966 106.16H77.3559Z" fill="white"/>
<path d="M78.3418 88.8378C80.4113 90.7342 80.4113 94.0098 78.5142 95.9062C76.6172 97.9749 73.3405 97.9749 71.4435 96.0786C69.374 94.1822 69.374 90.9066 71.2711 89.0102C73.1681 86.9414 76.2723 86.769 78.3418 88.8378Z" fill="#DA322F"/>
<path d="M73.1068 91.2917C73.4252 91.5997 73.6092 91.883 73.6588 92.1415C73.7083 92.4 73.6212 92.6448 73.3974 92.876C73.1764 93.1042 72.9374 93.2001 72.6803 93.1638C72.4223 93.1266 72.141 92.9644 71.8364 92.6773L71.4734 92.3261C71.1589 92.0219 70.9778 91.7414 70.9303 91.4848C70.8827 91.2282 70.9713 90.9839 71.196 90.7517C71.4188 90.5216 71.6569 90.4237 71.9101 90.4581C72.1623 90.4916 72.4436 90.6557 72.7541 90.9504L73.1068 91.2917ZM72.4719 91.2037C72.2416 90.981 72.0428 90.8512 71.8754 90.8144C71.707 90.7767 71.555 90.8278 71.4194 90.9679C71.2847 91.107 71.239 91.259 71.2822 91.4241C71.3254 91.5892 71.4548 91.778 71.6704 91.9904L72.1054 92.4112C72.3366 92.635 72.5398 92.7671 72.715 92.8076C72.8902 92.8462 73.0437 92.7974 73.1755 92.6613C73.3054 92.5271 73.3497 92.3774 73.3084 92.2123C73.2681 92.0462 73.1377 91.8536 72.9172 91.6345L72.4719 91.2037ZM75.2214 90.9332L74.9568 91.2065L73.1448 89.4533L72.8156 90.1961L72.5687 89.9572L73.0301 88.8956L73.0713 88.853L75.2214 90.9332Z" fill="white"/>
<path d="M87.826 105.216C89.2057 107.63 88.5158 110.733 86.1014 112.112C83.687 113.492 80.5828 112.802 79.2032 110.388C77.8235 107.975 78.5133 104.872 80.9277 103.492C83.3421 102.113 86.4463 102.803 87.826 105.216Z" fill="#DA322F"/>
<path d="M80.9604 105.127C81.0015 105.197 81.0622 105.242 81.1425 105.263C81.2228 105.283 81.2978 105.273 81.3675 105.232C81.4373 105.191 81.4825 105.13 81.5033 105.05C81.524 104.97 81.5138 104.895 81.4727 104.825C81.4316 104.755 81.3709 104.71 81.2906 104.689C81.2103 104.669 81.1353 104.679 81.0655 104.72C80.9957 104.761 80.9505 104.822 80.9298 104.902C80.909 104.982 80.9192 105.057 80.9604 105.127ZM81.212 106.024L81.2418 106.074L81.4835 105.932L82.3364 107.378L82.0947 107.521L82.1245 107.571L83.0481 107.027L83.0183 106.976L82.7766 107.119L81.8939 105.622L81.212 106.024Z" fill="white"/>
<path d="M81.7908 115.904C83.1705 118.318 82.4807 121.421 80.0663 122.8C77.6519 124.18 74.5477 123.49 73.168 121.076C71.7884 118.663 72.4782 115.56 74.8926 114.181C77.307 112.629 80.4112 113.491 81.7908 115.904Z" fill="#DA322F"/>
<path d="M75.017 115.749C75.0581 115.818 75.1188 115.864 75.1991 115.884C75.2794 115.905 75.3544 115.895 75.4242 115.854C75.4939 115.813 75.5392 115.752 75.5599 115.672C75.5806 115.592 75.5704 115.517 75.5293 115.447C75.4882 115.377 75.4275 115.332 75.3472 115.311C75.2669 115.29 75.1919 115.301 75.1221 115.342C75.0524 115.383 75.0071 115.443 74.9864 115.524C74.9657 115.604 74.9759 115.679 75.017 115.749ZM75.2686 116.645L75.2984 116.696L75.5402 116.553L76.3931 118L76.1514 118.142L76.1811 118.193L77.1048 117.649L77.075 117.598L76.8333 117.741L75.9505 116.244L75.2686 116.645Z" fill="white"/>
<path d="M89.8963 96.7692C91.276 99.1827 90.5861 102.286 88.1717 103.665C85.7574 105.044 82.6531 104.355 81.2735 101.941C79.8938 99.5275 80.5837 96.4244 82.998 95.0452C85.4124 93.666 88.3442 94.528 89.8963 96.7692Z" fill="#DA322F"/>
<path d="M82.9877 96.7389C83.0288 96.8087 83.0895 96.8539 83.1698 96.8746C83.2501 96.8954 83.3251 96.8852 83.3949 96.8441C83.4646 96.803 83.5099 96.7423 83.5306 96.662C83.5513 96.5818 83.5411 96.5068 83.5 96.437C83.4589 96.3673 83.3982 96.322 83.3179 96.3013C83.2376 96.2806 83.1626 96.2908 83.0928 96.3319C83.0231 96.373 82.9778 96.4336 82.9571 96.5139C82.9364 96.5942 82.9466 96.6692 82.9877 96.7389ZM83.2394 97.6357L83.2691 97.6862L83.5109 97.5437L84.3638 98.9903L84.1221 99.1327L84.1518 99.1832L85.0755 98.639L85.0457 98.5885L84.804 98.7309L83.9212 97.2339L83.2394 97.6357Z" fill="white"/>
<path d="M104.727 115.215C104.727 117.974 102.485 120.215 99.7259 120.215C96.9665 120.215 94.7246 117.974 94.7246 115.215C94.7246 112.457 96.9665 110.216 99.7259 110.216C102.485 110.216 104.727 112.457 104.727 115.215Z" fill="#DA322F"/>
<path d="M98.9559 111.714C98.9559 111.795 98.9852 111.865 99.0438 111.924C99.1024 111.982 99.1722 112.012 99.2532 112.012C99.3341 112.012 99.4039 111.982 99.4626 111.924C99.5212 111.865 99.5505 111.795 99.5505 111.714C99.5505 111.633 99.5212 111.563 99.4626 111.505C99.4039 111.446 99.3341 111.417 99.2532 111.417C99.1722 111.417 99.1024 111.446 99.0438 111.505C98.9852 111.563 98.9559 111.633 98.9559 111.714ZM98.7172 112.615V112.673H98.9977V114.352H98.7172V114.411H99.7892V114.352H99.5086V112.615H98.7172Z" fill="white"/>
<path d="M115.075 124.18C115.075 126.938 112.833 129.18 110.074 129.18C107.314 129.18 105.072 126.938 105.072 124.18C105.072 121.422 107.314 119.181 110.074 119.181C112.833 119.181 115.075 121.422 115.075 124.18Z" fill="#DA322F"/>
<path d="M109.304 120.568C109.304 120.649 109.333 120.719 109.391 120.777C109.45 120.836 109.52 120.865 109.601 120.865C109.682 120.865 109.752 120.836 109.81 120.777C109.869 120.719 109.898 120.649 109.898 120.568C109.898 120.487 109.869 120.417 109.81 120.359C109.752 120.3 109.682 120.271 109.601 120.271C109.52 120.271 109.45 120.3 109.391 120.359C109.333 120.417 109.304 120.487 109.304 120.568ZM109.065 121.468V121.527H109.345V123.206H109.065V123.265H110.137V123.206H109.856V121.468H109.065Z" fill="white"/>
<path d="M86.9648 139.006C87.1373 136.248 89.3792 134.006 92.1385 134.179C94.8979 134.179 97.1398 136.592 96.9673 139.351C96.9673 142.109 94.5529 144.35 91.7936 144.178C89.0343 144.006 86.9648 141.764 86.9648 139.006Z" fill="#DA322F"/>
<path d="M92.7734 142.787C92.7758 142.706 92.7487 142.635 92.6919 142.575C92.635 142.514 92.5662 142.483 92.4852 142.481C92.4043 142.478 92.3337 142.505 92.2733 142.562C92.2129 142.619 92.1815 142.688 92.179 142.769C92.1766 142.85 92.2038 142.92 92.2606 142.981C92.3174 143.041 92.3863 143.072 92.4672 143.075C92.5481 143.077 92.6188 143.05 92.6791 142.993C92.7395 142.937 92.7709 142.868 92.7734 142.787ZM93.0393 141.894L93.0411 141.836L92.7607 141.827L92.8117 140.149L93.0921 140.157L93.0939 140.099L92.0224 140.066L92.0206 140.125L92.301 140.133L92.2483 141.87L93.0393 141.894Z" fill="white"/>
<path d="M87.8262 92.8045C86.9639 95.3904 84.2046 96.942 81.6177 96.08C79.0309 95.218 77.4788 92.4597 78.3411 89.8737C79.2033 87.2877 81.9626 85.7361 84.5495 86.5981C87.1364 87.2877 88.6885 90.0461 87.8262 92.8045Z" fill="#DA322F"/>
<path d="M83.1756 87.5835C83.1521 87.6609 83.1599 87.7362 83.1989 87.8094C83.238 87.8825 83.2963 87.9308 83.3737 87.9543C83.4512 87.9778 83.5265 87.97 83.5997 87.931C83.6728 87.8919 83.7211 87.8336 83.7446 87.7562C83.7682 87.6787 83.7604 87.6034 83.7213 87.5303C83.6823 87.4571 83.624 87.4088 83.5465 87.3853C83.4691 87.3618 83.3938 87.3696 83.3206 87.4087C83.2475 87.4477 83.1991 87.506 83.1756 87.5835ZM82.6856 88.3757L82.6685 88.4318L82.937 88.5132L82.4491 90.12L82.1806 90.0386L82.1635 90.0947L83.1894 90.406L83.2064 90.3499L82.9379 90.2684L83.4429 88.6055L82.6856 88.3757Z" fill="white"/>
</g>
</g>
<defs>
<clipPath id="clip0_679_2490">
<rect width="116.247" height="131.644" fill="white" transform="matrix(-1 0 0 1 117.082 0)"/>
</clipPath>
<clipPath id="clip1_679_2490">
<rect width="96.2308" height="89.3022" fill="white" transform="translate(56.2656 60.0482)"/>
</clipPath>
</defs>
</svg>
