[
    {
      "star": {
        "fill": {
          "color": "rgba(59,120,22,0.87)"
        },
        "stroke": {
          "color": "rgba(59,120,22,0.87)",
          "width": 0
        },
        "radius": 12,
        "radius2": 6
      }
    },
    {
      "star": {
        "fill": {
          "color": "rgba(59,120,22,0.87)"
        },
        "stroke": {
          "color": "rgba(59,120,22,0.87)",
          "width": 0
        },
        "radius": 12,
        "radius2": 6,
        "rotation": 3.141592653589793
      }
    },
    {
      "circle": {
        "fill": {
          "color": "rgba(59,120,22,0.87)"
        },
        "stroke": {
          "color": "rgba(59,120,22,0.87)",
          "width": 0
        },
        "radius": 9
      }
    }
]