[
    {
      "fill": {
        "color": "rgba(23,99,11,0.2)",
        "hatch": {
          "spacing": 10,
          "lineWidth": 1,
          "type": "vertical"
        }
      },
      "stroke": {
        "color": "rgba(23,99,11,1)",
        "width": 2
      }
    }
]