{
    "stylePropertie": "type_signaletique",
    "styles": {
      "99": [
        {
          "legend": "Autre"
        },
        {
          "square": {
            "fill": {
              "color": "rgba(163,163,163,1)"
            },
            "stroke": {
              "color": "rgba(71,71,71,1)",
              "width": 1
            },
            "radius": 8
          }
        }
      ],
      "01": [
        {
          "legend": "Panneau"
        },
        {
          "square": {
            "fill": {
              "color": "rgba(214,104,104,1)"
            },
            "stroke": {
              "color": "rgba(166,54,54,1)",
              "width": 1
            },
            "radius": 8
          }
        }
      ],
      "02": [
        {
          "legend": "Totem"
        },
        {
          "star": {
            "fill": {
              "color": "rgba(214,104,104,1)"
            },
            "stroke": {
              "color": "rgba(168,60,60,1)",
              "width": 1
            },
            "radius": 8,
            "radius2": 6,
            "rotation": 3.141592653589793
          }
        }
      ],
      "03": [
        {
          "legend": "Balise"
        },
        {
          "triangle": {
            "fill": {
              "color": "rgba(252,131,131,1)"
            },
            "stroke": {
              "color": "rgba(209,77,77,1)",
              "width": 1
            },
            "radius": 8,
            "rotation": 1.5707963267948966
          }
        }
      ],
      "04": [
        {
          "legend": "Passage dangereux"
        },
        {
          "circle": {
            "fill": {
              "color": "rgba(255,0,0,1)"
            },
            "stroke": {
              "color": "rgba(255,0,0,1)",
              "width": 1
            },
            "radius": 6
          }
        },
        {
          "square": {
            "fill": {
              "color": "white"
            },
            "stroke": {
              "color": "white",
              "width": 1
            },
            "radius": 2
          }
        }
      ],
      "default": []
    }
}