/*-------------------------------------------------------------------------------------------------- 
* Copyright (c) 2018, IIT Madras All rights reserved.
* 
* Redistribution and use in source and binary forms, with or without modification, are permitted
* provided that the following conditions are met:
* 
* - Redistributions of source code must retain the below copyright notice, this list of conditions
*   and the following disclaimer.  
* - Redistributions in binary form must reproduce the above copyright notice, this list of 
*   conditions and the following disclaimer in the documentation and/or other materials provided 
*   with the distribution.  
* - Neither the name of IIT Madras  nor the names of its contributors may be used to endorse or 
*   promote products derived from this software without specific prior written permission.
* 
* THIS SOFTWARE IS PROVIDED BY THE COPYRIGHT HOLDERS AND CONTRIBUTORS "AS IS" AND ANY EXPRESS
* OR IMPLIED WARRANTIES, INCLUDING, BUT NOT LIMITED TO, THE IMPLIED WARRANTIES OF MERCHANTABILITY
* AND FITNESS FOR A PARTICULAR PURPOSE ARE DISCLAIMED. IN NO EVENT SHALL THE COPYRIGHT HOLDER OR
* CONTRIBUTORS BE LIABLE FOR ANY DIRECT, INDIRECT, INCIDENTAL, SPECIAL, EXEMPLARY, OR CONSEQUENTIAL
* DAMAGES (INCLUDING, BUT NOT LIMITED TO, PROCUREMENT OF SUBSTITUTE GOODS OR SERVICES; LOSS OF USE,
* DATA, OR PROFITS; OR BUSINESS INTERRUPTION) HOWEVER CAUSED AND ON ANY THEORY OF LIABILITY, WHETHER
* IN CONTRACT, STRICT LIABILITY, OR TORT (INCLUDING NEGLIGENCE OR OTHERWISE) ARISING IN ANY WAY OUT 
* OF THE USE OF THIS SOFTWARE, EVEN IF ADVISED OF THE POSSIBILITY OF SUCH DAMAGE.
*
* --------------------------------------------------------------------------------------------------
* Author:  Paul George
* Email id: pg456@snu.edu.in
* ------------------------------------------------------------------------------------------------*/

%module spike_intf

%{
/*
  Header files for the interface

 #include "../c_spike.h"
*/  
  #include "spike_intf.hpp"
%}

/*In Built Interface FIles */
%include "stdint.i"
%include "std_vector.i"
%include "std_pair.i"
%include "typemaps.i"
%include "std_string.i"

/*

%include "../c_spike.h"
  %include "../SpikeIf.hpp"

*/

class spike_intf{
public:
  // Constructors
  spike_intf(std::string);
	// Destructor
  ~spike_intf();
	bool destroy_sim();	
	bool initialise(char* ISA);
	uint32_t single_step();
	uint64_t get_variable(uint32_t address);
	void set_variable(uint32_t address,uint64_t val);
  sim_t* s;
  int ret_num();
	std::string spike_args;
};

