Copyright 1986-2019 Xilinx, Inc. All Rights Reserved.
---------------------------------------------------------------------------------------------------------------------------
| Tool Version : Vivado v.2019.2.1 (lin64) Build 2729669 Thu Dec  5 04:48:12 MST 2019
| Date         : Fri Mar  4 17:35:20 2022
| Host         : aeon running 64-bit Ubuntu 20.04 LTS
| Command      : report_utilization -hierarchical -file /scratch/git-repo/incoresemi/ex-box/f-box/build/fbox//syn_area.txt
| Design       : mk_inst_post
| Device       : 7a100tcsg324-1
| Design State : Synthesized
---------------------------------------------------------------------------------------------------------------------------

Utilization Design Information

Table of Contents
-----------------
1. Utilization by Hierarchy

1. Utilization by Hierarchy
---------------------------

+------------------+--------------------------+------------+------------+---------+------+-----+--------+--------+--------------+
|     Instance     |          Module          | Total LUTs | Logic LUTs | LUTRAMs | SRLs | FFs | RAMB36 | RAMB18 | DSP48 Blocks |
+------------------+--------------------------+------------+------------+---------+------+-----+--------+--------+--------------+
| mk_inst_post     |                    (top) |        391 |        391 |       0 |    0 | 325 |      0 |      0 |            0 |
|   (mk_inst_post) |                    (top) |        349 |        349 |       0 |    0 | 322 |      0 |      0 |            0 |
|   postmul        | mulAddRecFNToRaw_postMul |         37 |         37 |       0 |    0 |   0 |      0 |      0 |            0 |
|   rg_valid_in_0  |                   FIFOL1 |          2 |          2 |       0 |    0 |   1 |      0 |      0 |            0 |
|   rg_valid_in_1  |                 FIFOL1_0 |          2 |          2 |       0 |    0 |   1 |      0 |      0 |            0 |
|   rg_valid_out_0 |                 FIFOL1_1 |          1 |          1 |       0 |    0 |   1 |      0 |      0 |            0 |
+------------------+--------------------------+------------+------------+---------+------+-----+--------+--------+--------------+


