\babel@toc {english}{}
\contentsline {section}{\numberline {1}State Diagram}{2}{section.1}%
\contentsline {section}{\numberline {2}Working inside States}{3}{section.2}%
\contentsline {section}{\numberline {3}Block Diagram Explanation}{7}{section.3}%
\contentsline {section}{\numberline {4}Interface Explanation}{8}{section.4}%
\contentsline {section}{\numberline {5}Data Structure used description}{9}{section.5}%
