[
  {
    "id": 8,
    "name": "Housing and Dwelling",
    "subcategories": [
      {
        "id": 148,
        "name": "Campings"
      },
      {
        "id": 158,
        "name": "Care home"
      },
      {
        "id": 130,
        "name": "Community land trust"
      },
      {
        "id": 198,
        "name": "Community living (for the homeless)"
      },
      {
        "id": 150,
        "name": "Homeless shelters (by night)"
      },
      {
        "id": 149,
        "name": "Hostels"
      },
      {
        "id": 165,
        "name": "Housing cooperatives"
      },
      {
        "id": 131,
        "name": "Legalized squat"
      },
      {
        "id": 168,
        "name": "Participatory housing, cohousing"
      },
      {
        "id": 164,
        "name": "Renters cooperatives"
      },
      {
        "id": 114,
        "name": "Right to housing"
      }
    ],
    "color": "BCBCBC"
  },
  {
    "id": 6,
    "name": "Drinking and Eating",
    "subcategories": [
      {
        "id": 155,
        "name": "Aromatic plants"
      },
      {
        "id": 27,
        "name": "Community-Supported Agriculture (groups)"
      },
      {
        "id": 185,
        "name": "Community-Supported Agriculture (producers)"
      },
      {
        "id": 180,
        "name": "Cooking Classes"
      },
      {
        "id": 115,
        "name": "Drinkable water"
      },
      {
        "id": 182,
        "name": "Food advise"
      },
      {
        "id": 154,
        "name": "Free lunches"
      },
      {
        "id": 170,
        "name": "Market"
      },
      {
        "id": 28,
        "name": "Recuperation of food products"
      },
      {
        "id": 123,
        "name": "Small Breweries"
      },
      {
        "id": 135,
        "name": "Social Grocery Stores"
      },
      {
        "id": 118,
        "name": "Social Restaurants"
      }
    ],
    "color": "95A5A6"
  },
  {
    "id": 11,
    "name": "Getting Clean and Clothed",
    "subcategories": [
      {
        "id": 46,
        "name": "Give-away shops"
      },
      {
        "id": 210,
        "name": "Give Boxes"
      },
      {
        "id": 144,
        "name": "Public showers"
      },
      {
        "id": 207,
        "name": "Public toilets"
      },
      {
        "id": 104,
        "name": "Second-hand clothes"
      },
      {
        "id": 156,
        "name": "Social Clothing Store"
      }
    ],
    "color": "848482"
  },
  {
    "id": 12,
    "name": "Lighting Up and Warming Up",
    "subcategories": [
      {
        "id": 122,
        "name": "Energy advisors"
      },
      {
        "id": 195,
        "name": "Homeless booths"
      },
      {
        "id": 176,
        "name": "Solar techniques"
      },
      {
        "id": 134,
        "name": "Support for renovation"
      }
    ],
    "color": "948279"
  },
  {
    "id": 10,
    "name": "Healing and Caring",
    "subcategories": [
      {
        "id": 18,
        "name": "Community health center"
      },
      {
        "id": 192,
        "name": "Control of addictions"
      },
      {
        "id": 199,
        "name": "Defibrillators (free access)"
      },
      {
        "id": 145,
        "name": "Health networks"
      },
      {
        "id": 157,
        "name": "Health services for the homeless"
      },
      {
        "id": 190,
        "name": "Mental health associations"
      },
      {
        "id": 143,
        "name": "Palliative care associations"
      },
      {
        "id": 208,
        "name": "Public hospitals"
      },
      {
        "id": 191,
        "name": "Therapeutic communities"
      }
    ],
    "color": "59706a"
  },
  {
    "id": 1,
    "name": "Recycling and Repairing",
    "subcategories": [
      {
        "id": 50,
        "name": "Book boxes"
      },
      {
        "id": 132,
        "name": "Community composting"
      },
      {
        "id": 120,
        "name": "Flea market"
      },
      {
        "id": 205,
        "name": "Glass recycling"
      },
      {
        "id": 42,
        "name": "Repair cafés"
      },
      {
        "id": 113,
        "name": "Reused building materials"
      },
      {
        "id": 47,
        "name": "Reused computer material"
      },
      {
        "id": 136,
        "name": "Reusing inkcartridges"
      },
      {
        "id": 206,
        "name": "Used clothes bins"
      },
      {
        "id": 138,
        "name": "Woodworking workshops"
      }
    ],
    "color": "16A085"
  },
  {
    "id": 7,
    "name": "Breathing and Going Green",
    "subcategories": [
      {
        "id": 127,
        "name": "Beekeeping associations"
      },
      {
        "id": 121,
        "name": "Community composting"
      },
      {
        "id": 194,
        "name": "Naturalist association"
      },
      {
        "id": 133,
        "name": "Natural reserves"
      },
      {
        "id": 129,
        "name": "Public parcs"
      },
      {
        "id": 125,
        "name": "Seed exchange"
      },
      {
        "id": 128,
        "name": "Support for gardeners"
      },
      {
        "id": 116,
        "name": "Vegetable gardens"
      }
    ],
    "color": "27AE60"
  },
  {
    "id": 3,
    "name": "Meeting and Helping Each Other",
    "subcategories": [
      {
        "id": 202,
        "name": "Associations for gender equality"
      },
      {
        "id": 204,
        "name": "Community centers NL"
      },
      {
        "id": 211,
        "name": "Complementary currency"
      },
      {
        "id": 209,
        "name": "International cooperation and solidarity"
      },
      {
        "id": 184,
        "name": "Local exchange trading system"
      },
      {
        "id": 102,
        "name": "Neighborhood Committees"
      },
      {
        "id": 10,
        "name": "Neighborhood houses"
      },
      {
        "id": 197,
        "name": "Recent immigrants welcoming"
      },
      {
        "id": 188,
        "name": "Refugees welcome"
      },
      {
        "id": 119,
        "name": "School Support Associations"
      },
      {
        "id": 14,
        "name": "Support for family and children"
      },
      {
        "id": 16,
        "name": "Support for people with disabilities"
      },
      {
        "id": 19,
        "name": "Support for seniors"
      },
      {
        "id": 193,
        "name": "Support for the homeless"
      },
      {
        "id": 201,
        "name": "Transition initiatives"
      },
      {
        "id": 15,
        "name": "Women's association"
      },
      {
        "id": 17,
        "name": "Youth House"
      }
    ],
    "color": "2980B9"
  },
  {
    "id": 2,
    "name": "Learning and Training",
    "subcategories": [
      {
        "id": 187,
        "name": "Adapted work companies"
      },
      {
        "id": 13,
        "name": "Adult and continuing education"
      },
      {
        "id": 87,
        "name": "Coworking, shared offices"
      },
      {
        "id": 91,
        "name": "Defense of cultural heritage"
      },
      {
        "id": 92,
        "name": "Public libraries"
      },
      {
        "id": 12,
        "name": "Support fo local economy"
      },
      {
        "id": 103,
        "name": "Training centres"
      },
      {
        "id": 90,
        "name": "Urban ecology associations"
      }
    ],
    "color": "34495E"
  },
  {
    "id": 13,
    "name": "Expressing Yourself and Communicating",
    "subcategories": [
      {
        "id": 124,
        "name": "Free Internet access"
      },
      {
        "id": 174,
        "name": "Free Software Associations"
      },
      {
        "id": 43,
        "name": "Hackerspaces"
      },
      {
        "id": 109,
        "name": "Independent media"
      },
      {
        "id": 177,
        "name": "Scrivener"
      }
    ],
    "color": "BD3525"
  },
  {
    "id": 9,
    "name": "Transportation and Hauling",
    "subcategories": [
      {
        "id": 212,
        "name": "Bicycle pumps"
      },
      {
        "id": 140,
        "name": "Bike deliveries"
      },
      {
        "id": 179,
        "name": "Bike lessons"
      },
      {
        "id": 147,
        "name": "Bikessharing"
      },
      {
        "id": 71,
        "name": "Bike workshops"
      },
      {
        "id": 141,
        "name": "Carsharing"
      },
      {
        "id": 196,
        "name": "Taxisharing"
      }
    ],
    "color": "D35400"
  },
  {
    "id": 4,
    "name": "Going Out and Hobbies",
    "subcategories": [
      {
        "id": 171,
        "name": "'Art Deco’ walks"
      },
      {
        "id": 173,
        "name": "'Art Nouvau’ walks"
      },
      {
        "id": 200,
        "name": "'Comic strips’ walks"
      },
      {
        "id": 110,
        "name": "Concert places"
      },
      {
        "id": 117,
        "name": "Dance schools"
      },
      {
        "id": 186,
        "name": "Holiday for all"
      },
      {
        "id": 139,
        "name": "Independant cinemas"
      },
      {
        "id": 100,
        "name": "Literary walks"
      },
      {
        "id": 111,
        "name": "Museums and exhibitions"
      },
      {
        "id": 203,
        "name": "Music classes for all"
      },
      {
        "id": 96,
        "name": "Sport clubs and infrastructures"
      },
      {
        "id": 183,
        "name": "'Street Art’ walks"
      },
      {
        "id": 98,
        "name": "Theatres"
      }
    ],
    "color": "EEAD0E"
  }
]
