<svg width="22" height="22" viewBox="0 0 22 22" fill="none" xmlns="http://www.w3.org/2000/svg">
<path fill-rule="evenodd" clip-rule="evenodd" d="M22 11C22 17.0751 17.0751 22 11 22C4.92487 22 0 17.0751 0 11C0 4.92487 4.92487 0 11 0C17.0751 0 22 4.92487 22 11ZM16.3314 11.8315C16.1621 11.6018 16.1242 11.3693 16.2167 11.1338C16.2814 10.9576 16.5922 10.517 16.9752 9.97418C17.9581 8.58087 19.4164 6.51378 18.4086 6.51378C17.7572 6.52244 17.0164 6.51937 16.3195 6.51649L16.3192 6.51649C15.9868 6.51511 15.6645 6.51378 15.3666 6.51378C15.1954 6.55547 15.0845 6.64534 15.0152 6.82821C14.4757 8.07212 13.8156 9.59012 12.8481 10.5657C12.7208 10.6683 12.6415 10.664 12.4965 10.626C12.1209 10.2306 12.1748 9.3043 12.2279 8.39188C12.2707 7.65561 12.313 6.92838 12.1287 6.49643C12.0474 6.3071 11.8694 6.22159 11.6872 6.17344C10.7658 5.95385 8.66152 6.08456 8.31818 6.52657C8.22003 6.65293 8.20634 6.72188 8.27719 6.73322C8.60433 6.78483 8.83591 6.90829 8.97221 7.10349C9.22935 7.66975 9.41885 10.6861 8.66152 10.6861C7.90419 10.6861 6.68297 7.72588 6.34748 6.90525C6.2582 6.65816 6.03093 6.5165 5.79145 6.47469L3.55093 6.49182C3.1571 6.49182 2.937 6.68609 3.07658 7.07749C4.24354 9.97419 6.79725 15.589 10.714 15.4484C10.7999 15.4484 10.8994 15.4556 11.0056 15.4634L11.0056 15.4634C11.3843 15.4909 11.8485 15.5246 12.0878 15.2589C12.2691 15.0184 12.2771 14.6971 12.2851 14.3788C12.2957 13.9576 12.3062 13.5419 12.7174 13.3257C12.8995 13.2288 13.0883 13.3101 13.2448 13.4292C13.5587 13.6683 13.8151 13.9779 14.0701 14.2858L14.0701 14.2859C14.4675 14.7658 14.8616 15.2417 15.4649 15.4402C15.6391 15.4975 15.7917 15.5119 15.9227 15.4832L18.016 15.4488C18.4046 15.4488 18.7875 15.2759 18.707 14.8113C18.4789 14.0666 17.742 13.3063 17.0275 12.5692C16.7861 12.3202 16.5472 12.0738 16.3314 11.8315Z" fill="#C67F7C"/>
</svg>
