%YAML 1.1
%TAG !u! tag:unity3d.com,2011:
--- !u!1001 &8251564504239590733
PrefabInstance:
  m_ObjectHideFlags: 0
  serializedVersion: 2
  m_Modification:
    serializedVersion: 3
    m_TransformParent: {fileID: 0}
    m_Modifications:
    - target: {fileID: 1023490049680874, guid: 0120696b197baa24f933e17ce5431cb8, type: 3}
      propertyPath: m_Name
      value: FirePlace Variant
      objectReference: {fileID: 0}
    - target: {fileID: 1027087773169452, guid: 0120696b197baa24f933e17ce5431cb8, type: 3}
      propertyPath: m_StaticEditorFlags
      value: 4294967295
      objectReference: {fileID: 0}
    - target: {fileID: 1565664643527696, guid: 0120696b197baa24f933e17ce5431cb8, type: 3}
      propertyPath: m_StaticEditorFlags
      value: 4294967295
      objectReference: {fileID: 0}
    - target: {fileID: 1841833462274580, guid: 0120696b197baa24f933e17ce5431cb8, type: 3}
      propertyPath: m_StaticEditorFlags
      value: 4294967295
      objectReference: {fileID: 0}
    - target: {fileID: 1937588662969704, guid: 0120696b197baa24f933e17ce5431cb8, type: 3}
      propertyPath: m_StaticEditorFlags
      value: 4294967295
      objectReference: {fileID: 0}
    - target: {fileID: 1938618791589900, guid: 0120696b197baa24f933e17ce5431cb8, type: 3}
      propertyPath: m_StaticEditorFlags
      value: 4294967295
      objectReference: {fileID: 0}
    - target: {fileID: 4645122967186676, guid: 0120696b197baa24f933e17ce5431cb8, type: 3}
      propertyPath: m_RootOrder
      value: 7
      objectReference: {fileID: 0}
    - target: {fileID: 4645122967186676, guid: 0120696b197baa24f933e17ce5431cb8, type: 3}
      propertyPath: m_LocalPosition.x
      value: 7.7050304
      objectReference: {fileID: 0}
    - target: {fileID: 4645122967186676, guid: 0120696b197baa24f933e17ce5431cb8, type: 3}
      propertyPath: m_LocalPosition.y
      value: 1.518781
      objectReference: {fileID: 0}
    - target: {fileID: 4645122967186676, guid: 0120696b197baa24f933e17ce5431cb8, type: 3}
      propertyPath: m_LocalPosition.z
      value: -1.7826245
      objectReference: {fileID: 0}
    - target: {fileID: 4645122967186676, guid: 0120696b197baa24f933e17ce5431cb8, type: 3}
      propertyPath: m_LocalRotation.w
      value: 0.70710695
      objectReference: {fileID: 0}
    - target: {fileID: 4645122967186676, guid: 0120696b197baa24f933e17ce5431cb8, type: 3}
      propertyPath: m_LocalRotation.x
      value: -0
      objectReference: {fileID: 0}
    - target: {fileID: 4645122967186676, guid: 0120696b197baa24f933e17ce5431cb8, type: 3}
      propertyPath: m_LocalRotation.y
      value: 0.7071067
      objectReference: {fileID: 0}
    - target: {fileID: 4645122967186676, guid: 0120696b197baa24f933e17ce5431cb8, type: 3}
      propertyPath: m_LocalRotation.z
      value: -0
      objectReference: {fileID: 0}
    m_RemovedComponents: []
    m_RemovedGameObjects: []
    m_AddedGameObjects: []
    m_AddedComponents:
    - targetCorrespondingSourceObject: {fileID: 1253880530534838, guid: 0120696b197baa24f933e17ce5431cb8, type: 3}
      insertIndex: -1
      addedObject: {fileID: 936157604421623125}
    - targetCorrespondingSourceObject: {fileID: 1442274154156300, guid: 0120696b197baa24f933e17ce5431cb8, type: 3}
      insertIndex: -1
      addedObject: {fileID: 6629080977573612297}
    - targetCorrespondingSourceObject: {fileID: 1862868841612032, guid: 0120696b197baa24f933e17ce5431cb8, type: 3}
      insertIndex: -1
      addedObject: {fileID: 9177431487018133824}
  m_SourcePrefab: {fileID: 100100000, guid: 0120696b197baa24f933e17ce5431cb8, type: 3}
--- !u!1 &8252261885387017805 stripped
GameObject:
  m_CorrespondingSourceObject: {fileID: 1862868841612032, guid: 0120696b197baa24f933e17ce5431cb8, type: 3}
  m_PrefabInstance: {fileID: 8251564504239590733}
  m_PrefabAsset: {fileID: 0}
--- !u!114 &9177431487018133824
MonoBehaviour:
  m_ObjectHideFlags: 0
  m_CorrespondingSourceObject: {fileID: 0}
  m_PrefabInstance: {fileID: 0}
  m_PrefabAsset: {fileID: 0}
  m_GameObject: {fileID: 8252261885387017805}
  m_Enabled: 1
  m_EditorHideFlags: 0
  m_Script: {fileID: 11500000, guid: 474bcb49853aa07438625e644c072ee6, type: 3}
  m_Name: 
  m_EditorClassIdentifier: 
  m_Version: 3
  m_UsePipelineSettings: 1
  m_AdditionalLightsShadowResolutionTier: 2
  m_LightLayerMask: 1
  m_RenderingLayers: 1
  m_CustomShadowLayers: 0
  m_ShadowLayerMask: 1
  m_ShadowRenderingLayers: 1
  m_LightCookieSize: {x: 1, y: 1}
  m_LightCookieOffset: {x: 0, y: 0}
  m_SoftShadowQuality: 0
--- !u!1 &8252403829003050049 stripped
GameObject:
  m_CorrespondingSourceObject: {fileID: 1442274154156300, guid: 0120696b197baa24f933e17ce5431cb8, type: 3}
  m_PrefabInstance: {fileID: 8251564504239590733}
  m_PrefabAsset: {fileID: 0}
--- !u!114 &6629080977573612297
MonoBehaviour:
  m_ObjectHideFlags: 0
  m_CorrespondingSourceObject: {fileID: 0}
  m_PrefabInstance: {fileID: 0}
  m_PrefabAsset: {fileID: 0}
  m_GameObject: {fileID: 8252403829003050049}
  m_Enabled: 1
  m_EditorHideFlags: 0
  m_Script: {fileID: 11500000, guid: 474bcb49853aa07438625e644c072ee6, type: 3}
  m_Name: 
  m_EditorClassIdentifier: 
  m_Version: 3
  m_UsePipelineSettings: 1
  m_AdditionalLightsShadowResolutionTier: 2
  m_LightLayerMask: 1
  m_RenderingLayers: 1
  m_CustomShadowLayers: 0
  m_ShadowLayerMask: 1
  m_ShadowRenderingLayers: 1
  m_LightCookieSize: {x: 1, y: 1}
  m_LightCookieOffset: {x: 0, y: 0}
  m_SoftShadowQuality: 0
--- !u!1 &8252571814588402939 stripped
GameObject:
  m_CorrespondingSourceObject: {fileID: 1253880530534838, guid: 0120696b197baa24f933e17ce5431cb8, type: 3}
  m_PrefabInstance: {fileID: 8251564504239590733}
  m_PrefabAsset: {fileID: 0}
--- !u!114 &936157604421623125
MonoBehaviour:
  m_ObjectHideFlags: 0
  m_CorrespondingSourceObject: {fileID: 0}
  m_PrefabInstance: {fileID: 0}
  m_PrefabAsset: {fileID: 0}
  m_GameObject: {fileID: 8252571814588402939}
  m_Enabled: 1
  m_EditorHideFlags: 0
  m_Script: {fileID: 11500000, guid: 474bcb49853aa07438625e644c072ee6, type: 3}
  m_Name: 
  m_EditorClassIdentifier: 
  m_Version: 3
  m_UsePipelineSettings: 1
  m_AdditionalLightsShadowResolutionTier: 2
  m_LightLayerMask: 1
  m_RenderingLayers: 1
  m_CustomShadowLayers: 0
  m_ShadowLayerMask: 1
  m_ShadowRenderingLayers: 1
  m_LightCookieSize: {x: 1, y: 1}
  m_LightCookieOffset: {x: 0, y: 0}
  m_SoftShadowQuality: 0
