module gitlab.com/imt-tristan-leroy/l3/projet-web/risky-api

go 1.17

require (
	github.com/go-playground/validator/v10 v10.9.0
	github.com/gofiber/fiber/v2 v2.18.0
	github.com/golang-jwt/jwt/v4 v4.0.0
	github.com/google/uuid v1.3.0
	github.com/joho/godotenv v1.3.0
	golang.org/x/crypto v0.0.0-20210817164053-32db794688a5
	gorm.io/driver/postgres v1.1.1
	gorm.io/gorm v1.21.15
)

require (
	github.com/andybalholm/brotli v1.0.3 // indirect
	github.com/go-playground/locales v0.14.0 // indirect
	github.com/go-playground/universal-translator v0.18.0 // indirect
	github.com/jackc/chunkreader/v2 v2.0.1 // indirect
	github.com/jackc/pgconn v1.10.0 // indirect
	github.com/jackc/pgio v1.0.0 // indirect
	github.com/jackc/pgpassfile v1.0.0 // indirect
	github.com/jackc/pgproto3/v2 v2.1.1 // indirect
	github.com/jackc/pgservicefile v0.0.0-20200714003250-2b9c44734f2b // indirect
	github.com/jackc/pgtype v1.8.1 // indirect
	github.com/jackc/pgx/v4 v4.13.0 // indirect
	github.com/jinzhu/inflection v1.0.0 // indirect
	github.com/jinzhu/now v1.1.2 // indirect
	github.com/klauspost/compress v1.13.5 // indirect
	github.com/leodido/go-urn v1.2.1 // indirect
	github.com/valyala/bytebufferpool v1.0.0 // indirect
	github.com/valyala/fasthttp v1.30.0 // indirect
	github.com/valyala/tcplisten v1.0.0 // indirect
	golang.org/x/sys v0.0.0-20210806184541-e5e7981a1069 // indirect
	golang.org/x/text v0.3.7 // indirect
)
