{
    "confusion_matrix": [
        [
            90,
            63
        ],
        [
            50,
            117
        ]
    ],
    "accuracy_score": {
        "scores": [
            0.59375,
            0.6875,
            0.53125,
            0.75,
            0.71875,
            0.6875,
            0.53125,
            0.625,
            0.59375,
            0.75
        ],
        "means": 0.646875
    },
    "precision_score": {
        "scores": [
            0.625,
            0.6842105263157895,
            0.55,
            0.8,
            0.7,
            0.6842105263157895,
            0.5555555555555556,
            0.6,
            0.5882352941176471,
            0.75
        ],
        "means": 0.6537211902304781
    },
    "recall_score": {
        "scores": [
            0.5882352941176471,
            0.7647058823529411,
            0.6470588235294118,
            0.7058823529411765,
            0.8235294117647058,
            0.7647058823529411,
            0.5882352941176471,
            0.75,
            0.625,
            0.75
        ],
        "means": 0.7007352941176471
    },
    "f1_score": {
        "scores": [
            0.6060606060606061,
            0.7222222222222222,
            0.5945945945945946,
            0.7500000000000001,
            0.7567567567567567,
            0.7222222222222222,
            0.5714285714285715,
            0.6666666666666665,
            0.6060606060606061,
            0.75
        ],
        "means": 0.6746012246012246
    }
}