<svg width="11" height="11" viewBox="0 0 11 11" fill="none" xmlns="http://www.w3.org/2000/svg">
<path fill-rule="evenodd" clip-rule="evenodd" d="M0.542893 0.542893C0.152369 0.933417 0.152369 1.56658 0.542894 1.95711L4.07843 5.49264L0.542893 9.02818C0.152369 9.4187 0.152369 10.0519 0.542893 10.4424C0.933417 10.8329 1.56658 10.8329 1.95711 10.4424L5.49264 6.90685L9.02818 10.4424C9.4187 10.8329 10.0519 10.8329 10.4424 10.4424C10.8329 10.0519 10.8329 9.4187 10.4424 9.02817L6.90685 5.49264L10.4424 1.95711C10.8329 1.56658 10.8329 0.933418 10.4424 0.542893C10.0519 0.152369 9.4187 0.152369 9.02817 0.542894L5.49264 4.07843L1.95711 0.542893C1.56658 0.152369 0.933418 0.152369 0.542893 0.542893Z" fill="#F52C47"/>
</svg>
