[
  {
    "model": "hr_info.specialization",
    "pk": 1,
    "fields": {
      "name": "Разработка"
    }
  },
  {
    "model": "hr_info.specialization",
    "pk": 2,
    "fields": {
      "name": "Аналитика"
    }
  },
  {
    "model": "hr_info.specialization",
    "pk": 3,
    "fields": {
      "name": "Менеджмент"
    }
  },
  {
    "model": "hr_info.specializationpossibletraits",
    "pk": 4,
    "fields": {
      "name": "Python",
      "specialization": 1,
      "text": "Навыки разработки программ на Python"
    }
  },
  {
    "model": "hr_info.specializationpossibletraits",
    "pk": 5,
    "fields": {
      "name": "C++",
      "specialization": 1,
      "text": "Навыки разработки программ на C++"
    }
  },
  {
    "model": "hr_info.specializationpossibletraits",
    "pk": 6,
    "fields": {
      "name": "Go",
      "specialization": 1,
      "text": "Навыки разработки программ на Go"
    }
  },
  {
    "model": "hr_info.specializationpossibletraits",
    "pk": 7,
    "fields": {
      "name": "SQL",
      "specialization": 2,
      "text": "Навыки написания сложны SQL-запросов"
    }
  },
  {
    "model": "hr_info.specializationpossibletraits",
    "pk": 8,
    "fields": {
      "name": "R",
      "specialization": 2,
      "text": "Навыки использования R"
    }
  },
  {
    "model": "hr_info.specializationpossibletraits",
    "pk": 9,
    "fields": {
      "name": "Agile",
      "specialization": 3,
      "text": "Уметь в гибки методологии разработки"
    }
  },
  {
    "model": "hr_info.specializationpossibletraits",
    "pk": 10,
    "fields": {
      "name": "Scrum",
      "specialization": 3,
      "text": "Уметь в гибки методологии разработки"
    }
  },
  {
    "model": "hr_info.specializationpossibletraits",
    "pk": 11,
    "fields": {
      "name": "Kanban",
      "specialization": 3,
      "text": "Уметь в гибки методологии разработки"
    }
  }
]
