<svg width="165" height="237" viewBox="0 0 165 237" fill="none" xmlns="http://www.w3.org/2000/svg">
<path d="M68.876 235.074C97.0425 235.074 119.876 232.164 119.876 228.574C119.876 224.985 97.0425 222.074 68.876 222.074C40.7095 222.074 17.876 224.985 17.876 228.574C17.876 232.164 40.7095 235.074 68.876 235.074Z" fill="black" fill-opacity="0.04"/>
<path d="M99.9058 164.448C98.7578 198.316 130.904 216.111 161.902 193.15C152.143 184.539 136.644 160.43 99.9058 164.448Z" fill="#FE6054"/>
<path d="M99.9058 164.448C98.7578 198.316 130.904 216.111 161.902 193.15C152.143 184.539 136.644 160.43 99.9058 164.448Z" fill="url(#paint0_linear)"/>
<path d="M99.9058 164.448C98.7578 198.316 130.904 216.111 161.902 193.15C152.143 184.539 136.644 160.43 99.9058 164.448Z" fill="url(#paint1_linear)"/>
<path fill-rule="evenodd" clip-rule="evenodd" d="M136.512 203.381C136.946 202.583 137.375 201.665 137.767 200.612C138.345 199.06 137.556 197.897 136.754 196.715C136.129 195.794 135.497 194.861 135.496 193.724C135.496 192.448 136.576 191.642 137.695 190.806C138.74 190.027 139.819 189.221 140.089 187.983C140.29 187.058 139.989 186.049 139.687 185.039C139.315 183.792 138.941 182.542 139.515 181.445C140.044 180.432 140.846 180.143 141.699 179.835C142.522 179.539 143.393 179.225 144.107 178.225C144.404 177.809 144.601 177.32 144.724 176.778C145.114 177.084 145.498 177.392 145.876 177.701C147.793 179.268 149.669 180.933 151.474 182.535C156.289 186.807 160.603 190.636 163.876 191C159.376 198 146.26 202.112 138.876 203.129C138.082 203.238 137.294 203.322 136.512 203.381Z" fill="#FFCCA1"/>
<path fill-rule="evenodd" clip-rule="evenodd" d="M136.512 203.381C136.946 202.583 137.375 201.665 137.767 200.612C138.345 199.06 137.556 197.897 136.754 196.715C136.129 195.794 135.497 194.861 135.496 193.724C135.496 192.448 136.576 191.642 137.695 190.806C138.74 190.027 139.819 189.221 140.089 187.983C140.29 187.058 139.989 186.049 139.687 185.039C139.315 183.792 138.941 182.542 139.515 181.445C140.044 180.432 140.846 180.143 141.699 179.835C142.522 179.539 143.393 179.225 144.107 178.225C144.404 177.809 144.601 177.32 144.724 176.778C145.114 177.084 145.498 177.392 145.876 177.701C147.793 179.268 149.669 180.933 151.474 182.535C156.289 186.807 160.603 190.636 163.876 191C159.376 198 146.26 202.112 138.876 203.129C138.082 203.238 137.294 203.322 136.512 203.381Z" fill="url(#paint2_linear)"/>
<path d="M54.8759 194C54.8759 210.826 49.8759 223.926 46.8759 225.5C44.8521 226.562 43.3759 227 41.3759 227.5C40.4539 227.731 36.3759 228.5 35.876 227.5C34.8759 225.5 38.4136 223.962 40.376 222C41.876 220.5 40.225 216.182 39.8759 214C37.8759 201.5 35.8759 180.422 35.8759 177C35.8759 171.753 40.1292 169 45.3759 169C50.6226 169 54.8759 182.5 54.8759 194Z" fill="#FE6054"/>
<path d="M82.876 194C82.876 210.826 87.876 223.926 90.876 225.5C92.8999 226.562 94.376 227 96.376 227.5C97.298 227.731 101.376 228.5 101.876 227.5C102.876 225.5 99.3384 223.962 97.376 222C95.876 220.5 97.5269 216.182 97.876 214C99.876 201.5 101.876 180.422 101.876 177C101.876 171.753 97.6227 169 92.376 169C87.1293 169 82.876 182.5 82.876 194Z" fill="#FE6054"/>
<path d="M53.876 124.5C53.876 130.575 40.0526 135.045 34.376 137.5C24.4764 141.781 17.9557 147.569 13.376 151C9.39733 153.98 6.43286 155.592 3.87597 153.5C2.50922 152.382 2.79174 149.38 4.37598 145.5C9.16693 133.766 25.7157 114 43.376 114C49.4511 114 53.876 118.425 53.876 124.5Z" fill="#FE6054"/>
<path d="M83.876 124.5C83.876 130.575 97.6994 135.045 103.376 137.5C113.276 141.781 119.796 147.569 124.376 151C128.355 153.98 131.319 155.592 133.876 153.5C135.243 152.382 134.96 149.38 133.376 145.5C128.585 133.766 112.036 114 94.376 114C88.3008 114 83.876 118.425 83.876 124.5Z" fill="#FE6054"/>
<path d="M107.876 160C107.876 183.196 95.376 202 68.876 202C42.376 202 29.876 183.196 29.876 160C29.876 136.804 47.3369 94 68.876 94C90.4151 94 107.876 136.804 107.876 160Z" fill="#FE6054"/>
<path d="M107.876 160C107.876 183.196 95.376 202 68.876 202C42.376 202 29.876 183.196 29.876 160C29.876 136.804 47.3369 94 68.876 94C90.4151 94 107.876 136.804 107.876 160Z" fill="url(#paint3_linear)"/>
<path d="M107.876 160C107.876 183.196 95.376 202 68.876 202C42.376 202 29.876 183.196 29.876 160C29.876 136.804 47.3369 94 68.876 94C90.4151 94 107.876 136.804 107.876 160Z" fill="url(#paint4_radial)"/>
<ellipse cx="68.876" cy="173" rx="27" ry="21" fill="#FFCCA1"/>
<path d="M4.37599 145.5C2.79176 149.38 2.50921 152.382 3.87596 153.5C6.43285 155.592 9.39731 153.98 13.376 151C8.87598 151 6.87598 150 4.37599 145.5Z" fill="black"/>
<path d="M133.376 145.5C134.96 149.38 135.243 152.382 133.876 153.5C131.319 155.592 128.355 153.98 124.376 151C128.876 151 130.876 150 133.376 145.5Z" fill="black"/>
<path d="M40.5 221.231L33.5 184.731L31 174.731L68 179.731L106.5 174.731L97.5 221.231C93.157 223.064 90.6001 222.817 86.5 221.231C86.5 221.231 83 206.731 83 200.231C76 202.231 73.5 202.231 67.5 202.231C61.5 202.231 55 200.231 55 200.231L51.5 220.5C47.3552 222.188 45.3265 222.88 40.5 221.231Z" fill="#365E6B"/>
<path d="M106 178.231C106 178.231 93.9094 178.27 87.5 177.269C87.4552 182.724 89.3858 191.146 94.8128 194.736C97.8081 196.719 99.3944 198.246 101 198.731L106 178.231Z" fill="#2E515C"/>
<path d="M32.5143 178.727C32.5143 178.727 38.6617 179.729 45.0711 178.727C45.1159 184.182 44.6824 192.604 39.2555 196.194C36.5711 197.506 38.1766 197.021 36.5711 197.506L34.0711 188.006L32.5143 178.727Z" fill="#2E515C"/>
<path d="M31 173.231L32.5 180.731C32.5 180.731 61.6183 186.348 71 185.01V178.725C71 178.725 44.5165 178.409 31 173.231Z" fill="#2E515C"/>
<path d="M66.0003 182.386C66.0007 182.936 66.1748 183.48 66.5107 183.981C66.8467 184.481 67.3367 184.927 67.9478 185.288C68.5589 185.649 69.2768 185.917 70.0531 186.073C70.8293 186.229 71.6459 186.271 72.4477 186.194L105 183.981L107 174.731C107 174.731 97.1197 176.917 70.9765 178.564C69.5978 178.669 68.3258 179.119 67.4065 179.825C66.4873 180.531 65.9862 181.444 66.0003 182.386Z" fill="#417080"/>
<path d="M66.0405 185.231C66.8762 190.843 65.9847 196.753 67.3979 198.076C68.411 198.928 70.8524 199.167 73 199.072C69.5658 199.566 66.5773 198.847 65.9898 197.804C64.7032 196.048 64.9514 191.183 65.1996 189.227C65.3668 187.9 65.615 186.563 66.0405 185.231Z" fill="#2E515C"/>
<path d="M70 184.231C71.1046 184.231 72 183.336 72 182.231C72 181.127 71.1046 180.231 70 180.231C68.8954 180.231 68 181.127 68 182.231C68 183.336 68.8954 184.231 70 184.231Z" fill="#6BA1B3"/>
<path d="M56.1565 186.231L53 185.614L54.8542 176.231L58 176.913L56.1565 186.231Z" fill="#345F6D"/>
<path d="M82.065 186.231L80 176.665L82.975 176.231L85 185.627L82.065 186.231Z" fill="#345F6D"/>
<path d="M16.0276 127.624C16.0276 127.624 31.3136 138.076 32.0133 142.985L36.7091 136.826L42.857 123.307L29.5 116.5L16.0276 127.624Z" fill="white"/>
<path d="M119.816 126.138C119.816 126.138 104.53 136.591 103.83 141.5L99.1342 135.34L92.9862 121.821L106.343 115.015L119.816 126.138Z" fill="white"/>
<path d="M29 116.5C29 116.5 34.0015 134.193 34.0015 137.874C24.4705 149.161 26.5885 167.973 25 177.11C25 177.11 82.7155 187.323 109.72 178.23C109.72 178.23 111.838 153.461 104.425 135.187C104.582 134.425 107 115 107 115L86.2229 111C86.2229 111 80.055 116.5 64 116.5C51.1741 116.5 45.2344 112.124 45.2344 112.124L29 116.5Z" fill="#2F2F2F"/>
<path d="M6.3219 141.688L16.3418 147.857L14.1757 151.032C13.9323 151.388 13.442 151.572 12.8126 151.543C12.1833 151.514 11.4664 151.274 10.8197 150.876L5.67633 147.709C5.02966 147.311 4.50616 146.787 4.22099 146.253C3.93582 145.72 3.91235 145.219 4.15573 144.863L6.3219 141.688Z" fill="#434F63"/>
<path d="M45.894 110.754C45.894 110.754 28.818 114.564 18.7608 123.767C12.9362 129.225 8.41348 135.615 5.30716 142.777C5.14587 143.157 5.18026 143.624 5.40497 144.106C5.62969 144.589 6.03218 145.06 6.55005 145.446C9.44972 147.599 15.1051 151.311 17.1021 149.117C19.8229 146.137 34.7098 136.498 42.5 135.5L45.894 110.754Z" fill="#53627B"/>
<path d="M17 125.5C16.751 125.718 16.6061 126.051 16.3774 126.271L29.5 140.5C30.5 140 31.7618 139.594 32.5 139L18.5 124C17.9988 124.394 17.4727 125.079 17 125.5Z" fill="#677691"/>
<path d="M12.0304 131.189L24 144C24.722 143.245 26.5 142.5 27 142L14.0901 128.744C13.3645 129.561 12.6779 130.375 12.0304 131.189Z" fill="#677691"/>
<path d="M131.74 141.688L121.72 147.857L123.886 151.032C124.129 151.388 124.62 151.572 125.249 151.543C125.878 151.514 126.595 151.274 127.242 150.876L132.385 147.709C133.032 147.311 133.555 146.787 133.841 146.253C134.126 145.72 134.149 145.219 133.906 144.863L131.74 141.688Z" fill="#434F63"/>
<path d="M92.1677 110.754C92.1677 110.754 109.244 114.564 119.301 123.767C125.126 129.225 129.648 135.615 132.755 142.777C132.916 143.157 132.882 143.624 132.657 144.106C132.432 144.589 132.03 145.06 131.512 145.446C128.612 147.599 122.957 151.311 120.96 149.117C118.239 146.137 103.352 136.498 95.5618 135.5L92.1677 110.754Z" fill="#53627B"/>
<path d="M121.062 125.5C121.311 125.718 121.456 126.051 121.684 126.271L108.562 140.5C107.562 140 106.3 139.594 105.562 139L119.562 124C120.063 124.394 120.589 125.079 121.062 125.5Z" fill="#677691"/>
<path d="M126.031 131.189L114.062 144C113.34 143.245 111.562 142.5 111.062 142L123.972 128.744C124.697 129.561 125.384 130.375 126.031 131.189Z" fill="#677691"/>
<path d="M61.9429 185.3C61.7743 186.544 61.5996 187.819 61.419 189.125C44.845 188.071 28 184.133 28 184.133V180C29.9745 180.561 32.0068 181.065 34.0876 181.512C42.829 183.668 52.2793 184.953 61.9429 185.3Z" fill="#434F63"/>
<path d="M110.583 114.727C87.8224 111.303 88.1656 103.703 75.2496 103.158C75.2496 103.158 66.2174 102.803 62.7671 103.158C49.8421 103.703 50.1943 111.303 27.4332 114.727C25.8751 114.958 25.2873 115.768 24.5 116.5C23.7127 117.232 23.7707 119.714 23.2333 118.632C25.7894 123.297 27.6861 133.299 27.4332 147.64C27.081 167.985 18.934 171.433 27.37 180.88C29.3446 181.44 31.3768 181.945 33.4577 182.391C42.2074 184.549 51.6672 185.834 61.34 186.179C61.5809 184.372 61.8097 182.606 62.0265 180.88C67.7167 134.914 64.7993 112.829 63.3813 105.77H74.6173C73.1993 112.829 70.2819 134.914 75.9721 180.88C76.1829 182.603 76.4117 184.369 76.6586 186.179C86.3314 185.834 95.7912 184.549 104.541 182.391C106.622 181.945 108.654 181.44 110.629 180.88C119.065 171.433 108.515 167.985 108.163 147.64C107.919 133.295 112.209 123.283 114.765 118.632C115.209 117.828 115.018 116.966 114.235 116.234C113.451 115.502 112.138 114.96 110.583 114.727Z" fill="#AEAAB4"/>
<path d="M76.6586 186.175C76.8272 187.419 77.0018 188.694 77.1824 190C93.7565 188.946 110.601 185.008 110.601 185.008V180.875C108.627 181.436 106.595 181.94 104.514 182.387C95.7724 184.543 86.3222 185.828 76.6586 186.175Z" fill="#434F63"/>
<path d="M77.1104 127.836C86.7366 126.795 96.6761 126.795 106.302 127.836C96.591 128.284 86.8217 128.284 77.1104 127.836V127.836Z" fill="#939199"/>
<path d="M77.1104 139.037C86.7366 137.996 96.6761 137.996 106.302 139.037C96.591 139.485 86.8217 139.485 77.1104 139.037V139.037Z" fill="#939199"/>
<path d="M77.1104 150.799C86.7366 149.757 96.6761 149.757 106.302 150.799C96.591 151.246 86.8217 151.246 77.1104 150.799V150.799Z" fill="#939199"/>
<path d="M78.2393 162.429C87.7329 161.107 97.6539 160.814 107.377 161.571C97.733 162.303 87.9819 162.59 78.2393 162.429V162.429Z" fill="#939199"/>
<path d="M80.5154 174.652C89.8342 173.029 99.703 172.42 109.5 172.865C99.96 173.903 90.2603 174.501 80.5154 174.652V174.652Z" fill="#939199"/>
<path d="M31.561 127.836C41.1873 126.795 51.1268 126.795 60.753 127.836C51.0416 128.284 41.2724 128.284 31.561 127.836V127.836Z" fill="#939199"/>
<path d="M31.561 139.037C41.1873 137.996 51.1268 137.996 60.753 139.037C51.0416 139.485 41.2724 139.485 31.561 139.037V139.037Z" fill="#939199"/>
<path d="M31.561 150.799C41.1873 149.757 51.1268 149.757 60.753 150.799C51.0416 151.246 41.2724 151.246 31.561 150.799V150.799Z" fill="#939199"/>
<path d="M29.3932 161.58C39.1145 160.819 49.0354 161.107 58.531 162.424C48.7891 162.59 39.0381 162.307 29.3932 161.58V161.58Z" fill="#939199"/>
<path d="M28.3364 173.084C38.1025 172.495 47.9989 172.957 57.402 174.442C45.0369 174.591 45.0369 174.591 28.3364 173.084Z" fill="#939199"/>
<path d="M47.7557 158.417C47.3765 158.772 46.9604 159.116 46.5093 159.448C44.2241 161.085 38.1635 165.27 33.1417 167.379C33.1417 167.379 30.1068 168.815 33.1417 169.338C35.7971 169.805 48.0809 161.3 51.1428 159.149C51.7722 158.724 52.1459 158.213 52.2176 157.68C52.2176 157.213 51.5854 156.747 50.4112 157.083C49.3093 157.395 48.3917 157.857 47.7557 158.417V158.417Z" fill="#343D4D"/>
<path d="M90.8844 158.417C91.2643 158.769 91.6803 159.11 92.1308 159.439C94.416 161.076 100.477 165.261 105.498 167.369C105.498 167.369 108.533 168.806 105.498 169.329C102.843 169.795 90.5592 161.291 87.4973 159.14C86.8679 158.715 86.4942 158.204 86.4225 157.67C86.4225 157.204 87.0547 156.737 88.2289 157.073C89.3331 157.389 90.2509 157.853 90.8844 158.417V158.417Z" fill="#343D4D"/>
<path d="M72.9554 124.631C72.8884 124.636 72.8205 124.628 72.7637 124.609C72.7068 124.59 72.6645 124.562 72.6441 124.528C72.6237 124.495 72.6265 124.459 72.652 124.427C72.6776 124.395 72.7242 124.368 72.7838 124.351C76.1618 123.362 86.2598 120.017 88.3643 114.914C90.9024 108.76 90.4688 108.55 88.834 107.645C87.1992 106.74 82.8457 104.65 82.8457 104.65C82.8457 104.65 90.6585 104.091 93.2778 105.905C95.8972 107.72 96.3578 109.358 100.576 110.104C104.794 110.85 108.84 111.247 108.578 114.354C108.578 114.354 99.4378 115.1 97.1526 117.508C94.9488 119.794 83.6315 124.239 72.9554 124.631Z" fill="#939199"/>
<path d="M65.1426 124.632C65.2096 124.636 65.2775 124.628 65.3343 124.609C65.3912 124.59 65.4335 124.562 65.4539 124.529C65.4743 124.495 65.4715 124.459 65.446 124.427C65.4205 124.395 65.3738 124.368 65.3142 124.352C61.9362 123.363 51.8201 120.018 49.7337 114.914C47.1957 108.761 47.6292 108.551 49.264 107.664C50.8989 106.778 55.2524 104.646 55.2524 104.646C55.2524 104.646 47.4486 104.091 44.8112 105.906C42.1738 107.72 41.7312 109.358 37.5132 110.104C33.2951 110.851 29.2397 111.224 29.5107 114.331C29.5107 114.331 38.6512 115.077 40.9364 117.485C43.1402 119.794 54.4666 124.24 65.1426 124.632Z" fill="#939199"/>
<path fill-rule="evenodd" clip-rule="evenodd" d="M68.88 33.0742V117.574C49.55 117.574 27.38 111.074 13.88 97.5742C28.38 51.0742 49.55 33.0742 68.88 33.0742ZM68.88 117.574C88.21 117.574 110.38 111.074 123.88 97.5742C109.38 51.0742 88.21 33.0742 68.88 33.0742V117.574Z" fill="#FE6054"/>
<path fill-rule="evenodd" clip-rule="evenodd" d="M68.88 33.0742V117.574C49.55 117.574 27.38 111.074 13.88 97.5742C28.38 51.0742 49.55 33.0742 68.88 33.0742ZM68.88 117.574C88.21 117.574 110.38 111.074 123.88 97.5742C109.38 51.0742 88.21 33.0742 68.88 33.0742V117.574Z" fill="url(#paint5_linear)"/>
<path fill-rule="evenodd" clip-rule="evenodd" d="M68.88 33.0742V117.574C49.55 117.574 27.38 111.074 13.88 97.5742C28.38 51.0742 49.55 33.0742 68.88 33.0742ZM68.88 117.574C88.21 117.574 110.38 111.074 123.88 97.5742C109.38 51.0742 88.21 33.0742 68.88 33.0742V117.574Z" fill="url(#paint6_linear)"/>
<path d="M31.3801 62.0743C30.8801 64.0743 27.8801 66.5743 26.3801 67.0743C20.6267 59.9573 17.8395 51.7097 16.88 44.5743C15.4417 33.8772 17.944 25.4333 19.38 25.0743C21.7282 24.4873 27.7711 27.4604 35.88 31.0743C40.7657 33.2517 46.4624 35.7726 52.3801 37.5743C49.8801 42.0743 43.8801 47.5743 40.8801 47.5743L31.3801 62.0743Z" fill="#FE6054"/>
<path d="M31.3801 62.0743C30.8801 64.0743 27.8801 66.5743 26.3801 67.0743C20.6267 59.9573 17.8395 51.7097 16.88 44.5743C15.4417 33.8772 17.944 25.4333 19.38 25.0743C21.7282 24.4873 27.7711 27.4604 35.88 31.0743C40.7657 33.2517 46.4624 35.7726 52.3801 37.5743C49.8801 42.0743 43.8801 47.5743 40.8801 47.5743L31.3801 62.0743Z" fill="url(#paint7_linear)"/>
<path d="M106.379 62.0787C106.879 64.0787 109.879 66.5787 111.379 67.0787C117.132 59.9617 119.919 51.7141 120.879 44.5787C122.317 33.8816 119.815 25.4377 118.379 25.0787C116.031 24.4917 109.988 27.4648 101.879 31.0787C96.9933 33.2561 91.2965 35.777 85.3788 37.5787C87.8789 42.0787 93.8789 47.5787 96.8789 47.5787L106.379 62.0787Z" fill="#FE6054"/>
<path d="M106.379 62.0787C106.879 64.0787 109.879 66.5787 111.379 67.0787C117.132 59.9617 119.919 51.7141 120.879 44.5787C122.317 33.8816 119.815 25.4377 118.379 25.0787C116.031 24.4917 109.988 27.4648 101.879 31.0787C96.9933 33.2561 91.2965 35.777 85.3788 37.5787C87.8789 42.0787 93.8789 47.5787 96.8789 47.5787L106.379 62.0787Z" fill="url(#paint8_linear)"/>
<path d="M25.38 40.0742C28.38 38.5742 31.38 44.5742 40.88 47.5742C37.7906 53.7545 35.7251 56.9398 31.38 62.0742C24.88 55.5742 22.38 41.5742 25.38 40.0742Z" fill="#FFCCA1"/>
<path d="M112.38 40.0742C109.38 38.5742 106.38 44.5742 96.88 47.5742C99.9694 53.7545 102.035 56.9398 106.38 62.0742C112.88 55.5742 115.38 41.5742 112.38 40.0742Z" fill="#FFCCA1"/>
<path d="M35.8801 31.0743C34.8801 36.8445 24.3801 31.8042 22.3801 33.0743C18.0953 35.7955 23.3734 43.5743 16.8801 44.5743C15.4695 33.9624 17.9383 25.4348 19.3801 25.0743C21.719 24.4896 27.8187 27.4359 35.8801 31.0743Z" fill="black"/>
<path d="M101.88 31.0743C102.88 36.8445 113.38 31.8042 115.38 33.0743C119.665 35.7955 114.387 43.5743 120.88 44.5743C122.29 33.9624 119.822 25.4348 118.38 25.0743C116.041 24.4896 109.941 27.4359 101.88 31.0743Z" fill="black"/>
<path fill-rule="evenodd" clip-rule="evenodd" d="M68.88 117.574C51.3028 117.574 31.3771 112.2 17.7576 101.074C24.8799 95.0742 43.8799 88.0742 55.38 86.5742C58.3799 82.0742 63.8799 77.0742 68.88 77.0742C73.88 77.0742 79.38 82.0742 82.38 86.5742C93.88 88.0742 112.88 95.0742 120.002 101.074C106.383 112.2 86.4573 117.574 68.88 117.574Z" fill="#FFCCA1"/>
<path fill-rule="evenodd" clip-rule="evenodd" d="M68.88 117.574C51.3028 117.574 31.3771 112.2 17.7576 101.074C24.8799 95.0742 43.8799 88.0742 55.38 86.5742C58.3799 82.0742 63.8799 77.0742 68.88 77.0742C73.88 77.0742 79.38 82.0742 82.38 86.5742C93.88 88.0742 112.88 95.0742 120.002 101.074C106.383 112.2 86.4573 117.574 68.88 117.574Z" fill="url(#paint9_radial)"/>
<path fill-rule="evenodd" clip-rule="evenodd" d="M68.88 85.5742V92.5742C66.38 92.5742 65.38 91.0742 64.38 88.5742C63.5956 86.6132 64.9105 85.5742 68.88 85.5742ZM68.88 85.5742V92.5742C71.38 92.5742 72.38 91.0742 73.38 88.5742C74.1644 86.6132 72.8495 85.5742 68.88 85.5742Z" fill="black"/>
<path d="M50.4361 54.5743C50.4361 55.4982 48.3289 55.0084 46.4361 55.5743C44.5433 56.1403 43.4361 57.5743 42.9361 57.0743C41.5146 55.6528 43.5433 53.1403 45.4361 52.5743C47.3289 52.0084 50.4361 53.0743 50.4361 54.5743Z" fill="black"/>
<path d="M87.3969 54.5743C87.3969 55.4982 89.5041 55.0084 91.3969 55.5743C93.2897 56.1403 94.3969 57.5743 94.8969 57.0743C96.3184 55.6528 94.2897 53.1403 92.3969 52.5743C90.5041 52.0084 87.3969 53.0743 87.3969 54.5743Z" fill="black"/>
<ellipse opacity="0.85" cx="68.88" cy="87.0742" rx="2" ry="1" fill="url(#paint10_linear)"/>
<path d="M46.88 101C51.8245 105.873 60.2797 108 68.88 108C77.4803 108 85.9355 105.873 90.88 101" stroke="black" stroke-width="1.5" stroke-linecap="round"/>
<path opacity="0.5" d="M59.0333 70.6252C60.6056 76.4933 55.2014 83.04 49.4492 84.5813C43.6971 86.1226 37.8826 84.4187 36.3102 78.5506C34.7379 72.6825 40.0189 64.332 45.771 62.7908C51.5232 61.2495 57.4609 64.7571 59.0333 70.6252Z" fill="url(#paint11_linear)"/>
<path d="M54.2036 71.9192C55.0612 75.12 52.4756 76.5233 49.4433 77.3358C46.411 78.1483 43.4701 78.2258 42.6125 75.025C41.7548 71.8243 43.8228 68.4891 46.8551 67.6766C49.8875 66.8641 53.3459 68.7184 54.2036 71.9192Z" fill="white"/>
<path fill-rule="evenodd" clip-rule="evenodd" d="M49.397 76.5133C51.1007 76.0568 52.1117 74.3057 51.6552 72.602C51.1987 70.8984 49.4476 69.8874 47.7439 70.3439C47.3802 70.4413 47.0481 70.5978 46.755 70.8002C47.2327 70.925 47.6316 71.2957 47.7685 71.8067C47.9714 72.5639 47.5221 73.3422 46.7649 73.545C46.2539 73.6819 45.7334 73.5218 45.3865 73.1706C45.3577 73.5255 45.3883 73.8914 45.4857 74.2551C45.9422 75.9588 47.6934 76.9698 49.397 76.5133Z" fill="black"/>
<path opacity="0.5" d="M78.851 70.6252C77.2787 76.4933 82.6829 83.04 88.4351 84.5813C94.1872 86.1226 100.002 84.4187 101.574 78.5506C103.146 72.6825 97.8654 64.332 92.1132 62.7908C86.3611 61.2495 80.4234 64.7571 78.851 70.6252Z" fill="url(#paint12_linear)"/>
<path d="M83.6807 71.9192C82.823 75.12 85.4086 76.5233 88.441 77.3358C91.4733 78.1483 94.4141 78.2258 95.2718 75.025C96.1294 71.8243 94.0615 68.4891 91.0292 67.6766C87.9968 66.8641 84.5383 68.7184 83.6807 71.9192Z" fill="white"/>
<path fill-rule="evenodd" clip-rule="evenodd" d="M88.4873 76.5133C86.7836 76.0568 85.7726 74.3057 86.2291 72.602C86.6856 70.8984 88.4367 69.8874 90.1404 70.3439C90.5041 70.4413 90.8362 70.5978 91.1293 70.8002C90.6516 70.925 90.2527 71.2957 90.1158 71.8067C89.9129 72.5639 90.3622 73.3422 91.1194 73.545C91.6304 73.6819 92.1509 73.5218 92.4978 73.1706C92.5266 73.5255 92.496 73.8914 92.3985 74.2551C91.9421 75.9588 90.1909 76.9698 88.4873 76.5133Z" fill="black"/>
<path d="M87.5984 218.041C87.4368 218.465 87.3936 218.926 87.4734 219.372C87.5532 219.819 87.753 220.236 88.0514 220.579C88.0514 220.579 90.0041 223.286 90.0036 224.045C90.1457 224.319 90.2173 224.624 90.2118 224.933C90.2118 224.933 91.7559 224.711 92.0142 224.624C92.0142 224.624 97.3437 226.938 97.5742 227.167C97.5742 227.167 99.5994 225.161 99.1013 224.146C99.1013 224.146 97.3897 221.391 95.7941 220.276C95.7941 220.276 95.0076 219.082 95.2666 217.722C95.2666 217.722 96.1003 214.458 94.1749 214.716C94.1749 214.716 93.2132 214.66 92.8952 214.665C92.8952 214.665 92.5331 216.542 92.3699 217.038C92.3699 217.038 92.3169 217.592 90.7567 217.66C90.7628 217.659 87.9913 217.922 87.5984 218.041Z" fill="#713F13"/>
<path d="M92.8603 214.875C92.8603 214.875 92.8397 217.631 91.6469 217.578C91.6469 217.578 87.0746 219.767 85.9998 220.001C85.9998 220.001 85.9997 220.001 85.4997 219.001C84.9998 218.001 84.5074 214.954 85.5 215.001C85.5 215.001 87.6854 214.877 88.4998 215.001C88.4998 215.001 91.4998 215.001 92.8603 214.875Z" fill="#26231E"/>
<path d="M85.7238 225.013C85.7238 225.013 85.8216 226.087 86.0785 228.432C86.0785 228.432 87.2932 228.939 90.9014 229.793C90.9014 229.793 90.8425 229.706 91.0146 229.174C91.0146 229.174 94.0443 230.064 93.7555 230.913C93.7555 230.913 95.7422 231.765 100.135 231.892C100.135 231.892 106.454 232.08 107.873 230.893L107.816 229.772C107.816 229.772 107.856 230.493 104.525 230.867C104.525 230.867 99.0526 230.84 97.3815 230.427C97.3815 230.427 94.3677 229.65 93.1199 228.655C93.1199 228.655 91.1518 227.741 89.8137 227.428C89.8146 227.436 85.5781 226.209 85.7238 225.013Z" fill="#4A2F1C"/>
<path d="M85.9998 220.001C85.9998 220.001 86.4998 220.597 86.4998 221.475C86.4998 221.475 85.1086 225.187 86.0383 225.916C86.0383 225.916 88.3993 227.254 90.6856 227.706C90.6856 227.706 90.3334 226.719 90.3625 224.956C90.0807 223.688 89.5194 222.498 88.7197 221.475C88.2555 220.871 87.9998 220.501 87.9998 220.001C87.9998 220.001 88.3432 219.05 88.4998 219.001L85.9998 220.001Z" fill="#EAA76F"/>
<path d="M90.3399 225.289C90.3399 225.289 90.2904 227.186 90.6822 227.701C90.6822 227.701 93.0675 228.678 93.5053 229.059C93.5053 229.059 95.9081 230.621 98.7759 230.774C100.235 230.972 101.706 231.067 103.178 231.059C103.178 231.059 106.544 231.131 107.755 230.234C107.755 230.234 108.542 227.567 107.041 226.983C107.041 226.983 106.38 226.519 104.007 226.26C102.65 225.948 101.377 225.345 100.278 224.49C100.278 224.49 97.4524 221.694 97.0493 220.377C97.0493 220.377 98.3046 216.035 97.5 215C97 214.5 95.7879 214.204 95.4328 214.288C95.0778 214.371 94.7453 214.531 94.4589 214.757C94.4589 214.757 95.6149 214.848 95.3694 216.58C95.3694 216.58 94.6351 219.481 96.2417 221.101C96.2417 221.101 97.3855 222.605 97.9203 222.87C97.9203 222.87 99.5953 224.108 99.0348 225.127C99.0348 225.127 98.0648 226.569 97.6795 226.947C97.6795 226.947 97.3137 227.013 95.8296 226.074C95.8296 226.074 92.1369 224.407 92.124 224.543C92.124 224.543 91.2564 224.661 90.3434 224.837L90.3399 225.289Z" fill="#B98242"/>
<path d="M97.5 215.5C97.5 215.5 98.9918 215.91 98.4998 217.501C98.4998 217.501 97.6858 219.595 97.9998 220.501C97.9998 220.501 97.609 221.489 99.5969 223.301C100.029 223.799 100.431 224.322 100.801 224.868C100.801 224.868 99.8137 224.211 99.4174 223.672C99.4174 223.672 97.0516 221.002 97.0642 220.412C96.935 219.879 97.0279 219.048 96.9999 218.5C96.9999 218.5 97.4999 216 97.5 215.5Z" fill="#86501D"/>
<path d="M90.8993 229.793L91.529 229.344L91.0125 229.174C90.9416 229.373 90.9034 229.582 90.8993 229.793V229.793Z" fill="#26231E"/>
<path d="M94.2096 221.133L93.7544 220.82L93.7975 220.266L94.2975 220.028L94.7527 220.341L94.7099 220.893L94.2096 221.133Z" fill="#26231E"/>
<path d="M94.225 220.95L93.9191 220.74L93.9486 220.37L94.2822 220.209L94.5882 220.419L94.5583 220.791L94.225 220.95Z" fill="#86501D"/>
<path d="M95.2558 222.886L94.8006 222.572L94.8434 222.021L95.3434 221.782L95.7986 222.096L95.7558 222.647L95.2558 222.886Z" fill="#26231E"/>
<path d="M95.269 222.704L94.965 222.495L94.9926 222.124L95.3278 221.965L95.6338 222.175L95.6042 222.546L95.269 222.704Z" fill="#86501D"/>
<path d="M96.9957 224.383L96.5385 224.07L96.5816 223.516L97.0813 223.28L97.5385 223.593L97.494 224.143L96.9957 224.383Z" fill="#26231E"/>
<path d="M97.0092 224.2L96.7033 223.99L96.7328 223.62L97.068 223.461L97.3721 223.671L97.3445 224.042L97.0092 224.2Z" fill="#86501D"/>
<path d="M93.973 218.869L93.518 218.554L93.5608 218.003L94.0608 217.764L94.516 218.078L94.4732 218.629L93.973 218.869Z" fill="#26231E"/>
<path d="M93.9884 218.686L93.6824 218.476L93.7119 218.106L94.0453 217.947L94.3534 218.155L94.3219 218.525L93.9884 218.686Z" fill="#86501D"/>
<path d="M93.7601 216.832L93.3049 216.519L93.3477 215.967L93.8477 215.729L94.3029 216.042L94.2601 216.594L93.7601 216.832Z" fill="#26231E"/>
<path d="M93.7752 216.651L93.4692 216.441L93.4988 216.071L93.8324 215.91L94.1381 216.122L94.1088 216.49L93.7752 216.651Z" fill="#86501D"/>
<path d="M89.5822 222.576L89.2792 223.099L89.5288 223.232L89.7793 222.646L89.5822 222.576Z" fill="#26231E"/>
<path d="M93.5342 216.243C93.3985 217.717 92.6909 219.079 91.563 220.038C90.9762 220.548 90.2187 220.938 89.5748 222.445C89.5748 222.445 89.4971 223.163 90.0115 222.763C90.5945 222.31 90.9249 221.445 91.932 220.518C92.806 219.713 94.0436 217.618 94.0386 216.258L93.5342 216.243Z" fill="#45413D"/>
<path d="M93.8369 215.95C94.8907 216.422 96.028 216.68 97.1824 216.708C97.2094 216.774 97.2224 216.845 97.2207 216.917C97.219 216.988 97.2025 217.058 97.1724 217.123C96.9053 217.102 94.4651 216.865 93.798 216.203L93.8369 215.95Z" fill="#45413D"/>
<path d="M97.3094 215.547C97.3094 215.547 96.3953 216.714 94.0075 218.22L94.0451 218.59C94.0451 218.59 96.7323 216.699 97.2001 216.052L97.3094 215.547Z" fill="#45413D"/>
<path d="M93.943 218.231C94.9583 218.712 96.0647 218.97 97.188 218.989C97.2271 219.052 97.25 219.123 97.2545 219.197C97.2591 219.271 97.2453 219.345 97.2142 219.412C97.2142 219.412 94.615 219.185 93.9099 218.484L93.943 218.231Z" fill="#45413D"/>
<path d="M97.1586 217.749C97.1586 217.749 96.6223 218.877 94.2326 220.383L94.2702 220.753C94.2702 220.753 96.6912 218.92 97.1582 218.266L97.1586 217.749Z" fill="#45413D"/>
<path d="M94.2667 220.364C95.354 220.759 96.4985 220.973 97.655 220.998C97.7258 221.073 97.7807 221.161 97.8163 221.257C97.8163 221.257 94.9351 221.316 94.2297 220.617L94.2667 220.364Z" fill="#45413D"/>
<path d="M97.3426 220.151C97.3426 220.151 97.649 220.629 95.2615 222.134L95.299 222.503C95.299 222.503 97.0229 221.323 97.4885 220.678L97.3426 220.151Z" fill="#45413D"/>
<path d="M95.2815 222.188C96.3469 222.403 97.4444 222.405 98.5105 222.193C98.6034 222.269 98.684 222.359 98.7494 222.46C98.7494 222.46 96.1152 222.985 95.2915 222.443L95.2815 222.188Z" fill="#45413D"/>
<path d="M98.0526 221.615C98.0526 221.615 98.4125 221.862 96.8798 223.754L97.0444 224.089C97.0444 224.089 98.1172 222.743 98.3219 221.976L98.0526 221.615Z" fill="#45413D"/>
<path d="M93.8368 215.95C93.6368 215.971 93.5342 216.243 93.5342 216.243L93.5613 216.503L93.8909 216.513L93.9961 216.195C93.9961 216.195 94.0388 215.929 93.8368 215.95Z" fill="#45413D"/>
<path d="M50.3017 217.197C50.4633 217.621 50.5066 218.082 50.4268 218.529C50.347 218.975 50.1472 219.392 49.8487 219.735C49.8487 219.735 47.896 222.442 47.8965 223.201C47.7544 223.475 47.6829 223.78 47.6883 224.089C47.6883 224.089 46.1442 223.867 45.8859 223.78C45.8859 223.78 40.5564 226.094 40.326 226.323C40.326 226.323 38.3007 224.317 38.7988 223.303C38.7988 223.303 40.5104 220.547 42.106 219.432C42.106 219.432 42.8925 218.238 42.6336 216.878C42.6336 216.878 41.7998 213.614 43.7252 213.872C43.7252 213.872 44.687 213.816 45.0049 213.821C45.0049 213.821 45.367 215.698 45.5302 216.194C45.5302 216.194 45.5832 216.748 47.1434 216.816C47.1374 216.815 49.9089 217.078 50.3017 217.197Z" fill="#713F13"/>
<path d="M45.0399 214.031C45.0399 214.031 45.0605 216.787 46.2532 216.734C46.2532 216.734 50.8256 218.924 51.9003 219.157C51.9003 219.157 51.9005 219.157 52.4004 218.157C52.9004 217.157 53.3927 214.11 52.4001 214.157C52.4001 214.157 50.2147 214.033 49.4004 214.157C49.4004 214.157 46.4004 214.157 45.0399 214.031Z" fill="#26231E"/>
<path d="M52.1764 224.169C52.1764 224.169 52.0786 225.243 51.8216 227.588C51.8216 227.588 50.607 228.095 46.9988 228.949C46.9988 228.949 47.0577 228.862 46.8856 228.33C46.8856 228.33 43.8558 229.22 44.1446 230.069C44.1446 230.069 42.158 230.921 37.7654 231.048C37.7654 231.048 31.4463 231.236 30.0269 230.049L30.0846 228.928C30.0846 228.928 30.0444 229.649 33.3752 230.023C33.3752 230.023 38.8475 229.996 40.5187 229.583C40.5187 229.583 43.5325 228.806 44.7802 227.811C44.7802 227.811 46.7484 226.897 48.0864 226.584C48.0856 226.592 52.3221 225.365 52.1764 224.169Z" fill="#4A2F1C"/>
<path d="M51.9003 219.157C51.9003 219.157 51.4003 219.753 51.4003 220.631C51.4003 220.631 52.7915 224.343 51.8618 225.072C51.8618 225.072 49.5009 226.41 47.2146 226.862C47.2146 226.862 47.5668 225.875 47.5376 224.112C47.8195 222.844 48.3807 221.654 49.1804 220.631C49.6447 220.027 49.9004 219.657 49.9004 219.157C49.9004 219.157 49.557 218.206 49.4004 218.157L51.9003 219.157Z" fill="#EAA76F"/>
<path d="M47.5603 224.445C47.5603 224.445 47.6098 226.342 47.218 226.857C47.218 226.857 44.8327 227.834 44.3948 228.215C44.3948 228.215 41.992 229.777 39.1243 229.93C37.6654 230.128 36.1944 230.223 34.7222 230.215C34.7222 230.215 31.3565 230.287 30.1448 229.39C30.1448 229.39 29.358 226.723 30.8596 226.139C30.8596 226.139 31.5206 225.675 33.8928 225.416C35.25 225.104 36.523 224.501 37.6226 223.646C37.6226 223.646 40.4478 220.85 40.8509 219.533C40.8509 219.533 39.5955 215.191 40.4001 214.156C40.9002 213.656 42.1122 213.36 42.4673 213.444C42.8224 213.527 43.1548 213.687 43.4412 213.913C43.4412 213.913 42.2853 214.004 42.5307 215.736C42.5307 215.736 43.2651 218.637 41.6584 220.257C41.6584 220.257 40.5147 221.761 39.9799 222.026C39.9799 222.026 38.3048 223.264 38.8653 224.283C38.8653 224.283 39.8353 225.725 40.2207 226.103C40.2207 226.103 40.5864 226.169 42.0705 225.23C42.0705 225.23 45.7632 223.563 45.7761 223.699C45.7761 223.699 46.6438 223.817 47.5567 223.993L47.5603 224.445Z" fill="#B98242"/>
<path d="M40.4002 214.656C40.4002 214.656 38.9083 215.066 39.4003 216.657C39.4003 216.657 40.2144 218.751 39.9003 219.657C39.9003 219.657 40.2912 220.645 38.3033 222.457C37.8713 222.955 37.4693 223.478 37.0994 224.024C37.0994 224.024 38.0864 223.367 38.4827 222.828C38.4827 222.828 40.8485 220.158 40.8359 219.568C40.9651 219.035 40.8722 218.204 40.9003 217.656C40.9003 217.656 40.4003 215.156 40.4002 214.656Z" fill="#86501D"/>
<path d="M47.0008 228.949L46.3712 228.5L46.8876 228.33C46.9586 228.529 46.9968 228.738 47.0008 228.949V228.949Z" fill="#26231E"/>
<path d="M43.6905 220.289L44.1457 219.976L44.1026 219.422L43.6027 219.184L43.1474 219.497L43.1903 220.049L43.6905 220.289Z" fill="#26231E"/>
<path d="M43.6751 220.106L43.9811 219.896L43.9515 219.526L43.618 219.365L43.312 219.575L43.3418 219.947L43.6751 220.106Z" fill="#86501D"/>
<path d="M42.6443 222.042L43.0996 221.728L43.0567 221.177L42.5568 220.938L42.1015 221.252L42.1444 221.803L42.6443 222.042Z" fill="#26231E"/>
<path d="M42.6312 221.86L42.9352 221.651L42.9076 221.28L42.5723 221.121L42.2664 221.331L42.2959 221.702L42.6312 221.86Z" fill="#86501D"/>
<path d="M40.9045 223.539L41.3616 223.226L41.3186 222.672L40.8188 222.436L40.3617 222.749L40.4062 223.299L40.9045 223.539Z" fill="#26231E"/>
<path d="M40.8909 223.356L41.1969 223.146L41.1673 222.776L40.8321 222.617L40.5281 222.827L40.5557 223.198L40.8909 223.356Z" fill="#86501D"/>
<path d="M43.9272 218.025L44.3821 217.71L44.3393 217.159L43.8394 216.92L43.3841 217.234L43.4269 217.785L43.9272 218.025Z" fill="#26231E"/>
<path d="M43.9118 217.842L44.2178 217.632L44.1882 217.262L43.8549 217.103L43.5467 217.311L43.5782 217.681L43.9118 217.842Z" fill="#86501D"/>
<path d="M44.1401 215.988L44.5953 215.675L44.5525 215.123L44.0525 214.885L43.5973 215.198L43.6401 215.75L44.1401 215.988Z" fill="#26231E"/>
<path d="M44.1249 215.807L44.4309 215.597L44.4014 215.227L44.0678 215.066L43.7621 215.278L43.7914 215.646L44.1249 215.807Z" fill="#86501D"/>
<path d="M48.318 221.732L48.6209 222.255L48.3714 222.388L48.1208 221.802L48.318 221.732Z" fill="#26231E"/>
<path d="M44.3659 215.399C44.5016 216.873 45.2093 218.235 46.3372 219.194C46.924 219.704 47.6814 220.094 48.3253 221.601C48.3253 221.601 48.403 222.319 47.8886 221.919C47.3057 221.466 46.9752 220.601 45.9682 219.674C45.0942 218.869 43.8566 216.774 43.8615 215.414L44.3659 215.399Z" fill="#45413D"/>
<path d="M44.0633 215.106C43.0094 215.578 41.8722 215.836 40.7177 215.864C40.6907 215.93 40.6777 216.001 40.6794 216.073C40.6812 216.144 40.6976 216.214 40.7278 216.279C40.9948 216.258 43.435 216.021 44.1022 215.359L44.0633 215.106Z" fill="#45413D"/>
<path d="M40.5908 214.703C40.5908 214.703 41.5048 215.87 43.8926 217.376L43.8551 217.746C43.8551 217.746 41.1678 215.855 40.7 215.208L40.5908 214.703Z" fill="#45413D"/>
<path d="M43.9572 217.387C42.9419 217.868 41.8355 218.126 40.7121 218.145C40.673 218.208 40.6502 218.279 40.6456 218.353C40.641 218.427 40.6549 218.501 40.6859 218.568C40.6859 218.568 43.2851 218.341 43.9903 217.64L43.9572 217.387Z" fill="#45413D"/>
<path d="M40.7415 216.905C40.7415 216.905 41.2778 218.033 43.6675 219.539L43.63 219.909C43.63 219.909 41.2089 218.076 40.742 217.422L40.7415 216.905Z" fill="#45413D"/>
<path d="M43.6335 219.52C42.5462 219.915 41.4016 220.129 40.2451 220.154C40.1743 220.229 40.1194 220.317 40.0839 220.413C40.0839 220.413 42.965 220.472 43.6704 219.773L43.6335 219.52Z" fill="#45413D"/>
<path d="M40.5575 219.308C40.5575 219.308 40.2512 219.785 42.6387 221.29L42.6011 221.659C42.6011 221.659 40.8772 220.479 40.4116 219.834L40.5575 219.308Z" fill="#45413D"/>
<path d="M42.6186 221.344C41.5532 221.559 40.4557 221.561 39.3896 221.349C39.2967 221.425 39.2162 221.515 39.1508 221.616C39.1508 221.616 41.785 222.141 42.6087 221.599L42.6186 221.344Z" fill="#45413D"/>
<path d="M39.8476 220.771C39.8476 220.771 39.4876 221.018 41.0204 222.91L40.8558 223.245C40.8558 223.245 39.7829 221.899 39.5782 221.132L39.8476 220.771Z" fill="#45413D"/>
<path d="M44.0633 215.106C44.2634 215.127 44.366 215.399 44.366 215.399L44.3389 215.659L44.0092 215.669L43.9041 215.351C43.9041 215.351 43.8614 215.085 44.0633 215.106Z" fill="#45413D"/>
<defs>
<linearGradient id="paint0_linear" x1="101.628" y1="170.188" x2="132.626" y2="183.965" gradientUnits="userSpaceOnUse">
<stop stop-color="#D4362A" stop-opacity="0.9"/>
<stop offset="1" stop-color="#D4362A" stop-opacity="0"/>
</linearGradient>
<linearGradient id="paint1_linear" x1="137.876" y1="167.5" x2="125.376" y2="187.5" gradientUnits="userSpaceOnUse">
<stop stop-color="white" stop-opacity="0.21"/>
<stop offset="1" stop-color="white" stop-opacity="0"/>
</linearGradient>
<linearGradient id="paint2_linear" x1="153.876" y1="182" x2="145.876" y2="193.5" gradientUnits="userSpaceOnUse">
<stop stop-color="white" stop-opacity="0.32"/>
<stop offset="1" stop-color="white" stop-opacity="0"/>
</linearGradient>
<linearGradient id="paint3_linear" x1="68.876" y1="202" x2="68.876" y2="148" gradientUnits="userSpaceOnUse">
<stop stop-color="#D4362A" stop-opacity="0.49"/>
<stop offset="1" stop-color="#D4362A" stop-opacity="0"/>
</linearGradient>
<radialGradient id="paint4_radial" cx="0" cy="0" r="1" gradientUnits="userSpaceOnUse" gradientTransform="translate(68.876 114) rotate(90) scale(15.5 23.4634)">
<stop stop-color="#D4362A"/>
<stop offset="1" stop-color="#D4362A" stop-opacity="0"/>
</radialGradient>
<linearGradient id="paint5_linear" x1="13.88" y1="77.0742" x2="123.88" y2="77.0742" gradientUnits="userSpaceOnUse">
<stop stop-color="#D5362A"/>
<stop offset="0.235734" stop-color="#D4362A" stop-opacity="0"/>
<stop offset="0.763059" stop-color="#D4362A" stop-opacity="0"/>
<stop offset="1" stop-color="#D4362A"/>
</linearGradient>
<linearGradient id="paint6_linear" x1="68.88" y1="8.07422" x2="68.88" y2="49.5742" gradientUnits="userSpaceOnUse">
<stop stop-color="#CF2D21"/>
<stop offset="1" stop-color="#F7594D" stop-opacity="0.1"/>
</linearGradient>
<linearGradient id="paint7_linear" x1="16.38" y1="41.0743" x2="26.38" y2="42.5743" gradientUnits="userSpaceOnUse">
<stop stop-color="#F77066"/>
<stop offset="1" stop-color="#F77066" stop-opacity="0"/>
</linearGradient>
<linearGradient id="paint8_linear" x1="121.379" y1="41.0787" x2="111.379" y2="42.5787" gradientUnits="userSpaceOnUse">
<stop stop-color="#F77066"/>
<stop offset="1" stop-color="#F77066" stop-opacity="0"/>
</linearGradient>
<radialGradient id="paint9_radial" cx="0" cy="0" r="1" gradientUnits="userSpaceOnUse" gradientTransform="translate(68.88 80.5742) rotate(90) scale(19.5 49.229)">
<stop stop-color="white" stop-opacity="0.44"/>
<stop offset="1" stop-color="white" stop-opacity="0"/>
</radialGradient>
<linearGradient id="paint10_linear" x1="68.88" y1="86.0742" x2="68.88" y2="88.0742" gradientUnits="userSpaceOnUse">
<stop stop-color="white"/>
<stop offset="1" stop-color="white" stop-opacity="0"/>
</linearGradient>
<linearGradient id="paint11_linear" x1="45.504" y1="62.731" x2="50.2892" y2="84.3562" gradientUnits="userSpaceOnUse">
<stop stop-color="#CF2D21"/>
<stop offset="1" stop-color="#CF2D21" stop-opacity="0"/>
</linearGradient>
<linearGradient id="paint12_linear" x1="92.3802" y1="62.731" x2="87.5951" y2="84.3562" gradientUnits="userSpaceOnUse">
<stop stop-color="#CF2D21"/>
<stop offset="1" stop-color="#CF2D21" stop-opacity="0"/>
</linearGradient>
</defs>
</svg>
