<svg width="165" height="237" viewBox="0 0 165 237" fill="none" xmlns="http://www.w3.org/2000/svg">
<path d="M68.876 235.074C97.0425 235.074 119.876 232.164 119.876 228.574C119.876 224.985 97.0425 222.074 68.876 222.074C40.7095 222.074 17.876 224.985 17.876 228.574C17.876 232.164 40.7095 235.074 68.876 235.074Z" fill="black" fill-opacity="0.04"/>
<path d="M99.9058 164.448C98.7578 198.316 130.904 216.111 161.902 193.15C152.143 184.539 136.644 160.43 99.9058 164.448Z" fill="#FE6054"/>
<path d="M99.9058 164.448C98.7578 198.316 130.904 216.111 161.902 193.15C152.143 184.539 136.644 160.43 99.9058 164.448Z" fill="url(#paint0_linear)"/>
<path d="M99.9058 164.448C98.7578 198.316 130.904 216.111 161.902 193.15C152.143 184.539 136.644 160.43 99.9058 164.448Z" fill="url(#paint1_linear)"/>
<path fill-rule="evenodd" clip-rule="evenodd" d="M136.512 203.381C136.946 202.583 137.375 201.665 137.767 200.612C138.345 199.06 137.556 197.897 136.754 196.715C136.129 195.794 135.497 194.861 135.496 193.724C135.496 192.448 136.576 191.642 137.695 190.806C138.74 190.027 139.819 189.221 140.089 187.983C140.29 187.058 139.989 186.049 139.687 185.039C139.314 183.792 138.941 182.542 139.515 181.445C140.044 180.432 140.846 180.143 141.699 179.835C142.522 179.539 143.392 179.225 144.107 178.225C144.404 177.809 144.601 177.32 144.724 176.778C145.114 177.084 145.498 177.392 145.876 177.701C147.793 179.268 149.669 180.933 151.474 182.535C156.289 186.807 160.603 190.636 163.876 191C159.376 198 146.26 202.112 138.876 203.129C138.082 203.238 137.294 203.322 136.512 203.381Z" fill="#FFCCA1"/>
<path fill-rule="evenodd" clip-rule="evenodd" d="M136.512 203.381C136.946 202.583 137.375 201.665 137.767 200.612C138.345 199.06 137.556 197.897 136.754 196.715C136.129 195.794 135.497 194.861 135.496 193.724C135.496 192.448 136.576 191.642 137.695 190.806C138.74 190.027 139.819 189.221 140.089 187.983C140.29 187.058 139.989 186.049 139.687 185.039C139.314 183.792 138.941 182.542 139.515 181.445C140.044 180.432 140.846 180.143 141.699 179.835C142.522 179.539 143.392 179.225 144.107 178.225C144.404 177.809 144.601 177.32 144.724 176.778C145.114 177.084 145.498 177.392 145.876 177.701C147.793 179.268 149.669 180.933 151.474 182.535C156.289 186.807 160.603 190.636 163.876 191C159.376 198 146.26 202.112 138.876 203.129C138.082 203.238 137.294 203.322 136.512 203.381Z" fill="url(#paint2_linear)"/>
<path d="M54.8759 194C54.8759 210.826 49.8759 223.926 46.8759 225.5C44.8521 226.562 43.3759 227 41.3759 227.5C40.4539 227.731 36.3759 228.5 35.876 227.5C34.8759 225.5 38.4136 223.962 40.376 222C41.876 220.5 40.225 216.182 39.8759 214C37.8759 201.5 35.8759 180.422 35.8759 177C35.8759 171.753 40.1292 169 45.3759 169C50.6226 169 54.8759 182.5 54.8759 194Z" fill="#FE6054"/>
<path d="M82.876 194C82.876 210.826 87.876 223.926 90.876 225.5C92.8999 226.562 94.376 227 96.376 227.5C97.298 227.731 101.376 228.5 101.876 227.5C102.876 225.5 99.3384 223.962 97.376 222C95.876 220.5 97.5269 216.182 97.876 214C99.876 201.5 101.876 180.422 101.876 177C101.876 171.753 97.6227 169 92.376 169C87.1293 169 82.876 182.5 82.876 194Z" fill="#FE6054"/>
<path d="M53.876 124.5C53.876 130.575 40.0526 135.045 34.376 137.5C24.4764 141.781 17.9557 147.569 13.376 151C9.39733 153.98 6.43286 155.592 3.87597 153.5C2.50922 152.382 2.79174 149.38 4.37598 145.5C9.16693 133.766 25.7157 114 43.376 114C49.4511 114 53.876 118.425 53.876 124.5Z" fill="#FE6054"/>
<path d="M83.876 124.5C83.876 130.575 97.6994 135.045 103.376 137.5C113.276 141.781 119.796 147.569 124.376 151C128.355 153.98 131.319 155.592 133.876 153.5C135.243 152.382 134.96 149.38 133.376 145.5C128.585 133.766 112.036 114 94.376 114C88.3008 114 83.876 118.425 83.876 124.5Z" fill="#FE6054"/>
<path d="M107.876 160C107.876 183.196 95.376 202 68.876 202C42.376 202 29.876 183.196 29.876 160C29.876 136.804 47.3369 94 68.876 94C90.4151 94 107.876 136.804 107.876 160Z" fill="#FE6054"/>
<path d="M107.876 160C107.876 183.196 95.376 202 68.876 202C42.376 202 29.876 183.196 29.876 160C29.876 136.804 47.3369 94 68.876 94C90.4151 94 107.876 136.804 107.876 160Z" fill="url(#paint3_linear)"/>
<path d="M107.876 160C107.876 183.196 95.376 202 68.876 202C42.376 202 29.876 183.196 29.876 160C29.876 136.804 47.3369 94 68.876 94C90.4151 94 107.876 136.804 107.876 160Z" fill="url(#paint4_radial)"/>
<ellipse cx="68.876" cy="173" rx="27" ry="21" fill="#FFCCA1"/>
<path d="M4.37599 145.5C2.79176 149.38 2.50921 152.382 3.87596 153.5C6.43285 155.592 9.39731 153.98 13.376 151C8.87598 151 6.87598 150 4.37599 145.5Z" fill="black"/>
<path d="M133.376 145.5C134.96 149.38 135.243 152.382 133.876 153.5C131.319 155.592 128.355 153.98 124.376 151C128.876 151 130.876 150 133.376 145.5Z" fill="black"/>
<path d="M40.5 218L33.5 184.5L31 174.5L68 179.5L106.5 174.5L97 218H86.5C86.5 218 83 206.5 83 200C76 202 73.5 202 67.5 202C61.5 202 55 200 55 200L52.5 218H40.5Z" fill="#365E6B"/>
<path d="M39.5769 218L39 215H54L53.4231 218H39.5769Z" fill="#72A7B9"/>
<path d="M98.4231 218L99 215H84L84.5769 218H98.4231Z" fill="#72A7B9"/>
<path d="M106 178C106 178 93.9094 178.039 87.5 177.038C87.4552 182.493 89.3858 190.915 94.8128 194.504C97.8081 196.488 99.3944 198.015 101 198.5L106 178Z" fill="#2E515C"/>
<path d="M32.5143 178.495C32.5143 178.495 38.6617 179.497 45.0711 178.495C45.1159 183.951 44.6824 192.373 39.2555 195.962C36.5711 197.275 38.1766 196.79 36.5711 197.275L34.0711 187.775L32.5143 178.495Z" fill="#2E515C"/>
<path d="M31 173L32.5 180.5C32.5 180.5 61.6183 186.117 71 184.779V178.493C71 178.493 44.5165 178.178 31 173Z" fill="#2E515C"/>
<path d="M66.0003 182.155C66.0007 182.705 66.1748 183.249 66.5107 183.749C66.8467 184.25 67.3367 184.696 67.9478 185.057C68.5589 185.417 69.2768 185.685 70.0531 185.841C70.8293 185.998 71.6459 186.039 72.4477 185.963L105 183.749L107 174.5C107 174.5 97.1197 176.686 70.9765 178.332C69.5978 178.438 68.3258 178.887 67.4065 179.593C66.4873 180.299 65.9862 181.212 66.0003 182.155Z" fill="#417080"/>
<path d="M66.0405 185C66.8762 190.611 65.9847 196.522 67.3979 197.845C68.411 198.697 70.8524 198.936 73 198.841C69.5658 199.334 66.5773 198.616 65.9898 197.572C64.7032 195.817 64.9514 190.951 65.1996 188.995C65.3668 187.668 65.615 186.332 66.0405 185Z" fill="#2E515C"/>
<path d="M70 184C71.1046 184 72 183.105 72 182C72 180.895 71.1046 180 70 180C68.8954 180 68 180.895 68 182C68 183.105 68.8954 184 70 184Z" fill="#6BA1B3"/>
<path d="M56.1565 186L53 185.382L54.8542 176L58 176.682L56.1565 186Z" fill="#345F6D"/>
<path d="M82.065 186L80 176.434L82.975 176L85 185.395L82.065 186Z" fill="#345F6D"/>
<path d="M16.0275 127.624C16.0275 127.624 31.3135 138.076 32.0133 142.985L36.709 136.826L42.857 123.307L29.5 116.5L16.0275 127.624Z" fill="#212121"/>
<path d="M119.816 126.138C119.816 126.138 104.53 136.591 103.83 141.5L99.1341 135.34L92.9862 121.821L106.343 115.015L119.816 126.138Z" fill="#212121"/>
<path d="M29 116.5C29 116.5 34.0015 134.193 34.0015 137.874C24.4705 149.161 26.5885 167.973 25 177.11C25 177.11 82.7155 187.323 109.72 178.23C109.72 178.23 111.838 153.461 104.425 135.187C104.582 134.425 107 115 107 115L86.2229 111C86.2229 111 80.8753 121.677 64.8203 121.677C51.9944 121.677 45.2344 112.124 45.2344 112.124L29 116.5Z" fill="#212121"/>
<path fill-rule="evenodd" clip-rule="evenodd" d="M68.88 33.0742V117.574C49.55 117.574 27.38 111.074 13.88 97.5742C28.38 51.0742 49.55 33.0742 68.88 33.0742ZM68.88 117.574C88.21 117.574 110.38 111.074 123.88 97.5742C109.38 51.0742 88.21 33.0742 68.88 33.0742V117.574Z" fill="#FE6054"/>
<path fill-rule="evenodd" clip-rule="evenodd" d="M68.88 33.0742V117.574C49.55 117.574 27.38 111.074 13.88 97.5742C28.38 51.0742 49.55 33.0742 68.88 33.0742ZM68.88 117.574C88.21 117.574 110.38 111.074 123.88 97.5742C109.38 51.0742 88.21 33.0742 68.88 33.0742V117.574Z" fill="url(#paint5_linear)"/>
<path fill-rule="evenodd" clip-rule="evenodd" d="M68.88 33.0742V117.574C49.55 117.574 27.38 111.074 13.88 97.5742C28.38 51.0742 49.55 33.0742 68.88 33.0742ZM68.88 117.574C88.21 117.574 110.38 111.074 123.88 97.5742C109.38 51.0742 88.21 33.0742 68.88 33.0742V117.574Z" fill="url(#paint6_linear)"/>
<path d="M31.3801 62.0743C30.8801 64.0743 27.8801 66.5743 26.3801 67.0743C20.6267 59.9573 17.8395 51.7097 16.88 44.5743C15.4417 33.8772 17.944 25.4333 19.38 25.0743C21.7282 24.4873 27.7711 27.4604 35.88 31.0743C40.7657 33.2517 46.4624 35.7726 52.3801 37.5743C49.8801 42.0743 43.8801 47.5743 40.8801 47.5743L31.3801 62.0743Z" fill="#FE6054"/>
<path d="M31.3801 62.0743C30.8801 64.0743 27.8801 66.5743 26.3801 67.0743C20.6267 59.9573 17.8395 51.7097 16.88 44.5743C15.4417 33.8772 17.944 25.4333 19.38 25.0743C21.7282 24.4873 27.7711 27.4604 35.88 31.0743C40.7657 33.2517 46.4624 35.7726 52.3801 37.5743C49.8801 42.0743 43.8801 47.5743 40.8801 47.5743L31.3801 62.0743Z" fill="url(#paint7_linear)"/>
<path d="M106.379 62.0787C106.879 64.0787 109.879 66.5787 111.379 67.0787C117.132 59.9617 119.919 51.7141 120.879 44.5787C122.317 33.8816 119.815 25.4377 118.379 25.0787C116.031 24.4917 109.988 27.4648 101.879 31.0787C96.9932 33.2561 91.2965 35.777 85.3788 37.5787C87.8788 42.0787 93.8788 47.5787 96.8788 47.5787L106.379 62.0787Z" fill="#FE6054"/>
<path d="M106.379 62.0787C106.879 64.0787 109.879 66.5787 111.379 67.0787C117.132 59.9617 119.919 51.7141 120.879 44.5787C122.317 33.8816 119.815 25.4377 118.379 25.0787C116.031 24.4917 109.988 27.4648 101.879 31.0787C96.9932 33.2561 91.2965 35.777 85.3788 37.5787C87.8788 42.0787 93.8788 47.5787 96.8788 47.5787L106.379 62.0787Z" fill="url(#paint8_linear)"/>
<path d="M25.38 40.0744C28.38 38.5744 31.38 44.5744 40.88 47.5744C37.7906 53.7547 35.7251 56.94 31.38 62.0744C24.88 55.5744 22.38 41.5744 25.38 40.0744Z" fill="#FFCCA1"/>
<path d="M112.38 40.0744C109.38 38.5744 106.38 44.5744 96.88 47.5744C99.9694 53.7547 102.035 56.94 106.38 62.0744C112.88 55.5744 115.38 41.5744 112.38 40.0744Z" fill="#FFCCA1"/>
<path d="M35.88 31.0743C34.88 36.8445 24.38 31.8042 22.38 33.0743C18.0952 35.7955 23.3734 43.5743 16.88 44.5743C15.4695 33.9624 17.9382 25.4348 19.38 25.0743C21.7189 24.4896 27.8186 27.4359 35.88 31.0743Z" fill="black"/>
<path d="M101.88 31.0743C102.88 36.8445 113.38 31.8042 115.38 33.0743C119.665 35.7955 114.387 43.5743 120.88 44.5743C122.291 33.9624 119.822 25.4348 118.38 25.0743C116.041 24.4896 109.941 27.4359 101.88 31.0743Z" fill="black"/>
<path fill-rule="evenodd" clip-rule="evenodd" d="M68.8801 117.574C51.3028 117.574 31.3772 112.2 17.7576 101.074C24.88 95.0742 43.88 88.0742 55.3801 86.5742C58.38 82.0742 63.88 77.0742 68.8801 77.0742C73.8801 77.0742 79.3801 82.0742 82.38 86.5742C93.8801 88.0742 112.88 95.0742 120.002 101.074C106.383 112.2 86.4573 117.574 68.8801 117.574Z" fill="#FFCCA1"/>
<path fill-rule="evenodd" clip-rule="evenodd" d="M68.8801 117.574C51.3028 117.574 31.3772 112.2 17.7576 101.074C24.88 95.0742 43.88 88.0742 55.3801 86.5742C58.38 82.0742 63.88 77.0742 68.8801 77.0742C73.8801 77.0742 79.3801 82.0742 82.38 86.5742C93.8801 88.0742 112.88 95.0742 120.002 101.074C106.383 112.2 86.4573 117.574 68.8801 117.574Z" fill="url(#paint9_radial)"/>
<path fill-rule="evenodd" clip-rule="evenodd" d="M68.88 85.5742V92.5742C66.38 92.5742 65.38 91.0742 64.38 88.5742C63.5956 86.6132 64.9105 85.5742 68.88 85.5742ZM68.88 85.5742V92.5742C71.38 92.5742 72.38 91.0742 73.38 88.5742C74.1644 86.6132 72.8495 85.5742 68.88 85.5742Z" fill="black"/>
<path d="M50.4361 54.5743C50.4361 55.4982 48.3288 55.0084 46.436 55.5743C44.5433 56.1403 43.436 57.5743 42.9361 57.0743C41.5146 55.6528 43.5433 53.1403 45.4361 52.5743C47.3288 52.0084 50.436 53.0743 50.4361 54.5743Z" fill="black"/>
<path d="M87.3969 54.5743C87.3969 55.4982 89.5041 55.0084 91.3969 55.5743C93.2897 56.1403 94.3969 57.5743 94.8969 57.0743C96.3184 55.6528 94.2897 53.1403 92.3969 52.5743C90.5041 52.0084 87.3969 53.0743 87.3969 54.5743Z" fill="black"/>
<ellipse opacity="0.85" cx="68.88" cy="87.0742" rx="2" ry="1" fill="url(#paint10_linear)"/>
<path d="M71.38 104.5C71.38 105.5 73.38 107.3 75.38 106.5C77.38 105.7 77.38 103 76.38 102" stroke="black" stroke-width="1.5" stroke-linecap="round"/>
<g filter="url(#filter0_d)">
<path d="M38.436 67.4937C40.9816 64.0996 45.6027 68.1604 46.936 69.9937C47.936 66.4937 52.036 62.8937 56.436 66.4937C61.936 70.9937 50.936 82.4937 47.936 82.4937C45.436 82.4937 35.436 71.4937 38.436 67.4937Z" fill="#A60D0D"/>
</g>
<g filter="url(#filter1_d)">
<path d="M99.3969 67.4937C96.8513 64.0996 92.2303 68.1604 90.8969 69.9937C89.8969 66.4937 85.7969 62.8937 81.3969 66.4937C75.8969 70.9937 86.8969 82.4937 89.8969 82.4937C92.3969 82.4937 102.397 71.4937 99.3969 67.4937Z" fill="#A60D0D"/>
</g>
<path opacity="0.9" d="M55.4361 68.4937C55.4361 69.4176 53.7305 69.2152 52.4361 69.2152C50.9361 69.2152 49.9361 69.7152 49.4361 69.2152C48.8127 68.5917 49.5433 67.0597 51.4361 66.4937C53.3289 65.9277 55.436 66.9937 55.4361 68.4937Z" fill="white"/>
<path opacity="0.9" d="M82.3969 68.4937C82.3969 69.4176 84.1026 69.2152 85.3969 69.2152C86.8969 69.2152 87.8969 69.7152 88.3969 69.2152C89.0203 68.5917 88.2897 67.0597 86.3969 66.4937C84.5042 65.9277 82.397 66.9937 82.3969 68.4937Z" fill="white"/>
<path opacity="0.9" d="M40.436 68.4937C39.5075 68.8531 39.4653 70.0229 39.936 70.4937C40.2179 70.7756 40.8485 70.2693 41.436 69.9937C41.8907 69.7804 42.3438 69.8791 42.436 69.4937C42.595 68.8292 41.5823 68.0499 40.436 68.4937Z" fill="white"/>
<path opacity="0.9" d="M97.397 68.4937C98.3255 68.8531 98.3677 70.0229 97.8969 70.4937C97.6151 70.7756 96.9844 70.2693 96.3969 69.9937C95.9423 69.7804 95.4891 69.8791 95.3969 69.4937C95.2379 68.8292 96.2506 68.0499 97.397 68.4937Z" fill="white"/>
<path d="M98.7987 224.54C98.6987 224.61 98.3478 225.091 96.4495 224.378C96.4495 224.378 96.1759 222.944 93.9115 221.151C93.9115 221.151 96.1886 219.787 97 220C97 220 99.4082 222.538 99.812 223.393C99.5568 223.841 99.2118 224.231 98.7987 224.54Z" fill="#45413D"/>
<path d="M100.071 223.189L99.8083 223.393C99.8083 223.393 96.7892 220.653 96.0514 220.149C97.4453 221.089 98.787 222.103 100.071 223.189V223.189Z" fill="#45413D"/>
<path d="M107.517 226.867C107.517 226.867 107.635 227.784 105.286 228.331C105.286 228.331 100.674 229.274 98.0779 229.212C97.0385 228.97 96.0318 228.604 95.0796 228.121C95.0796 228.121 91.9095 226.433 91.0716 226.457C91.0716 226.457 87.5336 225.302 87.1864 224.231C87.1864 224.202 87.1373 224.1 87.1336 224.07C86.9675 222.955 87.0147 226.168 87.0147 226.168C87.0147 226.168 87.0147 227.284 91.0094 228.02L91.0282 227.285C91.0282 227.285 94.1134 228.401 95.4645 229.35C96.545 229.932 97.7906 230.131 98.9988 229.916C98.9988 229.916 105.264 229.331 106.094 228.92C106.094 228.92 107.275 228.471 107.458 227.938C107.537 227.587 107.556 227.225 107.517 226.867V226.867Z" fill="#45413D"/>
<path d="M102.476 224.525C103.468 224.843 104.476 225.11 105.496 225.325C105.496 225.325 107.773 225.751 107.513 227.176C107.347 227.5 107.109 227.782 106.817 228C106.524 228.218 106.186 228.366 105.828 228.433C105.828 228.433 100.608 229.24 98.7572 229.24C97.6571 229.278 96.5696 228.997 95.6249 228.433C95.0346 228.089 94.4247 227.78 93.7983 227.508C93.7983 227.508 94.0115 225.917 95.5777 225.61C96.378 225.53 97.1856 225.57 97.9741 225.729C97.9741 225.729 99.9441 226.061 101.035 226.013C101.035 226.013 102.999 226.278 102.003 225.187C102.003 225.187 100.744 224.404 102.003 224.638C102.012 224.632 103.833 225.091 102.476 224.525Z" fill="#62433D"/>
<path d="M100.071 223.189C99.8437 223.319 99.6555 223.507 99.5253 223.734C99.5253 223.734 98.7177 225.219 96.9628 224.536C96.9628 224.536 94.7324 223.749 93.4983 224.536C93.4983 224.536 92.1774 225.087 92.2171 226.842C92.2171 226.842 93.5379 227.365 93.8059 227.506C93.8059 227.506 94.1833 225.395 96.4873 225.608C96.4873 225.608 97.9968 225.75 100.072 225.985C100.072 225.985 103.454 226.45 101.946 225.108C101.946 225.108 100.661 224.278 102.254 224.753C102.254 224.753 103.537 224.991 102.82 224.659C102.822 224.661 101.139 224.044 100.071 223.189Z" fill="#855951"/>
<path d="M96.4382 224.381C96.4382 224.381 92.4529 223.438 92.2095 226.834L91.7585 226.691C91.7585 226.691 91.5453 226.406 91.5453 224.864C91.5453 224.864 91.5679 223.608 89.7413 223.038C89.7413 223.038 87.7714 222.54 87.7959 221.685C87.7959 221.685 87.8676 221.14 88.0091 220.949C88.0091 220.949 90.9037 223.274 93.419 221.4C93.419 221.4 93.8945 221.187 93.8945 221.09C93.9002 221.1 96.5872 223.319 96.4382 224.381Z" fill="#7B534B"/>
<path d="M91.7566 226.7C91.6078 226.088 91.5443 225.457 91.5679 224.827C91.5664 224.499 91.4659 224.18 91.2797 223.911C91.0935 223.641 90.8302 223.434 90.5244 223.317C90.5244 223.317 88.4601 222.462 88.3657 222.391C88.3657 222.391 87.4732 222.177 88.0185 220.968C88.0185 220.968 87.4392 220.755 87.5355 220.185C87.5355 220.185 86.4505 223.581 87.3694 224.787C87.3694 224.787 87.6676 225.261 89.1243 225.919C89.747 226.204 90.966 226.368 91.7566 226.7Z" fill="#62433D"/>
<path d="M95.7872 220.211C95.7872 220.211 99.4121 223.338 99.546 223.664L99.6253 223.57C99.6253 223.57 96.4025 220.551 95.9062 220.211H95.7872Z" fill="#D0CECD"/>
<path d="M95.6381 221.191C95.7663 221.191 95.8702 221.087 95.8702 220.958C95.8702 220.83 95.7663 220.726 95.6381 220.726C95.5099 220.726 95.406 220.83 95.406 220.958C95.406 221.087 95.5099 221.191 95.6381 221.191Z" fill="white"/>
<path d="M96.6288 222.004C96.7569 222.004 96.8609 221.9 96.8609 221.772C96.8609 221.643 96.7569 221.54 96.6288 221.54C96.5006 221.54 96.3967 221.643 96.3967 221.772C96.3967 221.9 96.5006 222.004 96.6288 222.004Z" fill="white"/>
<path d="M97.4006 222.883C97.5287 222.883 97.6327 222.779 97.6327 222.651C97.6327 222.523 97.5287 222.419 97.4006 222.419C97.2724 222.419 97.1685 222.523 97.1685 222.651C97.1685 222.779 97.2724 222.883 97.4006 222.883Z" fill="white"/>
<path d="M98.293 223.67C98.4212 223.67 98.5251 223.566 98.5251 223.438C98.5251 223.31 98.4212 223.206 98.293 223.206C98.1648 223.206 98.0609 223.31 98.0609 223.438C98.0609 223.566 98.1648 223.67 98.293 223.67Z" fill="white"/>
<path d="M96.5727 220.368C96.5727 220.368 96.5727 220.475 95.7613 220.807V220.909C95.7613 220.909 96.484 220.781 96.7048 220.454L96.5727 220.368Z" fill="white"/>
<path d="M97.4005 221.094C97.4005 221.094 97.3571 221.283 96.591 221.711L96.6042 221.811C96.6042 221.811 97.3382 221.526 97.5137 221.177L97.4005 221.094Z" fill="white"/>
<path d="M98.3496 221.812C98.3496 221.812 98.1609 222.162 97.4175 222.566L97.5137 222.655C97.5137 222.655 98.2572 222.232 98.4723 221.9L98.3496 221.812Z" fill="white"/>
<path d="M99.2818 222.543C99.2818 222.543 99.0931 222.902 98.3383 223.298L98.4346 223.387C98.4346 223.387 99.1799 222.96 99.3969 222.632L99.2818 222.543Z" fill="white"/>
<path d="M91.0075 228.019L91.9434 227.636L91.0283 227.285L91.0075 228.019Z" fill="#62433D"/>
<path d="M38.7378 224.562C38.8378 224.632 39.1887 225.113 41.087 224.4C41.087 224.4 41.3606 222.966 43.625 221.173C43.625 221.173 41.3479 219.809 40.5365 220.023C40.5365 220.023 38.1283 222.56 37.7245 223.415C37.9797 223.863 38.3247 224.254 38.7378 224.562Z" fill="#45413D"/>
<path d="M37.4659 223.211L37.7282 223.415C37.7282 223.415 40.7473 220.675 41.4851 220.171C40.0912 221.111 38.7495 222.126 37.4659 223.211V223.211Z" fill="#45413D"/>
<path d="M30.02 226.889C30.02 226.889 29.9011 227.806 32.2504 228.353C32.2504 228.353 36.8621 229.297 39.4586 229.235C40.498 228.992 41.5047 228.626 42.4569 228.144C42.4569 228.144 45.627 226.455 46.4649 226.48C46.4649 226.48 50.0029 225.325 50.3501 224.253C50.3501 224.225 50.3992 224.123 50.4029 224.093C50.569 222.977 50.5218 226.191 50.5218 226.191C50.5218 226.191 50.5218 227.306 46.5271 228.042L46.5083 227.308C46.5083 227.308 43.4231 228.423 42.072 229.372C40.9915 229.954 39.7459 230.154 38.5377 229.938C38.5377 229.938 32.273 229.353 31.4427 228.942C31.4427 228.942 30.2615 228.493 30.0785 227.961C29.9999 227.609 29.9802 227.247 30.02 226.889V226.889Z" fill="#45413D"/>
<path d="M35.0601 224.547C34.068 224.865 33.0603 225.132 32.0409 225.347C32.0409 225.347 29.7634 225.774 30.0238 227.198C30.1896 227.523 30.4278 227.805 30.72 228.023C31.0122 228.241 31.3505 228.389 31.7088 228.455C31.7088 228.455 36.9282 229.263 38.7793 229.263C39.8793 229.3 40.9669 229.02 41.9116 228.455C42.5019 228.111 43.1118 227.803 43.7382 227.53C43.7382 227.53 43.525 225.94 41.9588 225.632C41.1585 225.553 40.3509 225.593 39.5624 225.751C39.5624 225.751 37.5924 226.083 36.5017 226.036C36.5017 226.036 34.5374 226.3 35.5337 225.209C35.5337 225.209 36.7923 224.426 35.5337 224.66C35.5243 224.655 33.7033 225.113 35.0601 224.547Z" fill="#62433D"/>
<path d="M37.4659 223.211C37.6928 223.342 37.881 223.53 38.0112 223.757C38.0112 223.757 38.8188 225.242 40.5737 224.559C40.5737 224.559 42.8041 223.772 44.0382 224.559C44.0382 224.559 45.3591 225.11 45.3194 226.865C45.3194 226.865 43.9986 227.387 43.7306 227.529C43.7306 227.529 43.3532 225.417 41.0492 225.631C41.0492 225.631 39.5397 225.772 37.464 226.008C37.464 226.008 34.0826 226.472 35.5903 225.13C35.5903 225.13 36.8753 224.3 35.2827 224.776C35.2827 224.776 33.9995 225.013 34.7166 224.681C34.7147 224.683 36.3979 224.066 37.4659 223.211Z" fill="#855951"/>
<path d="M41.0983 224.404C41.0983 224.404 45.0836 223.46 45.327 226.857L45.778 226.713C45.778 226.713 45.9912 226.429 45.9912 224.887C45.9912 224.887 45.9686 223.63 47.7952 223.06C47.7952 223.06 49.7651 222.562 49.7406 221.707C49.7406 221.707 49.6689 221.162 49.5274 220.971C49.5274 220.971 46.6328 223.296 44.1175 221.422C44.1175 221.422 43.6419 221.209 43.6419 221.113C43.6363 221.122 40.9493 223.341 41.0983 224.404Z" fill="#7B534B"/>
<path d="M45.7799 226.723C45.9287 226.11 45.9922 225.479 45.9686 224.849C45.9701 224.522 46.0706 224.202 46.2568 223.933C46.443 223.664 46.7063 223.457 47.0121 223.34C47.0121 223.34 49.0764 222.485 49.1708 222.413C49.1708 222.413 50.0633 222.2 49.518 220.99C49.518 220.99 50.0973 220.777 50.001 220.207C50.001 220.207 51.086 223.604 50.1671 224.81C50.1671 224.81 49.8689 225.283 48.4122 225.942C47.7895 226.227 46.5705 226.391 45.7799 226.723Z" fill="#62433D"/>
<path d="M41.7493 220.234C41.7493 220.234 38.1244 223.36 37.9905 223.687L37.9112 223.593C37.9112 223.593 41.134 220.573 41.6302 220.234H41.7493Z" fill="#D0CECD"/>
<path d="M41.8984 221.213C41.7702 221.213 41.6663 221.109 41.6663 220.981C41.6663 220.853 41.7702 220.749 41.8984 220.749C42.0266 220.749 42.1305 220.853 42.1305 220.981C42.1305 221.109 42.0266 221.213 41.8984 221.213Z" fill="white"/>
<path d="M40.9077 222.026C40.7796 222.026 40.6756 221.922 40.6756 221.794C40.6756 221.666 40.7796 221.562 40.9077 221.562C41.0359 221.562 41.1398 221.666 41.1398 221.794C41.1398 221.922 41.0359 222.026 40.9077 222.026Z" fill="white"/>
<path d="M40.1359 222.906C40.0078 222.906 39.9038 222.802 39.9038 222.674C39.9038 222.545 40.0078 222.441 40.1359 222.441C40.2641 222.441 40.368 222.545 40.368 222.674C40.368 222.802 40.2641 222.906 40.1359 222.906Z" fill="white"/>
<path d="M39.2435 223.692C39.1153 223.692 39.0114 223.589 39.0114 223.46C39.0114 223.332 39.1153 223.228 39.2435 223.228C39.3717 223.228 39.4756 223.332 39.4756 223.46C39.4756 223.589 39.3717 223.692 39.2435 223.692Z" fill="white"/>
<path d="M40.9638 220.39C40.9638 220.39 40.9638 220.498 41.7752 220.83V220.932C41.7752 220.932 41.0525 220.803 40.8317 220.477L40.9638 220.39Z" fill="white"/>
<path d="M40.136 221.117C40.136 221.117 40.1794 221.305 40.9455 221.734L40.9323 221.834C40.9323 221.834 40.1983 221.549 40.0228 221.2L40.136 221.117Z" fill="white"/>
<path d="M39.1869 221.834C39.1869 221.834 39.3756 222.185 40.119 222.589L40.0228 222.677C40.0228 222.677 39.2793 222.255 39.0642 221.923L39.1869 221.834Z" fill="white"/>
<path d="M38.2547 222.566C38.2547 222.566 38.4434 222.924 39.1982 223.321L39.1019 223.409C39.1019 223.409 38.3566 222.983 38.1396 222.655L38.2547 222.566Z" fill="white"/>
<path d="M46.529 228.042L45.5931 227.659L46.5082 227.308L46.529 228.042Z" fill="#62433D"/>
<defs>
<filter id="filter0_d" x="33.88" y="63" width="28.0729" height="25.4937" filterUnits="userSpaceOnUse" color-interpolation-filters="sRGB">
<feFlood flood-opacity="0" result="BackgroundImageFix"/>
<feColorMatrix in="SourceAlpha" type="matrix" values="0 0 0 0 0 0 0 0 0 0 0 0 0 0 0 0 0 0 127 0"/>
<feOffset dy="2"/>
<feGaussianBlur stdDeviation="2"/>
<feColorMatrix type="matrix" values="0 0 0 0 0 0 0 0 0 0 0 0 0 0 0 0 0 0 0.15 0"/>
<feBlend mode="normal" in2="BackgroundImageFix" result="effect1_dropShadow"/>
<feBlend mode="normal" in="SourceGraphic" in2="effect1_dropShadow" result="shape"/>
</filter>
<filter id="filter1_d" x="75.88" y="63" width="28.0729" height="25.4937" filterUnits="userSpaceOnUse" color-interpolation-filters="sRGB">
<feFlood flood-opacity="0" result="BackgroundImageFix"/>
<feColorMatrix in="SourceAlpha" type="matrix" values="0 0 0 0 0 0 0 0 0 0 0 0 0 0 0 0 0 0 127 0"/>
<feOffset dy="2"/>
<feGaussianBlur stdDeviation="2"/>
<feColorMatrix type="matrix" values="0 0 0 0 0 0 0 0 0 0 0 0 0 0 0 0 0 0 0.15 0"/>
<feBlend mode="normal" in2="BackgroundImageFix" result="effect1_dropShadow"/>
<feBlend mode="normal" in="SourceGraphic" in2="effect1_dropShadow" result="shape"/>
</filter>
<linearGradient id="paint0_linear" x1="101.628" y1="170.188" x2="132.626" y2="183.965" gradientUnits="userSpaceOnUse">
<stop stop-color="#D4362A" stop-opacity="0.9"/>
<stop offset="1" stop-color="#D4362A" stop-opacity="0"/>
</linearGradient>
<linearGradient id="paint1_linear" x1="137.876" y1="167.5" x2="125.376" y2="187.5" gradientUnits="userSpaceOnUse">
<stop stop-color="white" stop-opacity="0.21"/>
<stop offset="1" stop-color="white" stop-opacity="0"/>
</linearGradient>
<linearGradient id="paint2_linear" x1="153.876" y1="182" x2="145.876" y2="193.5" gradientUnits="userSpaceOnUse">
<stop stop-color="white" stop-opacity="0.32"/>
<stop offset="1" stop-color="white" stop-opacity="0"/>
</linearGradient>
<linearGradient id="paint3_linear" x1="68.876" y1="202" x2="68.876" y2="148" gradientUnits="userSpaceOnUse">
<stop stop-color="#D4362A" stop-opacity="0.49"/>
<stop offset="1" stop-color="#D4362A" stop-opacity="0"/>
</linearGradient>
<radialGradient id="paint4_radial" cx="0" cy="0" r="1" gradientUnits="userSpaceOnUse" gradientTransform="translate(68.876 114) rotate(90) scale(15.5 23.4634)">
<stop stop-color="#D4362A"/>
<stop offset="1" stop-color="#D4362A" stop-opacity="0"/>
</radialGradient>
<linearGradient id="paint5_linear" x1="13.88" y1="77.0742" x2="123.88" y2="77.0742" gradientUnits="userSpaceOnUse">
<stop stop-color="#D5362A"/>
<stop offset="0.235734" stop-color="#D4362A" stop-opacity="0"/>
<stop offset="0.763059" stop-color="#D4362A" stop-opacity="0"/>
<stop offset="1" stop-color="#D4362A"/>
</linearGradient>
<linearGradient id="paint6_linear" x1="68.88" y1="8.07422" x2="68.88" y2="49.5742" gradientUnits="userSpaceOnUse">
<stop stop-color="#CF2D21"/>
<stop offset="1" stop-color="#F7594D" stop-opacity="0.1"/>
</linearGradient>
<linearGradient id="paint7_linear" x1="16.38" y1="41.0743" x2="26.38" y2="42.5743" gradientUnits="userSpaceOnUse">
<stop stop-color="#F77066"/>
<stop offset="1" stop-color="#F77066" stop-opacity="0"/>
</linearGradient>
<linearGradient id="paint8_linear" x1="121.379" y1="41.0787" x2="111.379" y2="42.5787" gradientUnits="userSpaceOnUse">
<stop stop-color="#F77066"/>
<stop offset="1" stop-color="#F77066" stop-opacity="0"/>
</linearGradient>
<radialGradient id="paint9_radial" cx="0" cy="0" r="1" gradientUnits="userSpaceOnUse" gradientTransform="translate(68.88 80.5742) rotate(90) scale(19.5 49.229)">
<stop stop-color="white" stop-opacity="0.44"/>
<stop offset="1" stop-color="white" stop-opacity="0"/>
</radialGradient>
<linearGradient id="paint10_linear" x1="68.88" y1="86.0742" x2="68.88" y2="88.0742" gradientUnits="userSpaceOnUse">
<stop stop-color="white"/>
<stop offset="1" stop-color="white" stop-opacity="0"/>
</linearGradient>
</defs>
</svg>
