Time,"U:0","U:1","U:2","p","vtkValidPointMask","arc_length"
2.2,3.875e-23,2.5854e-21,3.7105e-16,64.178,1,0
2.2,4.0735e-09,2.7178e-07,0.039006,64.178,1,0.00049999
2.2,8.1472e-09,5.4358e-07,0.078014,64.178,1,0.001
2.2,1.2221e-08,8.1536e-07,0.11702,64.178,1,0.0015
2.2,1.6294e-08,1.0872e-06,0.15603,64.178,1,0.002
2.2,2.0368e-08,1.3589e-06,0.19503,64.178,1,0.0025
2.2,2.4442e-08,1.6307e-06,0.23404,64.178,1,0.003
2.2,2.8515e-08,1.9025e-06,0.27305,64.178,1,0.0035
2.2,3.2589e-08,2.1743e-06,0.31205,64.178,1,0.004
2.2,3.6662e-08,2.4461e-06,0.35106,64.178,1,0.0045
2.2,4.0736e-08,2.7179e-06,0.39007,64.178,1,0.005
2.2,4.481e-08,2.9897e-06,0.42908,64.178,1,0.0055
2.2,4.8883e-08,3.2615e-06,0.46808,64.178,1,0.006
2.2,5.2957e-08,3.5332e-06,0.50709,64.178,1,0.0065
2.2,5.703e-08,3.805e-06,0.5461,64.178,1,0.007
2.2,6.1104e-08,4.0768e-06,0.5851,64.178,1,0.0075
2.2,6.5177e-08,4.3486e-06,0.62411,64.178,1,0.008
2.2,6.9251e-08,4.6204e-06,0.66312,64.178,1,0.0085
2.2,7.3325e-08,4.8922e-06,0.70212,64.178,1,0.009
2.2,7.7398e-08,5.164e-06,0.74113,64.178,1,0.0095
2.2,8.1472e-08,5.4358e-06,0.78014,64.178,1,0.01
2.2,8.5545e-08,5.7076e-06,0.81914,64.178,1,0.0105
2.2,8.9384e-08,6.1785e-06,0.85722,64.178,1,0.011
2.2,9.3052e-08,6.7936e-06,0.89462,64.178,1,0.0115
2.2,9.672e-08,7.4086e-06,0.93202,64.178,1,0.012
2.2,1.0039e-07,8.0237e-06,0.96942,64.178,1,0.0125
2.2,1.0406e-07,8.6388e-06,1.0068,64.178,1,0.013
2.2,1.0772e-07,9.2539e-06,1.0442,64.178,1,0.0135
2.2,1.1139e-07,9.869e-06,1.0816,64.178,1,0.014
2.2,1.1506e-07,1.0484e-05,1.119,64.178,1,0.0145
2.2,1.1873e-07,1.1099e-05,1.1564,64.178,1,0.015
2.2,1.224e-07,1.1714e-05,1.1938,64.178,1,0.0155
2.2,1.2606e-07,1.2329e-05,1.2312,64.178,1,0.016
2.2,1.2973e-07,1.2944e-05,1.2686,64.178,1,0.0165
2.2,1.334e-07,1.356e-05,1.306,64.178,1,0.017
2.2,1.3707e-07,1.4175e-05,1.3434,64.178,1,0.0175
2.2,1.4074e-07,1.479e-05,1.3808,64.178,1,0.018
2.2,1.4441e-07,1.5405e-05,1.4182,64.178,1,0.0185
2.2,1.4807e-07,1.602e-05,1.4556,64.178,1,0.019
2.2,1.5174e-07,1.6635e-05,1.493,64.178,1,0.0195
2.2,1.5541e-07,1.725e-05,1.5304,64.178,1,0.02
2.2,1.5908e-07,1.7865e-05,1.5678,64.178,1,0.0205
2.2,1.6275e-07,1.848e-05,1.6052,64.178,1,0.021
2.2,1.6635e-07,1.916e-05,1.6424,64.178,1,0.0215
2.2,1.6964e-07,2.018e-05,1.678,64.178,1,0.022
2.2,1.7292e-07,2.1201e-05,1.7137,64.178,1,0.0225
2.2,1.762e-07,2.2221e-05,1.7494,64.178,1,0.023
2.2,1.7949e-07,2.3241e-05,1.7851,64.178,1,0.0235
2.2,1.8277e-07,2.4261e-05,1.8207,64.178,1,0.024
2.2,1.8606e-07,2.5282e-05,1.8564,64.178,1,0.0245
2.2,1.8934e-07,2.6302e-05,1.8921,64.178,1,0.025
2.2,1.9262e-07,2.7322e-05,1.9277,64.178,1,0.0255
2.2,1.9591e-07,2.8342e-05,1.9634,64.178,1,0.026
2.2,1.9919e-07,2.9362e-05,1.9991,64.178,1,0.0265
2.2,2.0248e-07,3.0383e-05,2.0348,64.178,1,0.027
2.2,2.0576e-07,3.1403e-05,2.0704,64.178,1,0.0275
2.2,2.0904e-07,3.2423e-05,2.1061,64.178,1,0.028
2.2,2.1233e-07,3.3443e-05,2.1418,64.178,1,0.0285
2.2,2.1561e-07,3.4464e-05,2.1775,64.178,1,0.029
2.2,2.1889e-07,3.5484e-05,2.2131,64.178,1,0.0295
2.2,2.2218e-07,3.6504e-05,2.2488,64.178,1,0.03
2.2,2.2546e-07,3.7524e-05,2.2845,64.178,1,0.0305
2.2,2.2875e-07,3.8545e-05,2.3202,64.178,1,0.031
2.2,2.3203e-07,3.9565e-05,2.3558,64.178,1,0.0315
2.2,2.3531e-07,4.0585e-05,2.3915,64.178,1,0.032
2.2,2.3823e-07,4.1847e-05,2.4259,64.178,1,0.0325
2.2,2.4102e-07,4.3194e-05,2.4599,64.178,1,0.033
2.2,2.4381e-07,4.4541e-05,2.4938,64.178,1,0.0335
2.2,2.4659e-07,4.5888e-05,2.5278,64.178,1,0.034
2.2,2.4938e-07,4.7235e-05,2.5617,64.178,1,0.0345
2.2,2.5217e-07,4.8582e-05,2.5957,64.178,1,0.035
2.2,2.5496e-07,4.9929e-05,2.6296,64.178,1,0.0355
2.2,2.5774e-07,5.1276e-05,2.6635,64.178,1,0.036
2.2,2.6053e-07,5.2623e-05,2.6975,64.178,1,0.0365
2.2,2.6332e-07,5.397e-05,2.7314,64.178,1,0.037
2.2,2.6611e-07,5.5316e-05,2.7654,64.178,1,0.0375
2.2,2.6889e-07,5.6663e-05,2.7993,64.178,1,0.038
2.2,2.7168e-07,5.801e-05,2.8333,64.178,1,0.0385
2.2,2.7447e-07,5.9357e-05,2.8672,64.178,1,0.039
2.2,2.7726e-07,6.0704e-05,2.9012,64.178,1,0.0395
2.2,2.8004e-07,6.2051e-05,2.9351,64.178,1,0.04
2.2,2.8283e-07,6.3398e-05,2.9691,64.178,1,0.0405
2.2,2.8562e-07,6.4745e-05,3.003,64.178,1,0.041
2.2,2.8841e-07,6.6092e-05,3.037,64.178,1,0.0415
2.2,2.9119e-07,6.7439e-05,3.0709,64.178,1,0.042
2.2,2.9398e-07,6.8786e-05,3.1049,64.178,1,0.0425
2.2,2.9659e-07,7.0215e-05,3.1383,64.178,1,0.043
2.2,2.9882e-07,7.182e-05,3.1705,64.178,1,0.0435
2.2,3.0105e-07,7.3424e-05,3.2027,64.178,1,0.044
2.2,3.0328e-07,7.5028e-05,3.2349,64.178,1,0.0445
2.2,3.0551e-07,7.6633e-05,3.2671,64.178,1,0.045
2.2,3.0774e-07,7.8237e-05,3.2994,64.178,1,0.0455
2.2,3.0997e-07,7.9842e-05,3.3316,64.178,1,0.046
2.2,3.122e-07,8.1446e-05,3.3638,64.178,1,0.0465
2.2,3.1443e-07,8.305e-05,3.396,64.178,1,0.047
2.2,3.1666e-07,8.4655e-05,3.4282,64.178,1,0.0475
2.2,3.1889e-07,8.6259e-05,3.4604,64.178,1,0.048
2.2,3.2112e-07,8.7864e-05,3.4927,64.178,1,0.0485
2.2,3.2335e-07,8.9468e-05,3.5249,64.178,1,0.049
2.2,3.2558e-07,9.1072e-05,3.5571,64.178,1,0.0495
2.2,3.2781e-07,9.2677e-05,3.5893,64.178,1,0.05
2.2,3.3004e-07,9.4281e-05,3.6215,64.178,1,0.0505
2.2,3.3227e-07,9.5886e-05,3.6538,64.178,1,0.051
2.2,3.345e-07,9.749e-05,3.686,64.178,1,0.0515
2.2,3.3673e-07,9.9094e-05,3.7182,64.178,1,0.052
2.2,3.3896e-07,0.0001007,3.7504,64.178,1,0.0525
2.2,3.4119e-07,0.0001023,3.7826,64.178,1,0.053
2.2,3.4342e-07,0.00010391,3.8149,64.178,1,0.0535
2.2,3.4514e-07,0.00010568,3.8455,64.178,1,0.054
2.2,3.468e-07,0.00010748,3.876,64.178,1,0.0545
2.2,3.4846e-07,0.00010928,3.9065,64.178,1,0.055
2.2,3.5012e-07,0.00011107,3.937,64.178,1,0.0555
2.2,3.5178e-07,0.00011287,3.9675,64.178,1,0.056
2.2,3.5343e-07,0.00011467,3.998,64.178,1,0.0565
2.2,3.5509e-07,0.00011646,4.0285,64.178,1,0.057
2.2,3.5675e-07,0.00011826,4.0589,64.178,1,0.0575
2.2,3.5841e-07,0.00012006,4.0894,64.178,1,0.058
2.2,3.6007e-07,0.00012185,4.1199,64.178,1,0.0585
2.2,3.6173e-07,0.00012365,4.1504,64.178,1,0.059
2.2,3.6339e-07,0.00012545,4.1809,64.178,1,0.0595
2.2,3.6505e-07,0.00012724,4.2114,64.178,1,0.06
2.2,3.6671e-07,0.00012904,4.2419,64.178,1,0.0605
2.2,3.6836e-07,0.00013083,4.2724,64.178,1,0.061
2.2,3.7002e-07,0.00013263,4.3029,64.178,1,0.0615
2.2,3.7168e-07,0.00013443,4.3334,64.178,1,0.062
2.2,3.7334e-07,0.00013622,4.3638,64.178,1,0.0625
2.2,3.75e-07,0.00013802,4.3943,64.178,1,0.063
2.2,3.7666e-07,0.00013982,4.4248,64.178,1,0.0635
2.2,3.7832e-07,0.00014161,4.4553,64.178,1,0.064
2.2,3.7969e-07,0.00014347,4.485,64.178,1,0.0645
2.2,3.8075e-07,0.00014538,4.5137,64.178,1,0.065
2.2,3.8182e-07,0.0001473,4.5425,64.178,1,0.0655
2.2,3.8288e-07,0.00014921,4.5713,64.178,1,0.066
2.2,3.8394e-07,0.00015113,4.6,64.178,1,0.0665
2.2,3.85e-07,0.00015305,4.6288,64.178,1,0.067
2.2,3.8607e-07,0.00015496,4.6575,64.178,1,0.0675
2.2,3.8713e-07,0.00015688,4.6863,64.178,1,0.068
2.2,3.8819e-07,0.00015879,4.7151,64.178,1,0.0685
2.2,3.8926e-07,0.00016071,4.7438,64.178,1,0.069
2.2,3.9032e-07,0.00016262,4.7726,64.178,1,0.0695
2.2,3.9138e-07,0.00016454,4.8013,64.178,1,0.07
2.2,3.9244e-07,0.00016646,4.8301,64.178,1,0.0705
2.2,3.9351e-07,0.00016837,4.8589,64.178,1,0.071
2.2,3.9457e-07,0.00017029,4.8876,64.178,1,0.0715
2.2,3.9563e-07,0.0001722,4.9164,64.178,1,0.072
2.2,3.967e-07,0.00017412,4.9451,64.178,1,0.0725
2.2,3.9776e-07,0.00017603,4.9739,64.178,1,0.073
2.2,3.9882e-07,0.00017795,5.0027,64.178,1,0.0735
2.2,3.9988e-07,0.00017987,5.0314,64.178,1,0.074
2.2,4.0095e-07,0.00018178,5.0602,64.178,1,0.0745
2.2,4.0198e-07,0.0001837,5.0888,64.178,1,0.075
2.2,4.0247e-07,0.00018566,5.1159,64.178,1,0.0755
2.2,4.0296e-07,0.00018761,5.1429,64.178,1,0.076
2.2,4.0345e-07,0.00018957,5.1699,64.178,1,0.0765
2.2,4.0395e-07,0.00019152,5.197,64.178,1,0.077
2.2,4.0444e-07,0.00019348,5.224,64.178,1,0.0775
2.2,4.0493e-07,0.00019543,5.251,64.178,1,0.078
2.2,4.0542e-07,0.00019739,5.2781,64.178,1,0.0785
2.2,4.0592e-07,0.00019935,5.3051,64.178,1,0.079
2.2,4.0641e-07,0.0002013,5.3321,64.178,1,0.0795
2.2,4.069e-07,0.00020326,5.3592,64.178,1,0.08
2.2,4.0739e-07,0.00020521,5.3862,64.178,1,0.0805
2.2,4.0789e-07,0.00020717,5.4132,64.178,1,0.081
2.2,4.0838e-07,0.00020912,5.4403,64.178,1,0.0815
2.2,4.0887e-07,0.00021108,5.4673,64.178,1,0.082
2.2,4.0936e-07,0.00021303,5.4943,64.178,1,0.0825
2.2,4.0986e-07,0.00021499,5.5214,64.178,1,0.083
2.2,4.1035e-07,0.00021695,5.5484,64.178,1,0.0835
2.2,4.1084e-07,0.0002189,5.5754,64.178,1,0.084
2.2,4.1133e-07,0.00022086,5.6024,64.178,1,0.0845
2.2,4.1183e-07,0.00022281,5.6295,64.178,1,0.085
2.2,4.1232e-07,0.00022477,5.6565,64.178,1,0.0855
2.2,4.1247e-07,0.0002267,5.6824,64.178,1,0.086
2.2,4.1244e-07,0.00022861,5.7077,64.178,1,0.0865
2.2,4.124e-07,0.00023052,5.7331,64.178,1,0.087
2.2,4.1237e-07,0.00023243,5.7584,64.178,1,0.0875
2.2,4.1233e-07,0.00023435,5.7837,64.178,1,0.088
2.2,4.1229e-07,0.00023626,5.809,64.178,1,0.0885
2.2,4.1226e-07,0.00023817,5.8343,64.178,1,0.089
2.2,4.1222e-07,0.00024008,5.8596,64.178,1,0.0895
2.2,4.1219e-07,0.00024199,5.8849,64.178,1,0.09
2.2,4.1215e-07,0.00024391,5.9102,64.178,1,0.0905
2.2,4.1211e-07,0.00024582,5.9355,64.178,1,0.091
2.2,4.1208e-07,0.00024773,5.9608,64.178,1,0.0915
2.2,4.1204e-07,0.00024964,5.9861,64.178,1,0.092
2.2,4.1201e-07,0.00025156,6.0114,64.178,1,0.0925
2.2,4.1197e-07,0.00025347,6.0367,64.178,1,0.093
2.2,4.1193e-07,0.00025538,6.062,64.178,1,0.0935
2.2,4.119e-07,0.00025729,6.0873,64.178,1,0.094
2.2,4.1186e-07,0.0002592,6.1126,64.178,1,0.0945
2.2,4.1183e-07,0.00026112,6.1379,64.178,1,0.095
2.2,4.1179e-07,0.00026303,6.1633,64.178,1,0.0955
2.2,4.1175e-07,0.00026494,6.1886,64.178,1,0.096
2.2,4.116e-07,0.00026685,6.2139,64.178,1,0.0965
2.2,4.1105e-07,0.00026877,6.2393,64.178,1,0.097
2.2,4.105e-07,0.00027069,6.2647,64.178,1,0.0975
2.2,4.0994e-07,0.00027261,6.2901,64.178,1,0.098
2.2,4.0939e-07,0.00027453,6.3156,64.178,1,0.0985
2.2,4.0883e-07,0.00027645,6.341,64.178,1,0.099
2.2,4.0828e-07,0.00027837,6.3664,64.178,1,0.0995
2.2,4.0773e-07,0.00028029,6.3918,64.178,1,0.1
2.2,4.0717e-07,0.00028221,6.4172,64.178,1,0.1005
2.2,4.0662e-07,0.00028413,6.4426,64.178,1,0.101
2.2,4.0607e-07,0.00028605,6.4681,64.178,1,0.1015
2.2,4.0551e-07,0.00028797,6.4935,64.178,1,0.102
2.2,4.0496e-07,0.00028989,6.5189,64.178,1,0.1025
2.2,4.044e-07,0.00029181,6.5443,64.178,1,0.103
2.2,4.0385e-07,0.00029373,6.5697,64.178,1,0.1035
2.2,4.033e-07,0.00029565,6.5952,64.178,1,0.104
2.2,4.0274e-07,0.00029756,6.6206,64.178,1,0.1045
2.2,4.0219e-07,0.00029948,6.646,64.178,1,0.105
2.2,4.0163e-07,0.0003014,6.6714,64.178,1,0.1055
2.2,4.0108e-07,0.00030332,6.6968,64.178,1,0.106
2.2,4.0053e-07,0.00030524,6.7222,64.178,1,0.1065
2.2,3.9997e-07,0.00030716,6.7477,64.178,1,0.107
2.2,3.9926e-07,0.00030868,6.769,64.178,1,0.1075
2.2,3.9851e-07,0.0003101,6.7894,64.178,1,0.108
2.2,3.9776e-07,0.00031153,6.8098,64.178,1,0.1085
2.2,3.9701e-07,0.00031295,6.8301,64.178,1,0.109
2.2,3.9626e-07,0.00031437,6.8505,64.178,1,0.1095
2.2,3.9551e-07,0.00031579,6.8709,64.178,1,0.11
2.2,3.9476e-07,0.00031721,6.8912,64.178,1,0.1105
2.2,3.9401e-07,0.00031864,6.9116,64.178,1,0.111
2.2,3.9325e-07,0.00032006,6.932,64.178,1,0.1115
2.2,3.925e-07,0.00032148,6.9524,64.178,1,0.112
2.2,3.9175e-07,0.0003229,6.9727,64.178,1,0.1125
2.2,3.91e-07,0.00032432,6.9931,64.178,1,0.113
2.2,3.9025e-07,0.00032574,7.0135,64.178,1,0.1135
2.2,3.895e-07,0.00032717,7.0338,64.178,1,0.114
2.2,3.8875e-07,0.00032859,7.0542,64.178,1,0.1145
2.2,3.88e-07,0.00033001,7.0746,64.178,1,0.115
2.2,3.8725e-07,0.00033143,7.0949,64.178,1,0.1155
2.2,3.865e-07,0.00033285,7.1153,64.178,1,0.116
2.2,3.8575e-07,0.00033427,7.1357,64.178,1,0.1165
2.2,3.8499e-07,0.0003357,7.156,64.178,1,0.117
2.2,3.8424e-07,0.00033712,7.1764,64.178,1,0.1175
2.2,3.8349e-07,0.00033854,7.1968,64.178,1,0.118
2.2,3.8274e-07,0.00033996,7.2171,64.178,1,0.1185
2.2,3.8199e-07,0.00034138,7.2375,64.178,1,0.119
2.2,3.8124e-07,0.0003428,7.2579,64.178,1,0.1195
2.2,3.8049e-07,0.00034423,7.2782,64.178,1,0.12
2.2,3.7974e-07,0.00034565,7.2986,64.178,1,0.1205
2.2,3.7899e-07,0.00034707,7.319,64.178,1,0.121
2.2,3.7812e-07,0.00034822,7.3385,64.178,1,0.1215
2.2,3.7721e-07,0.0003493,7.3579,64.178,1,0.122
2.2,3.7631e-07,0.00035038,7.3772,64.178,1,0.1225
2.2,3.7541e-07,0.00035147,7.3966,64.178,1,0.123
2.2,3.7451e-07,0.00035255,7.4159,64.178,1,0.1235
2.2,3.7361e-07,0.00035363,7.4352,64.178,1,0.124
2.2,3.7271e-07,0.00035471,7.4546,64.178,1,0.1245
2.2,3.718e-07,0.00035579,7.4739,64.178,1,0.125
2.2,3.709e-07,0.00035688,7.4933,64.178,1,0.1255
2.2,3.7e-07,0.00035796,7.5126,64.178,1,0.126
2.2,3.691e-07,0.00035904,7.532,64.178,1,0.1265
2.2,3.682e-07,0.00036012,7.5513,64.178,1,0.127
2.2,3.673e-07,0.00036121,7.5706,64.178,1,0.1275
2.2,3.6639e-07,0.00036229,7.59,64.178,1,0.128
2.2,3.6549e-07,0.00036337,7.6093,64.178,1,0.1285
2.2,3.6459e-07,0.00036445,7.6287,64.178,1,0.129
2.2,3.6369e-07,0.00036553,7.648,64.178,1,0.1295
2.2,3.6279e-07,0.00036662,7.6674,64.178,1,0.13
2.2,3.6189e-07,0.0003677,7.6867,64.178,1,0.1305
2.2,3.6098e-07,0.00036878,7.706,64.178,1,0.131
2.2,3.6008e-07,0.00036986,7.7254,64.178,1,0.1315
2.2,3.5918e-07,0.00037095,7.7447,64.178,1,0.132
2.2,3.5828e-07,0.00037203,7.7641,64.178,1,0.1325
2.2,3.5738e-07,0.00037311,7.7834,64.178,1,0.133
2.2,3.5647e-07,0.00037419,7.8028,64.178,1,0.1335
2.2,3.5557e-07,0.00037527,7.8221,64.178,1,0.134
2.2,3.5467e-07,0.00037636,7.8414,64.178,1,0.1345
2.2,3.5377e-07,0.00037744,7.8608,64.178,1,0.135
2.2,3.5287e-07,0.00037818,7.8787,64.178,1,0.1355
2.2,3.5196e-07,0.00037871,7.8958,64.178,1,0.136
2.2,3.5105e-07,0.00037923,7.9129,64.178,1,0.1365
2.2,3.5015e-07,0.00037976,7.9299,64.178,1,0.137
2.2,3.4924e-07,0.00038029,7.947,64.178,1,0.1375
2.2,3.4834e-07,0.00038082,7.9641,64.178,1,0.138
2.2,3.4743e-07,0.00038135,7.9812,64.178,1,0.1385
2.2,3.4652e-07,0.00038187,7.9983,64.178,1,0.139
2.2,3.4562e-07,0.0003824,8.0153,64.178,1,0.1395
2.2,3.4471e-07,0.00038293,8.0324,64.178,1,0.14
2.2,3.4381e-07,0.00038346,8.0495,64.178,1,0.1405
2.2,3.429e-07,0.00038398,8.0666,64.178,1,0.141
2.2,3.42e-07,0.00038451,8.0836,64.178,1,0.1415
2.2,3.4109e-07,0.00038504,8.1007,64.178,1,0.142
2.2,3.4018e-07,0.00038557,8.1178,64.178,1,0.1425
2.2,3.3928e-07,0.0003861,8.1349,64.178,1,0.143
2.2,3.3837e-07,0.00038662,8.1519,64.178,1,0.1435
2.2,3.3747e-07,0.00038715,8.169,64.178,1,0.144
2.2,3.3656e-07,0.00038768,8.1861,64.178,1,0.1445
2.2,3.3566e-07,0.00038821,8.2032,64.178,1,0.145
2.2,3.3475e-07,0.00038874,8.2202,64.178,1,0.1455
2.2,3.3384e-07,0.00038926,8.2373,64.178,1,0.146
2.2,3.3294e-07,0.00038979,8.2544,64.178,1,0.1465
2.2,3.3203e-07,0.00039032,8.2715,64.178,1,0.147
2.2,3.3113e-07,0.00039085,8.2885,64.178,1,0.1475
2.2,3.3022e-07,0.00039137,8.3056,64.178,1,0.148
2.2,3.2931e-07,0.0003919,8.3227,64.178,1,0.1485
2.2,3.2841e-07,0.00039243,8.3398,64.178,1,0.149
2.2,3.2751e-07,0.00039278,8.3562,64.178,1,0.1495
2.2,3.2665e-07,0.00039266,8.371,64.178,1,0.15
2.2,3.2579e-07,0.00039254,8.3858,64.178,1,0.1505
2.2,3.2493e-07,0.00039243,8.4006,64.178,1,0.151
2.2,3.2406e-07,0.00039231,8.4154,64.178,1,0.1515
2.2,3.232e-07,0.00039219,8.4302,64.178,1,0.152
2.2,3.2234e-07,0.00039207,8.445,64.178,1,0.1525
2.2,3.2147e-07,0.00039195,8.4598,64.178,1,0.153
2.2,3.2061e-07,0.00039183,8.4746,64.178,1,0.1535
2.2,3.1975e-07,0.00039171,8.4894,64.178,1,0.154
2.2,3.1888e-07,0.0003916,8.5042,64.178,1,0.1545
2.2,3.1802e-07,0.00039148,8.519,64.178,1,0.155
2.2,3.1716e-07,0.00039136,8.5338,64.178,1,0.1555
2.2,3.1629e-07,0.00039124,8.5486,64.178,1,0.156
2.2,3.1543e-07,0.00039112,8.5634,64.178,1,0.1565
2.2,3.1457e-07,0.000391,8.5782,64.178,1,0.157
2.2,3.1371e-07,0.00039088,8.593,64.178,1,0.1575
2.2,3.1284e-07,0.00039077,8.6078,64.178,1,0.158
2.2,3.1198e-07,0.00039065,8.6226,64.178,1,0.1585
2.2,3.1112e-07,0.00039053,8.6374,64.178,1,0.159
2.2,3.1025e-07,0.00039041,8.6522,64.178,1,0.1595
2.2,3.0939e-07,0.00039029,8.667,64.178,1,0.16
2.2,3.0853e-07,0.00039017,8.6818,64.178,1,0.1605
2.2,3.0766e-07,0.00039005,8.6966,64.178,1,0.161
2.2,3.068e-07,0.00038994,8.7114,64.178,1,0.1615
2.2,3.0594e-07,0.00038982,8.7262,64.178,1,0.162
2.2,3.0507e-07,0.0003897,8.741,64.178,1,0.1625
2.2,3.0421e-07,0.00038958,8.7558,64.178,1,0.163
2.2,3.0335e-07,0.00038946,8.7706,64.178,1,0.1635
2.2,3.0257e-07,0.0003888,8.7836,64.178,1,0.164
2.2,3.0181e-07,0.00038798,8.7962,64.178,1,0.1645
2.2,3.0105e-07,0.00038717,8.8087,64.178,1,0.165
2.2,3.0029e-07,0.00038635,8.8212,64.178,1,0.1655
2.2,2.9953e-07,0.00038554,8.8337,64.178,1,0.166
2.2,2.9876e-07,0.00038472,8.8463,64.178,1,0.1665
2.2,2.98e-07,0.00038391,8.8588,64.178,1,0.167
2.2,2.9724e-07,0.00038309,8.8713,64.178,1,0.1675
2.2,2.9648e-07,0.00038228,8.8838,64.178,1,0.168
2.2,2.9572e-07,0.00038146,8.8963,64.178,1,0.1685
2.2,2.9496e-07,0.00038065,8.9089,64.178,1,0.169
2.2,2.942e-07,0.00037983,8.9214,64.178,1,0.1695
2.2,2.9344e-07,0.00037902,8.9339,64.178,1,0.17
2.2,2.9268e-07,0.00037821,8.9464,64.178,1,0.1705
2.2,2.9192e-07,0.00037739,8.9589,64.178,1,0.171
2.2,2.9116e-07,0.00037658,8.9715,64.178,1,0.1715
2.2,2.904e-07,0.00037576,8.984,64.178,1,0.172
2.2,2.8964e-07,0.00037495,8.9965,64.178,1,0.1725
2.2,2.8888e-07,0.00037413,9.009,64.178,1,0.173
2.2,2.8812e-07,0.00037332,9.0215,64.178,1,0.1735
2.2,2.8736e-07,0.0003725,9.0341,64.178,1,0.174
2.2,2.866e-07,0.00037169,9.0466,64.178,1,0.1745
2.2,2.8584e-07,0.00037087,9.0591,64.178,1,0.175
2.2,2.8508e-07,0.00037006,9.0716,64.178,1,0.1755
2.2,2.8432e-07,0.00036924,9.0842,64.178,1,0.176
2.2,2.8356e-07,0.00036843,9.0967,64.178,1,0.1765
2.2,2.828e-07,0.00036761,9.1092,64.178,1,0.177
2.2,2.8204e-07,0.0003668,9.1217,64.178,1,0.1775
2.2,2.8131e-07,0.00036586,9.1338,64.178,1,0.178
2.2,2.8073e-07,0.00036435,9.1441,64.178,1,0.1785
2.2,2.8016e-07,0.00036284,9.1543,64.178,1,0.179
2.2,2.7958e-07,0.00036133,9.1646,64.178,1,0.1795
2.2,2.79e-07,0.00035982,9.1748,64.178,1,0.18
2.2,2.7843e-07,0.00035831,9.185,64.178,1,0.1805
2.2,2.7785e-07,0.0003568,9.1953,64.178,1,0.181
2.2,2.7727e-07,0.00035529,9.2055,64.178,1,0.1815
2.2,2.7669e-07,0.00035378,9.2158,64.178,1,0.182
2.2,2.7612e-07,0.00035227,9.226,64.178,1,0.1825
2.2,2.7554e-07,0.00035076,9.2362,64.178,1,0.183
2.2,2.7496e-07,0.00034925,9.2465,64.178,1,0.1835
2.2,2.7438e-07,0.00034774,9.2567,64.178,1,0.184
2.2,2.7381e-07,0.00034623,9.267,64.178,1,0.1845
2.2,2.7323e-07,0.00034472,9.2772,64.178,1,0.185
2.2,2.7265e-07,0.00034321,9.2875,64.178,1,0.1855
2.2,2.7208e-07,0.0003417,9.2977,64.178,1,0.186
2.2,2.715e-07,0.00034019,9.3079,64.178,1,0.1865
2.2,2.7092e-07,0.00033868,9.3182,64.178,1,0.187
2.2,2.7034e-07,0.00033717,9.3284,64.178,1,0.1875
2.2,2.6977e-07,0.00033566,9.3387,64.178,1,0.188
2.2,2.6919e-07,0.00033415,9.3489,64.178,1,0.1885
2.2,2.6861e-07,0.00033264,9.3591,64.178,1,0.189
2.2,2.6803e-07,0.00033113,9.3694,64.178,1,0.1895
2.2,2.6746e-07,0.00032962,9.3796,64.178,1,0.19
2.2,2.6688e-07,0.00032811,9.3899,64.178,1,0.1905
2.2,2.663e-07,0.0003266,9.4001,64.178,1,0.191
2.2,2.6572e-07,0.00032509,9.4103,64.178,1,0.1915
2.2,2.6515e-07,0.00032358,9.4206,64.178,1,0.192
2.2,2.6467e-07,0.00032177,9.4298,64.178,1,0.1925
2.2,2.643e-07,0.00031962,9.4377,64.178,1,0.193
2.2,2.6394e-07,0.00031747,9.4457,64.178,1,0.1935
2.2,2.6357e-07,0.00031532,9.4537,64.178,1,0.194
2.2,2.6321e-07,0.00031316,9.4616,64.178,1,0.1945
2.2,2.6285e-07,0.00031101,9.4696,64.178,1,0.195
2.2,2.6248e-07,0.00030886,9.4775,64.178,1,0.1955
2.2,2.6212e-07,0.00030671,9.4855,64.178,1,0.196
2.2,2.6175e-07,0.00030456,9.4935,64.178,1,0.1965
2.2,2.6139e-07,0.00030241,9.5014,64.178,1,0.197
2.2,2.6102e-07,0.00030026,9.5094,64.178,1,0.1975
2.2,2.6066e-07,0.0002981,9.5174,64.178,1,0.198
2.2,2.6029e-07,0.00029595,9.5253,64.178,1,0.1985
2.2,2.5993e-07,0.0002938,9.5333,64.178,1,0.199
2.2,2.5956e-07,0.00029165,9.5412,64.178,1,0.1995
2.2,2.592e-07,0.0002895,9.5492,64.178,1,0.2
2.2,2.5883e-07,0.00028735,9.5572,64.178,1,0.2005
2.2,2.5847e-07,0.0002852,9.5651,64.178,1,0.201
2.2,2.5811e-07,0.00028304,9.5731,64.178,1,0.2015
2.2,2.5774e-07,0.00028089,9.581,64.178,1,0.202
2.2,2.5738e-07,0.00027874,9.589,64.178,1,0.2025
2.2,2.5701e-07,0.00027659,9.597,64.178,1,0.203
2.2,2.5665e-07,0.00027444,9.6049,64.178,1,0.2035
2.2,2.5628e-07,0.00027229,9.6129,64.178,1,0.204
2.2,2.5592e-07,0.00027014,9.6209,64.178,1,0.2045
2.2,2.5555e-07,0.00026798,9.6288,64.178,1,0.205
2.2,2.5519e-07,0.00026583,9.6368,64.178,1,0.2055
2.2,2.5482e-07,0.00026368,9.6447,64.178,1,0.206
2.2,2.5446e-07,0.00026153,9.6527,64.178,1,0.2065
2.2,2.5422e-07,0.00025902,9.6591,64.178,1,0.207
2.2,2.5405e-07,0.00025633,9.6648,64.178,1,0.2075
2.2,2.5387e-07,0.00025365,9.6705,64.178,1,0.208
2.2,2.537e-07,0.00025096,9.6762,64.178,1,0.2085
2.2,2.5352e-07,0.00024828,9.6819,64.178,1,0.209
2.2,2.5335e-07,0.00024559,9.6876,64.178,1,0.2095
2.2,2.5318e-07,0.0002429,9.6932,64.178,1,0.21
2.2,2.53e-07,0.00024022,9.6989,64.178,1,0.2105
2.2,2.5283e-07,0.00023753,9.7046,64.178,1,0.211
2.2,2.5265e-07,0.00023485,9.7103,64.178,1,0.2115
2.2,2.5248e-07,0.00023216,9.716,64.178,1,0.212
2.2,2.5231e-07,0.00022947,9.7217,64.178,1,0.2125
2.2,2.5213e-07,0.00022679,9.7274,64.178,1,0.213
2.2,2.5196e-07,0.0002241,9.733,64.178,1,0.2135
2.2,2.5178e-07,0.00022142,9.7387,64.178,1,0.214
2.2,2.5161e-07,0.00021873,9.7444,64.178,1,0.2145
2.2,2.5143e-07,0.00021604,9.7501,64.178,1,0.215
2.2,2.5126e-07,0.00021336,9.7558,64.178,1,0.2155
2.2,2.5109e-07,0.00021067,9.7615,64.178,1,0.216
2.2,2.5091e-07,0.00020798,9.7671,64.178,1,0.2165
2.2,2.5074e-07,0.0002053,9.7728,64.178,1,0.217
2.2,2.5056e-07,0.00020261,9.7785,64.178,1,0.2175
2.2,2.5039e-07,0.00019993,9.7842,64.178,1,0.218
2.2,2.5022e-07,0.00019724,9.7899,64.178,1,0.2185
2.2,2.5004e-07,0.00019455,9.7956,64.178,1,0.219
2.2,2.4987e-07,0.00019187,9.8013,64.178,1,0.2195
2.2,2.4969e-07,0.00018918,9.8069,64.178,1,0.22
2.2,2.4952e-07,0.0001865,9.8126,64.178,1,0.2205
2.2,2.4934e-07,0.00018381,9.8183,64.178,1,0.221
2.2,2.4931e-07,0.00018081,9.8221,64.178,1,0.2215
2.2,2.4932e-07,0.00017774,9.8256,64.178,1,0.222
2.2,2.4932e-07,0.00017467,9.829,64.178,1,0.2225
2.2,2.4932e-07,0.0001716,9.8324,64.178,1,0.223
2.2,2.4933e-07,0.00016853,9.8358,64.178,1,0.2235
2.2,2.4933e-07,0.00016547,9.8392,64.178,1,0.224
2.2,2.4933e-07,0.0001624,9.8426,64.178,1,0.2245
2.2,2.4933e-07,0.00015933,9.846,64.178,1,0.225
2.2,2.4934e-07,0.00015626,9.8494,64.178,1,0.2255
2.2,2.4934e-07,0.00015319,9.8528,64.178,1,0.226
2.2,2.4934e-07,0.00015012,9.8562,64.178,1,0.2265
2.2,2.4934e-07,0.00014705,9.8597,64.178,1,0.227
2.2,2.4935e-07,0.00014398,9.8631,64.178,1,0.2275
2.2,2.4935e-07,0.00014091,9.8665,64.178,1,0.228
2.2,2.4935e-07,0.00013784,9.8699,64.178,1,0.2285
2.2,2.4935e-07,0.00013477,9.8733,64.178,1,0.229
2.2,2.4936e-07,0.0001317,9.8767,64.178,1,0.2295
2.2,2.4936e-07,0.00012863,9.8801,64.178,1,0.23
2.2,2.4936e-07,0.00012556,9.8835,64.178,1,0.2305
2.2,2.4936e-07,0.00012249,9.8869,64.178,1,0.231
2.2,2.4937e-07,0.00011942,9.8903,64.178,1,0.2315
2.2,2.4937e-07,0.00011635,9.8938,64.178,1,0.232
2.2,2.4937e-07,0.00011329,9.8972,64.178,1,0.2325
2.2,2.4937e-07,0.00011022,9.9006,64.178,1,0.233
2.2,2.4938e-07,0.00010715,9.904,64.178,1,0.2335
2.2,2.4938e-07,0.00010408,9.9074,64.178,1,0.234
2.2,2.4938e-07,0.00010101,9.9108,64.178,1,0.2345
2.2,2.4938e-07,9.7938e-05,9.9142,64.178,1,0.235
2.2,2.4939e-07,9.4869e-05,9.9176,64.178,1,0.2355
2.2,2.4953e-07,9.1616e-05,9.9189,64.178,1,0.236
2.2,2.4969e-07,8.8347e-05,9.9201,64.178,1,0.2365
2.2,2.4985e-07,8.5078e-05,9.9212,64.178,1,0.237
2.2,2.5001e-07,8.1809e-05,9.9224,64.178,1,0.2375
2.2,2.5016e-07,7.8539e-05,9.9235,64.178,1,0.238
2.2,2.5032e-07,7.527e-05,9.9246,64.178,1,0.2385
2.2,2.5048e-07,7.2001e-05,9.9258,64.178,1,0.239
2.2,2.5064e-07,6.8732e-05,9.9269,64.178,1,0.2395
2.2,2.5079e-07,6.5462e-05,9.928,64.178,1,0.24
2.2,2.5095e-07,6.2193e-05,9.9292,64.178,1,0.2405
2.2,2.5111e-07,5.8924e-05,9.9303,64.178,1,0.241
2.2,2.5127e-07,5.5655e-05,9.9314,64.178,1,0.2415
2.2,2.5143e-07,5.2386e-05,9.9326,64.178,1,0.242
2.2,2.5158e-07,4.9116e-05,9.9337,64.178,1,0.2425
2.2,2.5174e-07,4.5847e-05,9.9349,64.178,1,0.243
2.2,2.519e-07,4.2578e-05,9.936,64.178,1,0.2435
2.2,2.5206e-07,3.9309e-05,9.9371,64.178,1,0.244
2.2,2.5221e-07,3.6039e-05,9.9383,64.178,1,0.2445
2.2,2.5237e-07,3.277e-05,9.9394,64.178,1,0.245
2.2,2.5253e-07,2.9501e-05,9.9405,64.178,1,0.2455
2.2,2.5269e-07,2.6232e-05,9.9417,64.178,1,0.246
2.2,2.5285e-07,2.2963e-05,9.9428,64.178,1,0.2465
2.2,2.53e-07,1.9693e-05,9.9439,64.178,1,0.247
2.2,2.5316e-07,1.6424e-05,9.9451,64.178,1,0.2475
2.2,2.5332e-07,1.3155e-05,9.9462,64.178,1,0.248
2.2,2.5348e-07,9.8856e-06,9.9474,64.178,1,0.2485
2.2,2.5363e-07,6.6164e-06,9.9485,64.178,1,0.249
2.2,2.5379e-07,3.3471e-06,9.9496,64.178,1,0.2495
2.2,2.5395e-07,7.7912e-08,9.9508,64.178,1,0.25
2.2,2.5428e-07,-3.1913e-06,9.9496,64.178,1,0.2505
2.2,2.5462e-07,-6.4606e-06,9.9485,64.178,1,0.251
2.2,2.5495e-07,-9.7298e-06,9.9474,64.178,1,0.2515
2.2,2.5529e-07,-1.2999e-05,9.9462,64.178,1,0.252
2.2,2.5562e-07,-1.6268e-05,9.9451,64.178,1,0.2525
2.2,2.5596e-07,-1.9537e-05,9.9439,64.178,1,0.253
2.2,2.5629e-07,-2.2807e-05,9.9428,64.178,1,0.2535
2.2,2.5662e-07,-2.6076e-05,9.9417,64.178,1,0.254
2.2,2.5696e-07,-2.9345e-05,9.9405,64.178,1,0.2545
2.2,2.5729e-07,-3.2614e-05,9.9394,64.178,1,0.255
2.2,2.5763e-07,-3.5884e-05,9.9383,64.178,1,0.2555
2.2,2.5796e-07,-3.9153e-05,9.9371,64.178,1,0.256
2.2,2.5829e-07,-4.2422e-05,9.936,64.178,1,0.2565
2.2,2.5863e-07,-4.5691e-05,9.9349,64.178,1,0.257
2.2,2.5896e-07,-4.8961e-05,9.9337,64.178,1,0.2575
2.2,2.593e-07,-5.223e-05,9.9326,64.178,1,0.258
2.2,2.5963e-07,-5.5499e-05,9.9314,64.178,1,0.2585
2.2,2.5996e-07,-5.8768e-05,9.9303,64.178,1,0.259
2.2,2.603e-07,-6.2038e-05,9.9292,64.178,1,0.2595
2.2,2.6063e-07,-6.5307e-05,9.928,64.178,1,0.26
2.2,2.6097e-07,-6.8576e-05,9.9269,64.178,1,0.2605
2.2,2.613e-07,-7.1845e-05,9.9258,64.178,1,0.261
2.2,2.6164e-07,-7.5114e-05,9.9246,64.178,1,0.2615
2.2,2.6197e-07,-7.8384e-05,9.9235,64.178,1,0.262
2.2,2.623e-07,-8.1653e-05,9.9224,64.178,1,0.2625
2.2,2.6264e-07,-8.4922e-05,9.9212,64.178,1,0.263
2.2,2.6297e-07,-8.8191e-05,9.9201,64.178,1,0.2635
2.2,2.6331e-07,-9.1461e-05,9.9189,64.178,1,0.264
2.2,2.6366e-07,-9.4713e-05,9.9176,64.178,1,0.2645
2.2,2.6417e-07,-9.7783e-05,9.9142,64.178,1,0.265
2.2,2.6469e-07,-0.00010085,9.9108,64.178,1,0.2655
2.2,2.6521e-07,-0.00010392,9.9074,64.178,1,0.266
2.2,2.6573e-07,-0.00010699,9.904,64.178,1,0.2665
2.2,2.6625e-07,-0.00011006,9.9006,64.178,1,0.267
2.2,2.6677e-07,-0.00011313,9.8972,64.178,1,0.2675
2.2,2.6728e-07,-0.0001162,9.8938,64.178,1,0.268
2.2,2.678e-07,-0.00011927,9.8903,64.178,1,0.2685
2.2,2.6832e-07,-0.00012234,9.8869,64.178,1,0.269
2.2,2.6884e-07,-0.00012541,9.8835,64.178,1,0.2695
2.2,2.6936e-07,-0.00012848,9.8801,64.178,1,0.27
2.2,2.6987e-07,-0.00013155,9.8767,64.178,1,0.2705
2.2,2.7039e-07,-0.00013461,9.8733,64.178,1,0.271
2.2,2.7091e-07,-0.00013768,9.8699,64.178,1,0.2715
2.2,2.7143e-07,-0.00014075,9.8665,64.178,1,0.272
2.2,2.7195e-07,-0.00014382,9.8631,64.178,1,0.2725
2.2,2.7247e-07,-0.00014689,9.8597,64.178,1,0.273
2.2,2.7298e-07,-0.00014996,9.8562,64.178,1,0.2735
2.2,2.735e-07,-0.00015303,9.8528,64.178,1,0.274
2.2,2.7402e-07,-0.0001561,9.8494,64.178,1,0.2745
2.2,2.7454e-07,-0.00015917,9.846,64.178,1,0.275
2.2,2.7506e-07,-0.00016224,9.8426,64.178,1,0.2755
2.2,2.7558e-07,-0.00016531,9.8392,64.178,1,0.276
2.2,2.7609e-07,-0.00016838,9.8358,64.178,1,0.2765
2.2,2.7661e-07,-0.00017145,9.8324,64.178,1,0.277
2.2,2.7713e-07,-0.00017452,9.829,64.178,1,0.2775
2.2,2.7765e-07,-0.00017759,9.8256,64.178,1,0.278
2.2,2.7817e-07,-0.00018066,9.8221,64.178,1,0.2785
2.2,2.7871e-07,-0.00018365,9.8183,64.178,1,0.279
2.2,2.7939e-07,-0.00018634,9.8126,64.178,1,0.2795
2.2,2.8007e-07,-0.00018903,9.8069,64.178,1,0.28
2.2,2.8075e-07,-0.00019171,9.8013,64.178,1,0.2805
2.2,2.8143e-07,-0.0001944,9.7956,64.178,1,0.281
2.2,2.8211e-07,-0.00019708,9.7899,64.178,1,0.2815
2.2,2.8279e-07,-0.00019977,9.7842,64.178,1,0.282
2.2,2.8347e-07,-0.00020246,9.7785,64.178,1,0.2825
2.2,2.8415e-07,-0.00020514,9.7728,64.178,1,0.283
2.2,2.8483e-07,-0.00020783,9.7671,64.178,1,0.2835
2.2,2.8551e-07,-0.00021051,9.7615,64.178,1,0.284
2.2,2.8619e-07,-0.0002132,9.7558,64.178,1,0.2845
2.2,2.8687e-07,-0.00021589,9.7501,64.178,1,0.285
2.2,2.8754e-07,-0.00021857,9.7444,64.178,1,0.2855
2.2,2.8822e-07,-0.00022126,9.7387,64.178,1,0.286
2.2,2.889e-07,-0.00022394,9.733,64.178,1,0.2865
2.2,2.8958e-07,-0.00022663,9.7274,64.178,1,0.287
2.2,2.9026e-07,-0.00022932,9.7217,64.178,1,0.2875
2.2,2.9094e-07,-0.000232,9.716,64.178,1,0.288
2.2,2.9162e-07,-0.00023469,9.7103,64.178,1,0.2885
2.2,2.923e-07,-0.00023737,9.7046,64.178,1,0.289
2.2,2.9298e-07,-0.00024006,9.6989,64.178,1,0.2895
2.2,2.9366e-07,-0.00024275,9.6932,64.178,1,0.29
2.2,2.9434e-07,-0.00024543,9.6876,64.178,1,0.2905
2.2,2.9502e-07,-0.00024812,9.6819,64.178,1,0.291
2.2,2.957e-07,-0.0002508,9.6762,64.178,1,0.2915
2.2,2.9637e-07,-0.00025349,9.6705,64.178,1,0.292
2.2,2.9705e-07,-0.00025618,9.6648,64.178,1,0.2925
2.2,2.9773e-07,-0.00025886,9.6591,64.178,1,0.293
2.2,2.9847e-07,-0.00026137,9.6527,64.178,1,0.2935
2.2,2.9931e-07,-0.00026352,9.6447,64.178,1,0.294
2.2,3.0016e-07,-0.00026567,9.6368,64.178,1,0.2945
2.2,3.01e-07,-0.00026782,9.6288,64.178,1,0.295
2.2,3.0185e-07,-0.00026998,9.6208,64.178,1,0.2955
2.2,3.0269e-07,-0.00027213,9.6129,64.178,1,0.296
2.2,3.0354e-07,-0.00027428,9.6049,64.178,1,0.2965
2.2,3.0438e-07,-0.00027643,9.597,64.178,1,0.297
2.2,3.0523e-07,-0.00027858,9.589,64.178,1,0.2975
2.2,3.0607e-07,-0.00028073,9.581,64.178,1,0.298
2.2,3.0692e-07,-0.00028288,9.5731,64.178,1,0.2985
2.2,3.0776e-07,-0.00028503,9.5651,64.178,1,0.299
2.2,3.0861e-07,-0.00028719,9.5572,64.178,1,0.2995
2.2,3.0946e-07,-0.00028934,9.5492,64.178,1,0.3
2.2,3.103e-07,-0.00029149,9.5412,64.178,1,0.3005
2.2,3.1115e-07,-0.00029364,9.5333,64.178,1,0.301
2.2,3.1199e-07,-0.00029579,9.5253,64.178,1,0.3015
2.2,3.1284e-07,-0.00029794,9.5173,64.178,1,0.302
2.2,3.1368e-07,-0.00030009,9.5094,64.178,1,0.3025
2.2,3.1453e-07,-0.00030225,9.5014,64.178,1,0.303
2.2,3.1537e-07,-0.0003044,9.4935,64.178,1,0.3035
2.2,3.1622e-07,-0.00030655,9.4855,64.178,1,0.304
2.2,3.1706e-07,-0.0003087,9.4775,64.178,1,0.3045
2.2,3.1791e-07,-0.00031085,9.4696,64.178,1,0.305
2.2,3.1875e-07,-0.000313,9.4616,64.178,1,0.3055
2.2,3.196e-07,-0.00031515,9.4536,64.178,1,0.306
2.2,3.2044e-07,-0.00031731,9.4457,64.178,1,0.3065
2.2,3.2129e-07,-0.00031946,9.4377,64.178,1,0.307
2.2,3.2213e-07,-0.00032161,9.4298,64.178,1,0.3075
2.2,3.2305e-07,-0.00032341,9.4206,64.178,1,0.308
2.2,3.2403e-07,-0.00032493,9.4103,64.178,1,0.3085
2.2,3.2501e-07,-0.00032644,9.4001,64.178,1,0.309
2.2,3.2599e-07,-0.00032795,9.3899,64.178,1,0.3095
2.2,3.2697e-07,-0.00032946,9.3796,64.178,1,0.31
2.2,3.2795e-07,-0.00033097,9.3694,64.178,1,0.3105
2.2,3.2893e-07,-0.00033248,9.3591,64.178,1,0.311
2.2,3.299e-07,-0.00033399,9.3489,64.178,1,0.3115
2.2,3.3088e-07,-0.0003355,9.3386,64.178,1,0.312
2.2,3.3186e-07,-0.00033701,9.3284,64.178,1,0.3125
2.2,3.3284e-07,-0.00033852,9.3182,64.178,1,0.313
2.2,3.3382e-07,-0.00034003,9.3079,64.178,1,0.3135
2.2,3.348e-07,-0.00034154,9.2977,64.178,1,0.314
2.2,3.3578e-07,-0.00034305,9.2874,64.178,1,0.3145
2.2,3.3676e-07,-0.00034456,9.2772,64.178,1,0.315
2.2,3.3774e-07,-0.00034607,9.267,64.178,1,0.3155
2.2,3.3872e-07,-0.00034758,9.2567,64.178,1,0.316
2.2,3.397e-07,-0.00034909,9.2465,64.178,1,0.3165
2.2,3.4068e-07,-0.0003506,9.2362,64.178,1,0.317
2.2,3.4165e-07,-0.00035211,9.226,64.178,1,0.3175
2.2,3.4263e-07,-0.00035362,9.2158,64.178,1,0.318
2.2,3.4361e-07,-0.00035513,9.2055,64.178,1,0.3185
2.2,3.4459e-07,-0.00035664,9.1953,64.178,1,0.319
2.2,3.4557e-07,-0.00035815,9.185,64.178,1,0.3195
2.2,3.4655e-07,-0.00035966,9.1748,64.178,1,0.32
2.2,3.4753e-07,-0.00036117,9.1646,64.178,1,0.3205
2.2,3.4851e-07,-0.00036268,9.1543,64.178,1,0.321
2.2,3.4949e-07,-0.00036419,9.1441,64.178,1,0.3215
2.2,3.5047e-07,-0.0003657,9.1338,64.178,1,0.322
2.2,3.5153e-07,-0.00036664,9.1217,64.178,1,0.3225
2.2,3.5261e-07,-0.00036745,9.1092,64.178,1,0.323
2.2,3.5368e-07,-0.00036827,9.0967,64.178,1,0.3235
2.2,3.5476e-07,-0.00036908,9.0841,64.178,1,0.324
2.2,3.5584e-07,-0.0003699,9.0716,64.178,1,0.3245
2.2,3.5692e-07,-0.00037071,9.0591,64.178,1,0.325
2.2,3.58e-07,-0.00037152,9.0466,64.178,1,0.3255
2.2,3.5907e-07,-0.00037234,9.0341,64.178,1,0.326
2.2,3.6015e-07,-0.00037315,9.0215,64.178,1,0.3265
2.2,3.6123e-07,-0.00037397,9.009,64.178,1,0.327
2.2,3.6231e-07,-0.00037478,8.9965,64.178,1,0.3275
2.2,3.6339e-07,-0.0003756,8.984,64.178,1,0.328
2.2,3.6447e-07,-0.00037641,8.9715,64.178,1,0.3285
2.2,3.6554e-07,-0.00037723,8.9589,64.178,1,0.329
2.2,3.6662e-07,-0.00037804,8.9464,64.178,1,0.3295
2.2,3.677e-07,-0.00037886,8.9339,64.178,1,0.33
2.2,3.6878e-07,-0.00037967,8.9214,64.178,1,0.3305
2.2,3.6986e-07,-0.00038049,8.9088,64.178,1,0.331
2.2,3.7094e-07,-0.0003813,8.8963,64.178,1,0.3315
2.2,3.7201e-07,-0.00038212,8.8838,64.178,1,0.332
2.2,3.7309e-07,-0.00038293,8.8713,64.178,1,0.3325
2.2,3.7417e-07,-0.00038374,8.8588,64.178,1,0.333
2.2,3.7525e-07,-0.00038456,8.8462,64.178,1,0.3335
2.2,3.7633e-07,-0.00038537,8.8337,64.178,1,0.334
2.2,3.7741e-07,-0.00038619,8.8212,64.178,1,0.3345
2.2,3.7848e-07,-0.000387,8.8087,64.178,1,0.335
2.2,3.7956e-07,-0.00038782,8.7962,64.178,1,0.3355
2.2,3.8064e-07,-0.00038863,8.7836,64.178,1,0.336
2.2,3.8173e-07,-0.0003893,8.7706,64.178,1,0.3365
2.2,3.8288e-07,-0.00038942,8.7558,64.178,1,0.337
2.2,3.8402e-07,-0.00038954,8.741,64.178,1,0.3375
2.2,3.8517e-07,-0.00038965,8.7262,64.178,1,0.338
2.2,3.8631e-07,-0.00038977,8.7114,64.178,1,0.3385
2.2,3.8746e-07,-0.00038989,8.6966,64.178,1,0.339
2.2,3.886e-07,-0.00039001,8.6818,64.178,1,0.3395
2.2,3.8975e-07,-0.00039013,8.667,64.178,1,0.34
2.2,3.9089e-07,-0.00039025,8.6522,64.178,1,0.3405
2.2,3.9204e-07,-0.00039037,8.6374,64.178,1,0.341
2.2,3.9319e-07,-0.00039048,8.6226,64.178,1,0.3415
2.2,3.9433e-07,-0.0003906,8.6078,64.178,1,0.342
2.2,3.9548e-07,-0.00039072,8.593,64.178,1,0.3425
2.2,3.9662e-07,-0.00039084,8.5782,64.178,1,0.343
2.2,3.9777e-07,-0.00039096,8.5634,64.178,1,0.3435
2.2,3.9891e-07,-0.00039108,8.5486,64.178,1,0.344
2.2,4.0006e-07,-0.0003912,8.5338,64.178,1,0.3445
2.2,4.012e-07,-0.00039131,8.519,64.178,1,0.345
2.2,4.0235e-07,-0.00039143,8.5042,64.178,1,0.3455
2.2,4.0349e-07,-0.00039155,8.4894,64.178,1,0.346
2.2,4.0464e-07,-0.00039167,8.4746,64.178,1,0.3465
2.2,4.0578e-07,-0.00039179,8.4598,64.178,1,0.347
2.2,4.0693e-07,-0.00039191,8.445,64.178,1,0.3475
2.2,4.0807e-07,-0.00039203,8.4302,64.178,1,0.348
2.2,4.0922e-07,-0.00039215,8.4154,64.178,1,0.3485
2.2,4.1036e-07,-0.00039226,8.4006,64.178,1,0.349
2.2,4.1151e-07,-0.00039238,8.3858,64.178,1,0.3495
2.2,4.1265e-07,-0.0003925,8.371,64.178,1,0.35
2.2,4.138e-07,-0.00039262,8.3562,64.178,1,0.3505
2.2,4.1496e-07,-0.00039227,8.3398,64.178,1,0.351
2.2,4.1612e-07,-0.00039174,8.3227,64.178,1,0.3515
2.2,4.1728e-07,-0.00039121,8.3056,64.178,1,0.352
2.2,4.1844e-07,-0.00039069,8.2885,64.178,1,0.3525
2.2,4.1961e-07,-0.00039016,8.2714,64.178,1,0.353
2.2,4.2077e-07,-0.00038963,8.2544,64.178,1,0.3535
2.2,4.2193e-07,-0.0003891,8.2373,64.178,1,0.354
2.2,4.2309e-07,-0.00038857,8.2202,64.178,1,0.3545
2.2,4.2425e-07,-0.00038805,8.2031,64.178,1,0.355
2.2,4.2542e-07,-0.00038752,8.1861,64.178,1,0.3555
2.2,4.2658e-07,-0.00038699,8.169,64.178,1,0.356
2.2,4.2774e-07,-0.00038646,8.1519,64.178,1,0.3565
2.2,4.289e-07,-0.00038594,8.1348,64.178,1,0.357
2.2,4.3006e-07,-0.00038541,8.1178,64.178,1,0.3575
2.2,4.3123e-07,-0.00038488,8.1007,64.178,1,0.358
2.2,4.3239e-07,-0.00038435,8.0836,64.178,1,0.3585
2.2,4.3355e-07,-0.00038383,8.0665,64.178,1,0.359
2.2,4.3471e-07,-0.0003833,8.0495,64.178,1,0.3595
2.2,4.3587e-07,-0.00038277,8.0324,64.178,1,0.36
2.2,4.3704e-07,-0.00038224,8.0153,64.178,1,0.3605
2.2,4.382e-07,-0.00038172,7.9982,64.178,1,0.361
2.2,4.3936e-07,-0.00038119,7.9812,64.178,1,0.3615
2.2,4.4052e-07,-0.00038066,7.9641,64.178,1,0.362
2.2,4.4168e-07,-0.00038013,7.947,64.178,1,0.3625
2.2,4.4285e-07,-0.0003796,7.9299,64.178,1,0.363
2.2,4.4401e-07,-0.00037908,7.9129,64.178,1,0.3635
2.2,4.4517e-07,-0.00037855,7.8958,64.178,1,0.364
2.2,4.4633e-07,-0.00037802,7.8787,64.178,1,0.3645
2.2,4.4746e-07,-0.00037728,7.8608,64.178,1,0.365
2.2,4.4852e-07,-0.0003762,7.8414,64.178,1,0.3655
2.2,4.4958e-07,-0.00037512,7.8221,64.178,1,0.366
2.2,4.5065e-07,-0.00037404,7.8027,64.178,1,0.3665
2.2,4.5171e-07,-0.00037295,7.7834,64.178,1,0.367
2.2,4.5277e-07,-0.00037187,7.7641,64.178,1,0.3675
2.2,4.5384e-07,-0.00037079,7.7447,64.178,1,0.368
2.2,4.549e-07,-0.00036971,7.7254,64.178,1,0.3685
2.2,4.5597e-07,-0.00036863,7.706,64.178,1,0.369
2.2,4.5703e-07,-0.00036755,7.6867,64.178,1,0.3695
2.2,4.5809e-07,-0.00036646,7.6673,64.178,1,0.37
2.2,4.5916e-07,-0.00036538,7.648,64.178,1,0.3705
2.2,4.6022e-07,-0.0003643,7.6287,64.178,1,0.371
2.2,4.6128e-07,-0.00036322,7.6093,64.178,1,0.3715
2.2,4.6235e-07,-0.00036214,7.59,64.178,1,0.372
2.2,4.6341e-07,-0.00036106,7.5706,64.178,1,0.3725
2.2,4.6447e-07,-0.00035997,7.5513,64.178,1,0.373
2.2,4.6554e-07,-0.00035889,7.5319,64.178,1,0.3735
2.2,4.666e-07,-0.00035781,7.5126,64.178,1,0.374
2.2,4.6767e-07,-0.00035673,7.4933,64.178,1,0.3745
2.2,4.6873e-07,-0.00035565,7.4739,64.178,1,0.375
2.2,4.6979e-07,-0.00035456,7.4546,64.178,1,0.3755
2.2,4.7086e-07,-0.00035348,7.4352,64.178,1,0.376
2.2,4.7192e-07,-0.0003524,7.4159,64.178,1,0.3765
2.2,4.7298e-07,-0.00035132,7.3965,64.178,1,0.377
2.2,4.7405e-07,-0.00035024,7.3772,64.178,1,0.3775
2.2,4.7511e-07,-0.00034916,7.3579,64.178,1,0.378
2.2,4.7617e-07,-0.00034807,7.3385,64.178,1,0.3785
2.2,4.7718e-07,-0.00034692,7.319,64.178,1,0.379
2.2,4.7796e-07,-0.0003455,7.2986,64.178,1,0.3795
2.2,4.7873e-07,-0.00034408,7.2782,64.178,1,0.38
2.2,4.7951e-07,-0.00034266,7.2579,64.178,1,0.3805
2.2,4.8029e-07,-0.00034124,7.2375,64.178,1,0.381
2.2,4.8106e-07,-0.00033982,7.2171,64.178,1,0.3815
2.2,4.8184e-07,-0.0003384,7.1968,64.178,1,0.382
2.2,4.8262e-07,-0.00033698,7.1764,64.178,1,0.3825
2.2,4.8339e-07,-0.00033555,7.156,64.178,1,0.383
2.2,4.8417e-07,-0.00033413,7.1357,64.178,1,0.3835
2.2,4.8495e-07,-0.00033271,7.1153,64.178,1,0.384
2.2,4.8573e-07,-0.00033129,7.0949,64.178,1,0.3845
2.2,4.865e-07,-0.00032987,7.0745,64.178,1,0.385
2.2,4.8728e-07,-0.00032845,7.0542,64.178,1,0.3855
2.2,4.8806e-07,-0.00032703,7.0338,64.178,1,0.386
2.2,4.8883e-07,-0.00032561,7.0134,64.178,1,0.3865
2.2,4.8961e-07,-0.00032418,6.9931,64.178,1,0.387
2.2,4.9039e-07,-0.00032276,6.9727,64.178,1,0.3875
2.2,4.9116e-07,-0.00032134,6.9523,64.178,1,0.388
2.2,4.9194e-07,-0.00031992,6.932,64.178,1,0.3885
2.2,4.9272e-07,-0.0003185,6.9116,64.178,1,0.389
2.2,4.9349e-07,-0.00031708,6.8912,64.178,1,0.3895
2.2,4.9427e-07,-0.00031566,6.8709,64.178,1,0.39
2.2,4.9505e-07,-0.00031424,6.8505,64.178,1,0.3905
2.2,4.9582e-07,-0.00031281,6.8301,64.178,1,0.391
2.2,4.966e-07,-0.00031139,6.8098,64.178,1,0.3915
2.2,4.9738e-07,-0.00030997,6.7894,64.178,1,0.392
2.2,4.9815e-07,-0.00030855,6.769,64.178,1,0.3925
2.2,4.9886e-07,-0.00030703,6.7476,64.178,1,0.393
2.2,4.993e-07,-0.00030511,6.7222,64.178,1,0.3935
2.2,4.9974e-07,-0.00030319,6.6968,64.178,1,0.394
2.2,5.0018e-07,-0.00030127,6.6714,64.178,1,0.3945
2.2,5.0061e-07,-0.00029936,6.646,64.178,1,0.395
2.2,5.0105e-07,-0.00029744,6.6206,64.178,1,0.3955
2.2,5.0149e-07,-0.00029552,6.5951,64.178,1,0.396
2.2,5.0193e-07,-0.0002936,6.5697,64.178,1,0.3965
2.2,5.0237e-07,-0.00029168,6.5443,64.178,1,0.397
2.2,5.028e-07,-0.00028976,6.5189,64.178,1,0.3975
2.2,5.0324e-07,-0.00028784,6.4935,64.178,1,0.398
2.2,5.0368e-07,-0.00028592,6.4681,64.178,1,0.3985
2.2,5.0412e-07,-0.00028401,6.4426,64.178,1,0.399
2.2,5.0455e-07,-0.00028209,6.4172,64.178,1,0.3995
2.2,5.0499e-07,-0.00028017,6.3918,64.178,1,0.4
2.2,5.0543e-07,-0.00027825,6.3664,64.178,1,0.4005
2.2,5.0587e-07,-0.00027633,6.341,64.178,1,0.401
2.2,5.0631e-07,-0.00027441,6.3155,64.178,1,0.4015
2.2,5.0674e-07,-0.00027249,6.2901,64.178,1,0.402
2.2,5.0718e-07,-0.00027057,6.2647,64.178,1,0.4025
2.2,5.0762e-07,-0.00026866,6.2393,64.178,1,0.403
2.2,5.0806e-07,-0.00026674,6.2139,64.178,1,0.4035
2.2,5.0801e-07,-0.00026482,6.1885,64.178,1,0.404
2.2,5.0783e-07,-0.00026291,6.1632,64.178,1,0.4045
2.2,5.0765e-07,-0.000261,6.1379,64.178,1,0.405
2.2,5.0746e-07,-0.00025909,6.1126,64.178,1,0.4055
2.2,5.0728e-07,-0.00025718,6.0873,64.178,1,0.406
2.2,5.071e-07,-0.00025527,6.062,64.178,1,0.4065
2.2,5.0692e-07,-0.00025335,6.0367,64.178,1,0.407
2.2,5.0673e-07,-0.00025144,6.0114,64.178,1,0.4075
2.2,5.0655e-07,-0.00024953,5.9861,64.178,1,0.408
2.2,5.0637e-07,-0.00024762,5.9608,64.178,1,0.4085
2.2,5.0619e-07,-0.00024571,5.9355,64.178,1,0.409
2.2,5.06e-07,-0.0002438,5.9102,64.178,1,0.4095
2.2,5.0582e-07,-0.00024189,5.8849,64.178,1,0.41
2.2,5.0564e-07,-0.00023997,5.8596,64.178,1,0.4105
2.2,5.0546e-07,-0.00023806,5.8343,64.178,1,0.411
2.2,5.0527e-07,-0.00023615,5.809,64.178,1,0.4115
2.2,5.0509e-07,-0.00023424,5.7837,64.178,1,0.412
2.2,5.0491e-07,-0.00023233,5.7583,64.178,1,0.4125
2.2,5.0473e-07,-0.00023042,5.733,64.178,1,0.413
2.2,5.0454e-07,-0.00022851,5.7077,64.178,1,0.4135
2.2,5.0436e-07,-0.00022659,5.6824,64.178,1,0.414
2.2,5.0396e-07,-0.00022467,5.6565,64.178,1,0.4145
2.2,5.0316e-07,-0.00022271,5.6295,64.178,1,0.415
2.2,5.0236e-07,-0.00022076,5.6024,64.178,1,0.4155
2.2,5.0156e-07,-0.0002188,5.5754,64.178,1,0.416
2.2,5.0077e-07,-0.00021685,5.5484,64.178,1,0.4165
2.2,4.9997e-07,-0.00021489,5.5213,64.178,1,0.417
2.2,4.9917e-07,-0.00021294,5.4943,64.178,1,0.4175
2.2,4.9837e-07,-0.00021098,5.4673,64.178,1,0.418
2.2,4.9758e-07,-0.00020903,5.4402,64.178,1,0.4185
2.2,4.9678e-07,-0.00020707,5.4132,64.178,1,0.419
2.2,4.9598e-07,-0.00020512,5.3862,64.178,1,0.4195
2.2,4.9518e-07,-0.00020316,5.3592,64.178,1,0.42
2.2,4.9438e-07,-0.00020121,5.3321,64.178,1,0.4205
2.2,4.9359e-07,-0.00019925,5.3051,64.178,1,0.421
2.2,4.9279e-07,-0.0001973,5.2781,64.178,1,0.4215
2.2,4.9199e-07,-0.00019535,5.251,64.178,1,0.422
2.2,4.9119e-07,-0.00019339,5.224,64.178,1,0.4225
2.2,4.904e-07,-0.00019144,5.197,64.178,1,0.423
2.2,4.896e-07,-0.00018948,5.1699,64.178,1,0.4235
2.2,4.888e-07,-0.00018753,5.1429,64.178,1,0.424
2.2,4.88e-07,-0.00018557,5.1159,64.178,1,0.4245
2.2,4.8721e-07,-0.00018362,5.0888,64.178,1,0.425
2.2,4.8579e-07,-0.0001817,5.0602,64.178,1,0.4255
2.2,4.8433e-07,-0.00017978,5.0314,64.178,1,0.426
2.2,4.8287e-07,-0.00017787,5.0027,64.178,1,0.4265
2.2,4.8141e-07,-0.00017595,4.9739,64.178,1,0.427
2.2,4.7995e-07,-0.00017404,4.9451,64.178,1,0.4275
2.2,4.7849e-07,-0.00017212,4.9164,64.178,1,0.428
2.2,4.7704e-07,-0.00017021,4.8876,64.178,1,0.4285
2.2,4.7558e-07,-0.00016829,4.8589,64.178,1,0.429
2.2,4.7412e-07,-0.00016638,4.8301,64.178,1,0.4295
2.2,4.7266e-07,-0.00016446,4.8013,64.178,1,0.43
2.2,4.712e-07,-0.00016255,4.7726,64.178,1,0.4305
2.2,4.6975e-07,-0.00016063,4.7438,64.178,1,0.431
2.2,4.6829e-07,-0.00015872,4.7151,64.178,1,0.4315
2.2,4.6683e-07,-0.0001568,4.6863,64.178,1,0.432
2.2,4.6537e-07,-0.00015489,4.6575,64.178,1,0.4325
2.2,4.6391e-07,-0.00015297,4.6288,64.178,1,0.433
2.2,4.6245e-07,-0.00015106,4.6,64.178,1,0.4335
2.2,4.61e-07,-0.00014915,4.5713,64.178,1,0.434
2.2,4.5954e-07,-0.00014723,4.5425,64.178,1,0.4345
2.2,4.5808e-07,-0.00014532,4.5137,64.178,1,0.435
2.2,4.5662e-07,-0.0001434,4.485,64.178,1,0.4355
2.2,4.5481e-07,-0.00014155,4.4553,64.178,1,0.436
2.2,4.5268e-07,-0.00013975,4.4248,64.178,1,0.4365
2.2,4.5054e-07,-0.00013796,4.3943,64.178,1,0.437
2.2,4.4841e-07,-0.00013616,4.3638,64.178,1,0.4375
2.2,4.4627e-07,-0.00013437,4.3334,64.178,1,0.438
2.2,4.4414e-07,-0.00013257,4.3029,64.178,1,0.4385
2.2,4.4201e-07,-0.00013077,4.2724,64.178,1,0.439
2.2,4.3987e-07,-0.00012898,4.2419,64.178,1,0.4395
2.2,4.3774e-07,-0.00012718,4.2114,64.178,1,0.44
2.2,4.356e-07,-0.00012539,4.1809,64.178,1,0.4405
2.2,4.3347e-07,-0.00012359,4.1504,64.178,1,0.441
2.2,4.3134e-07,-0.0001218,4.1199,64.178,1,0.4415
2.2,4.292e-07,-0.00012,4.0894,64.178,1,0.442
2.2,4.2707e-07,-0.00011821,4.0589,64.178,1,0.4425
2.2,4.2493e-07,-0.00011641,4.0285,64.178,1,0.443
2.2,4.228e-07,-0.00011461,3.998,64.178,1,0.4435
2.2,4.2066e-07,-0.00011282,3.9675,64.178,1,0.444
2.2,4.1853e-07,-0.00011102,3.937,64.178,1,0.4445
2.2,4.164e-07,-0.00010923,3.9065,64.178,1,0.445
2.2,4.1426e-07,-0.00010743,3.876,64.178,1,0.4455
2.2,4.1213e-07,-0.00010564,3.8455,64.178,1,0.446
2.2,4.0993e-07,-0.00010386,3.8149,64.178,1,0.4465
2.2,4.0713e-07,-0.00010226,3.7826,64.178,1,0.447
2.2,4.0433e-07,-0.00010065,3.7504,64.178,1,0.4475
2.2,4.0153e-07,-9.9049e-05,3.7182,64.178,1,0.448
2.2,3.9873e-07,-9.7446e-05,3.686,64.178,1,0.4485
2.2,3.9593e-07,-9.5842e-05,3.6538,64.178,1,0.449
2.2,3.9313e-07,-9.4238e-05,3.6215,64.178,1,0.4495
2.2,3.9033e-07,-9.2635e-05,3.5893,64.178,1,0.45
2.2,3.8754e-07,-9.1031e-05,3.5571,64.178,1,0.4505
2.2,3.8474e-07,-8.9428e-05,3.5249,64.178,1,0.451
2.2,3.8194e-07,-8.7824e-05,3.4927,64.178,1,0.4515
2.2,3.7914e-07,-8.6221e-05,3.4604,64.178,1,0.452
2.2,3.7634e-07,-8.4617e-05,3.4282,64.178,1,0.4525
2.2,3.7354e-07,-8.3013e-05,3.396,64.178,1,0.453
2.2,3.7074e-07,-8.141e-05,3.3638,64.178,1,0.4535
2.2,3.6794e-07,-7.9806e-05,3.3316,64.178,1,0.454
2.2,3.6514e-07,-7.8203e-05,3.2994,64.178,1,0.4545
2.2,3.6235e-07,-7.6599e-05,3.2671,64.178,1,0.455
2.2,3.5955e-07,-7.4996e-05,3.2349,64.178,1,0.4555
2.2,3.5675e-07,-7.3392e-05,3.2027,64.178,1,0.456
2.2,3.5395e-07,-7.1789e-05,3.1705,64.178,1,0.4565
2.2,3.5115e-07,-7.0185e-05,3.1383,64.178,1,0.457
2.2,3.4792e-07,-6.8756e-05,3.1049,64.178,1,0.4575
2.2,3.4449e-07,-6.741e-05,3.0709,64.178,1,0.458
2.2,3.4106e-07,-6.6064e-05,3.037,64.178,1,0.4585
2.2,3.3763e-07,-6.4717e-05,3.003,64.178,1,0.459
2.2,3.3421e-07,-6.3371e-05,2.9691,64.178,1,0.4595
2.2,3.3078e-07,-6.2025e-05,2.9351,64.178,1,0.46
2.2,3.2735e-07,-6.0679e-05,2.9012,64.178,1,0.4605
2.2,3.2392e-07,-5.9332e-05,2.8672,64.178,1,0.461
2.2,3.2049e-07,-5.7986e-05,2.8333,64.178,1,0.4615
2.2,3.1706e-07,-5.664e-05,2.7993,64.178,1,0.462
2.2,3.1363e-07,-5.5293e-05,2.7654,64.178,1,0.4625
2.2,3.102e-07,-5.3947e-05,2.7314,64.178,1,0.463
2.2,3.0677e-07,-5.2601e-05,2.6975,64.178,1,0.4635
2.2,3.0334e-07,-5.1255e-05,2.6635,64.178,1,0.464
2.2,2.9992e-07,-4.9908e-05,2.6296,64.178,1,0.4645
2.2,2.9649e-07,-4.8562e-05,2.5957,64.178,1,0.465
2.2,2.9306e-07,-4.7216e-05,2.5617,64.178,1,0.4655
2.2,2.8963e-07,-4.5869e-05,2.5278,64.178,1,0.466
2.2,2.862e-07,-4.4523e-05,2.4938,64.178,1,0.4665
2.2,2.8277e-07,-4.3177e-05,2.4599,64.178,1,0.467
2.2,2.7934e-07,-4.183e-05,2.4259,64.178,1,0.4675
2.2,2.7578e-07,-4.0569e-05,2.3915,64.178,1,0.468
2.2,2.7182e-07,-3.9549e-05,2.3558,64.178,1,0.4685
2.2,2.6787e-07,-3.853e-05,2.3202,64.178,1,0.469
2.2,2.6391e-07,-3.751e-05,2.2845,64.178,1,0.4695
2.2,2.5996e-07,-3.649e-05,2.2488,64.178,1,0.47
2.2,2.5601e-07,-3.547e-05,2.2131,64.178,1,0.4705
2.2,2.5205e-07,-3.4451e-05,2.1775,64.178,1,0.471
2.2,2.481e-07,-3.3431e-05,2.1418,64.178,1,0.4715
2.2,2.4415e-07,-3.2411e-05,2.1061,64.178,1,0.472
2.2,2.4019e-07,-3.1391e-05,2.0704,64.178,1,0.4725
2.2,2.3624e-07,-3.0372e-05,2.0348,64.178,1,0.473
2.2,2.3228e-07,-2.9352e-05,1.9991,64.178,1,0.4735
2.2,2.2833e-07,-2.8332e-05,1.9634,64.178,1,0.474
2.2,2.2438e-07,-2.7312e-05,1.9277,64.178,1,0.4745
2.2,2.2042e-07,-2.6293e-05,1.8921,64.178,1,0.475
2.2,2.1647e-07,-2.5273e-05,1.8564,64.178,1,0.4755
2.2,2.1251e-07,-2.4253e-05,1.8207,64.178,1,0.476
2.2,2.0856e-07,-2.3233e-05,1.7851,64.178,1,0.4765
2.2,2.0461e-07,-2.2214e-05,1.7494,64.178,1,0.477
2.2,2.0065e-07,-2.1194e-05,1.7137,64.178,1,0.4775
2.2,1.967e-07,-2.0174e-05,1.678,64.178,1,0.478
2.2,1.9275e-07,-1.9155e-05,1.6424,64.178,1,0.4785
2.2,1.8846e-07,-1.8475e-05,1.6052,64.178,1,0.479
2.2,1.8412e-07,-1.786e-05,1.5678,64.178,1,0.4795
2.2,1.7977e-07,-1.7245e-05,1.5304,64.178,1,0.48
2.2,1.7543e-07,-1.663e-05,1.493,64.178,1,0.4805
2.2,1.7108e-07,-1.6015e-05,1.4556,64.178,1,0.481
2.2,1.6673e-07,-1.5401e-05,1.4182,64.178,1,0.4815
2.2,1.6239e-07,-1.4786e-05,1.3808,64.178,1,0.482
2.2,1.5804e-07,-1.4171e-05,1.3434,64.178,1,0.4825
2.2,1.537e-07,-1.3556e-05,1.306,64.178,1,0.483
2.2,1.4935e-07,-1.2941e-05,1.2686,64.178,1,0.4835
2.2,1.4501e-07,-1.2326e-05,1.2312,64.178,1,0.484
2.2,1.4066e-07,-1.1711e-05,1.1938,64.178,1,0.4845
2.2,1.3631e-07,-1.1096e-05,1.1564,64.178,1,0.485
2.2,1.3197e-07,-1.0482e-05,1.119,64.178,1,0.4855
2.2,1.2762e-07,-9.8668e-06,1.0816,64.178,1,0.486
2.2,1.2328e-07,-9.2519e-06,1.0442,64.178,1,0.4865
2.2,1.1893e-07,-8.637e-06,1.0068,64.178,1,0.487
2.2,1.1459e-07,-8.0222e-06,0.96942,64.178,1,0.4875
2.2,1.1024e-07,-7.4073e-06,0.93202,64.178,1,0.488
2.2,1.0589e-07,-6.7925e-06,0.89462,64.178,1,0.4885
2.2,1.0155e-07,-6.1776e-06,0.85722,64.178,1,0.489
2.2,9.7087e-08,-5.7068e-06,0.81914,64.178,1,0.4895
2.2,9.2464e-08,-5.4351e-06,0.78014,64.178,1,0.49
2.2,8.7841e-08,-5.1633e-06,0.74113,64.178,1,0.4905
2.2,8.3217e-08,-4.8916e-06,0.70212,64.178,1,0.491
2.2,7.8594e-08,-4.6198e-06,0.66312,64.178,1,0.4915
2.2,7.3971e-08,-4.3481e-06,0.62411,64.178,1,0.492
2.2,6.9348e-08,-4.0763e-06,0.5851,64.178,1,0.4925
2.2,6.4725e-08,-3.8046e-06,0.5461,64.178,1,0.493
2.2,6.0102e-08,-3.5328e-06,0.50709,64.178,1,0.4935
2.2,5.5478e-08,-3.261e-06,0.46808,64.178,1,0.494
2.2,5.0855e-08,-2.9893e-06,0.42908,64.178,1,0.4945
2.2,4.6232e-08,-2.7175e-06,0.39007,64.178,1,0.495
2.2,4.1609e-08,-2.4458e-06,0.35106,64.178,1,0.4955
2.2,3.6985e-08,-2.174e-06,0.31205,64.178,1,0.496
2.2,3.2362e-08,-1.9023e-06,0.27305,64.178,1,0.4965
2.2,2.7739e-08,-1.6305e-06,0.23404,64.178,1,0.497
2.2,2.3116e-08,-1.3588e-06,0.19503,64.178,1,0.4975
2.2,1.8493e-08,-1.087e-06,0.15603,64.178,1,0.498
2.2,1.387e-08,-8.1526e-07,0.11702,64.178,1,0.4985
2.2,9.2464e-09,-5.4351e-07,0.078014,64.178,1,0.499
2.2,4.6231e-09,-2.7175e-07,0.039006,64.178,1,0.4995
2.2,6.5966e-23,-3.8775e-21,5.5657e-16,64.178,1,0.5
