@startuml ScrumProcess
    enum ScrumProjectType {
         SCRUMATOMICPROJECT
        SCRUMCOMPLEXPROJECT
    }
    enum CeremonyType {
         PLANNING
        DAILY
        REVIEW
        RETROSPECTIVE
    }
    enum SucessfullyPerformedType {
         NONSUCESSFULLY
        SUCCESSFULLY
    }
    class ScrumProject << SoftwareProject>>{
    string: url

    ScrumProcess: scrumprocess
    ScrumProject: scrumprojects
    }

    ScrumProject "1" -- "1" ScrumProjectType : type>
    ScrumProject "1" -- "1" ScrumProcess : scrumprocess >
    ScrumProject "1" -- "0..*" ScrumProject : scrumprojects >

    class ScrumProcess << GeneralProjectProcess>>{

    Sprint: sprints
    ProductBacklogDefinition: productbacklogdefinition
    }

    ScrumProcess "1" -- "0..*" Sprint : sprints >
    ScrumProcess "1" -- "1" ProductBacklogDefinition : productbacklogdefinition >

    class ProductBacklogDefinition << SpecificProjectProcess>>{

    ProductBacklog: productbacklog
    }

    ProductBacklogDefinition "1" -- "0..*" ProductSprintBacklog.ProductBacklog : productbacklog >

    class Sprint << SpecificProjectProcess>>{
    string: url

    Ceremony: ceremonies
    SprintBacklog: sprintbacklog
    }

    Sprint "1" -- "0..*" Ceremony : ceremonies >
    Sprint "0..*" -- "0..*" ScrumDevelopmentTask : scrumdevelopmenttask >
    Sprint "1" -- "1" ProductSprintBacklog.SprintBacklog : sprintbacklog >

    class Ceremony << Activity>>{

    }

    Ceremony "1" -- "1" CeremonyType : ceremenoytype>

    class ScrumDevelopmentTask << Activity>>{
    date: createdDate
    date: activatedDate
    date: revisedDate
    date: stateChangeDate
    string: activity
    string: priority
    string: state
    string: tags

    Person: createdby
    Person: activatedby
    Sprint: currentsprint
    ScrumDevelopmentTask: scrumdevelopmenttasks
    }

    ScrumDevelopmentTask "1" -- "1" SucessfullyPerformedType : sucessfully>
    ScrumDevelopmentTask "1" -- "1" teams.Person : createdby >
    ScrumDevelopmentTask "1" -- "1" teams.Person : activatedby >
    ScrumDevelopmentTask "1" -- "1" Sprint : currentsprint >
    ScrumDevelopmentTask "1" -- "0..*" ScrumDevelopmentTask : scrumdevelopmenttasks >

@enduml
