@startuml StandardDefinition

    class CommonConcept {
    string: name
    string: description
    date: startDate
    date: endDate
    string: url
    string: externalId
    string: internalId

    }



@enduml
