@startuml ScrumDeliverable

    enum DeliverableType {
         NOTACCEPTEDDELIVERABLE
        ACCEPTEDDELIVERABLE
    }


    class Deliverable {

    }

    SRO.Artifact <|-- Deliverable

    Deliverable "1" -- "1" DeliverableType : accepted>
    Deliverable "0..*" -- "0..*" ProductSprintBacklog.UserStory : userstories >
    Deliverable "0..*" -- "0..*" ScrumProcess.ScrumDevelopmentTask : scrumactivity >

    class SprintDeliverable {

    Deliverable: deliverables

    Sprint: sprint
    }

    SprintDeliverable "1" -- "0..*" Deliverable : deliverables >
    SprintDeliverable "1" -- "1" ScrumProcess.Sprint : sprint >

    SRO.Artifact <|-- ScrumProjectDeliverable

    class ScrumProjectDeliverable {

    SprintDeliverable: sprintdeliverables
    ScrumProcess: scrumprocess
    }

    ScrumProjectDeliverable "1" -- "0..*" SprintDeliverable : sprintdeliverables >
    ScrumProjectDeliverable "1" -- "1" ScrumProcess.ScrumProcess : scrumprocess >

@enduml
