@startuml Defects

    class CommonConceptDate {
    string: name
    string: description
    date: startDate
    date: endDate
    string: externalId
    string: internalId

    }



    class Failure {

    Failure: causedby
    }

    CommonConceptDate <|-- Failure


    Failure "1" -- "0..*" Failure : causedby >
    Failure "0..*" -- "0..*" Vulnerability : manifestation >

    class VulnerableState {

    Failure: failure
    }

    CommonConceptDate <|-- VulnerableState


    VulnerableState "1" -- "0..*" Failure : failure >
    VulnerableState "0..*" -- "0..*" Vulnerability : vulnerability >

    class Vulnerability {

    }

    CommonConceptDate <|-- Vulnerability



    class ProgramVulnerability {

    }

    Vulnerability <|-- ProgramVulnerability



    class Defect {

    }

    ProgramVulnerability <|-- Defect



    class Fault {

    }

    Defect <|-- Fault



@enduml
