  {
    "name": "ciro-connector",
    "config": {
        "connector.class": "io.debezium.connector.postgresql.PostgresConnector",
        "tasks.max": "1",
        "database.hostname": "db-pg",
        "database.port": "5432",
        "database.user": "postgres",
        "database.password": "postgres",
        "database.dbname" : "ciro",
        "topic.prefix": "ontology.ciro",
        "topic.partitions": 3,
        "schema.include.list": "public"
    }
}

