{
  "name": "kashmir",
  "scopeName": "source.kashmir",
  "fileTypes": [
    ".kashmir"
  ],
  "patterns": [
    {
      "include": "#comments"
    },
    {
      "name": "keyword.control.kashmir",
      "match": "\\b(Configuration|ManyToMany|ManyToOne|OneToMany|OneToOne|abstract|boolean|by|char|date|datetime|decimal|entity|enum|extends|from|fullName|import|integer|module|string|unique|uses|uuid)\\b|\\b(about:|author:|author_email:|database_name:|framework:|package_path:|repository:|service_port:|software:)\\B"
    },
    {
      "name": "string.quoted.double.kashmir",
      "begin": "\"",
      "end": "\"",
      "patterns": [
        {
          "include": "#string-character-escape"
        }
      ]
    },
    {
      "name": "string.quoted.single.kashmir",
      "begin": "'",
      "end": "'",
      "patterns": [
        {
          "include": "#string-character-escape"
        }
      ]
    }
  ],
  "repository": {
    "comments": {
      "patterns": [
        {
          "name": "comment.block.kashmir",
          "begin": "/\\*",
          "beginCaptures": {
            "0": {
              "name": "punctuation.definition.comment.kashmir"
            }
          },
          "end": "\\*/",
          "endCaptures": {
            "0": {
              "name": "punctuation.definition.comment.kashmir"
            }
          }
        },
        {
          "begin": "//",
          "beginCaptures": {
            "1": {
              "name": "punctuation.whitespace.comment.leading.kashmir"
            }
          },
          "end": "(?=$)",
          "name": "comment.line.kashmir"
        }
      ]
    },
    "string-character-escape": {
      "name": "constant.character.escape.kashmir",
      "match": "\\\\(x[0-9A-Fa-f]{2}|u[0-9A-Fa-f]{4}|u\\{[0-9A-Fa-f]+\\}|[0-2][0-7]{0,2}|3[0-6][0-7]?|37[0-7]?|[4-7][0-7]?|.|$)"
    }
  }
}
