@startuml Process
enum StateType {
    performed
    intended
}
enum SuccessType {
    successs
    unsuccess
}

class GeneralProjectProcess {
string: name
string: description
date: startDate
date: endDate
string: externalId
string: internalId

SoftwareProject: project
SpecificProjectProcess: specifictprocesses
GeneralProjectProcess: generalprojectprocesses
}

GeneralProjectProcess "1" -- "1" StateType : statetype>,GeneralProjectProcess "1" -- "1" SuccessType : successtype>
GeneralProjectProcess "1" -- "1" Project.SoftwareProject : project >
GeneralProjectProcess "1" -- "0..*" SpecificProjectProcess : specifictprocesses >
GeneralProjectProcess "1" -- "0..*" GeneralProjectProcess : generalprojectprocesses >

class SpecificProjectProcess {
string: name
string: description
date: startDate
date: endDate
string: externalId
string: internalId

Activity: performedactivity
SpecificProjectProcess: specifictprojectprocesses
}

SpecificProjectProcess "1" -- "1" StateType : statetype>,SpecificProjectProcess "1" -- "1" SuccessType : successtype>
SpecificProjectProcess "1" -- "0..*" Activity : performedactivity >
SpecificProjectProcess "1" -- "0..*" SpecificProjectProcess : specifictprojectprocesses >

class Activity {
string: name
string: description
date: startDate
date: endDate
string: externalId
string: internalId

Activity: activities
}

Activity "1" -- "1" StateType : statetype>,Activity "1" -- "1" SuccessType : successtype>
Activity "0..*" -- "0..*" Artifact.Artifact : artifactusage >
Activity "0..*" -- "0..*" Artifact.Artifact : artifactchanged >
Activity "0..*" -- "0..*" Artifact.Artifact : artifactcreated >
Activity "0..*" -- "0..*" Artifact.Artifact : artifactdeleted >
Activity "1" -- "0..*" Activity : activities >

@enduml
