@startuml Artifact

class Artifact {
string: name
string: description
date: startDate
date: endDate
string: externalId
string: internalId

Artifact: composeof
}


Artifact "1" -- "0..*" Artifact : composeof >

@enduml
