@startuml Stakeholders

class Person {
string: email
string: name
string: description
date: startDate
date: endDate
string: url
string: externalId
string: internalId

}



class ScrumTeam {
string: email
string: name
string: description
date: startDate
date: endDate
string: url
string: externalId
string: internalId

}



@enduml
