0; 71
1; 100
2; 73
3; 53
4; 72
5; 120
6; 80
7; 136
8; 59
9; 51
10; 66
11; 60
12; 73
13; 138
14; 43
15; 120
16; 55
17; 62
18; 52
19; 74
20; 90
21; 235
22; 48
23; 47
24; 67
25; 58
26; 51
27; 155
28; 47
29; 53
30; 76
31; 116
32; 58
33; 95
34; 80
35; 96
36; 109
37; 102
38; 71
39; 85
40; 106
41; 108
42; 111
43; 106
44; 123
45; 98
46; 100
47; 110
48; 110
49; 128
50; 115
51; 110
52; 117
53; 131
54; 136
55; 148
56; 139
57; 108
58; 135
59; 143
60; 139
61; 151
62; 127
63; 142
64; 161
65; 140
66; 156
67; 157
68; 144
69; 153
70; 145
71; 149
72; 163
73; 160
74; 157
75; 128
76; 116
77; 144
78; 112
79; 136
80; 126
81; 137
82; 133
83; 163
84; 142
85; 114
86; 122
87; 106
88; 125
89; 107
90; 88
91; 107
92; 85
93; 103
94; 96
95; 90
96; 87
97; 125
98; 77
99; 94
