0; 123
1; 92
2; 112
3; 130
4; 103
5; 99
6; 116
7; 101
8; 95
9; 109
10; 94
11; 106
12; 95
13; 93
14; 90
15; 108
16; 100
17; 103
18; 111
19; 113
20; 120
21; 89
22; 101
23; 107
24; 92
25; 111
26; 112
27; 115
28; 83
29; 103
30; 85
31; 90
32; 109
33; 135
34; 97
35; 98
36; 93
37; 89
38; 94
39; 98
40; 99
41; 96
42; 122
43; 86
44; 123
45; 86
46; 98
47; 82
48; 193
49; 91
50; 113
51; 94
52; 122
53; 103
54; 302
55; 102
56; 123
57; 88
58; 102
59; 103
60; 183
61; 98
62; 105
63; 77
64; 106
65; 116
66; 158
67; 103
68; 106
69; 99
70; 133
71; 103
72; 98
73; 92
74; 149
75; 102
76; 105
77; 122
78; 117
79; 80
80; 106
81; 134
82; 130
83; 98
84; 133
85; 114
86; 102
87; 97
88; 125
89; 135
90; 131
91; 96
92; 100
93; 109
94; 86
95; 95
96; 132
97; 110
98; 94
99; 95
