{
  "Gt6EZ8XRUwY": {
    "user_name": "Marcelo Irigoyen",
    "user_url": "https://unsplash.com/@lu3fmm?utm_source=unsample&utm_medium=referral&utm_campaign=api-credit",
    "photo_url": "https://unsplash.com/photos/Gt6EZ8XRUwY?utm_source=unsample&utm_medium=referral&utm_campaign=api-credit"
  },
  "SizwG-GTHuY": {
    "user_name": "Lee Kurth",
    "user_url": "https://unsplash.com/@lee_k?utm_source=unsample&utm_medium=referral&utm_campaign=api-credit",
    "photo_url": "https://unsplash.com/photos/SizwG-GTHuY?utm_source=unsample&utm_medium=referral&utm_campaign=api-credit"
  },
  "ZH4Erno15YA": {
    "user_name": "Bryan Hanson",
    "user_url": "https://unsplash.com/@bryanhanson?utm_source=unsample&utm_medium=referral&utm_campaign=api-credit",
    "photo_url": "https://unsplash.com/photos/ZH4Erno15YA?utm_source=unsample&utm_medium=referral&utm_campaign=api-credit"
  },
  "CKDE828LANQ": {
    "user_name": "Janaka Dharmasena",
    "user_url": "https://unsplash.com/@janaka1?utm_source=unsample&utm_medium=referral&utm_campaign=api-credit",
    "photo_url": "https://unsplash.com/photos/CKDE828LANQ?utm_source=unsample&utm_medium=referral&utm_campaign=api-credit"
  },
  "z8UQBB5mJVY": {
    "user_name": "Belinda Fewings",
    "user_url": "https://unsplash.com/@bel2000a?utm_source=unsample&utm_medium=referral&utm_campaign=api-credit",
    "photo_url": "https://unsplash.com/photos/z8UQBB5mJVY?utm_source=unsample&utm_medium=referral&utm_campaign=api-credit"
  },
  "OhE6wMahECM": {
    "user_name": "Ravi Roshan",
    "user_url": "https://unsplash.com/@ravi_roshan_inc?utm_source=unsample&utm_medium=referral&utm_campaign=api-credit",
    "photo_url": "https://unsplash.com/photos/OhE6wMahECM?utm_source=unsample&utm_medium=referral&utm_campaign=api-credit"
  },
  "CSZAQBvZv8s": {
    "user_name": "Melissa Walker Horn",
    "user_url": "https://unsplash.com/@sugercoatit?utm_source=unsample&utm_medium=referral&utm_campaign=api-credit",
    "photo_url": "https://unsplash.com/photos/CSZAQBvZv8s?utm_source=unsample&utm_medium=referral&utm_campaign=api-credit"
  },
  "H2R9j8VT_rU": {
    "user_name": "Markus Spiske",
    "user_url": "https://unsplash.com/@markusspiske?utm_source=unsample&utm_medium=referral&utm_campaign=api-credit",
    "photo_url": "https://unsplash.com/photos/H2R9j8VT_rU?utm_source=unsample&utm_medium=referral&utm_campaign=api-credit"
  },
  "i7UzcqSyPRc": {
    "user_name": "Y Heng",
    "user_url": "https://unsplash.com/@yheng?utm_source=unsample&utm_medium=referral&utm_campaign=api-credit",
    "photo_url": "https://unsplash.com/photos/i7UzcqSyPRc?utm_source=unsample&utm_medium=referral&utm_campaign=api-credit"
  },
  "KIL9suHFp6s": {
    "user_name": "Amna Akram",
    "user_url": "https://unsplash.com/@amoonnotmoon?utm_source=unsample&utm_medium=referral&utm_campaign=api-credit",
    "photo_url": "https://unsplash.com/photos/KIL9suHFp6s?utm_source=unsample&utm_medium=referral&utm_campaign=api-credit"
  },
  "WQEsRgTDLlE": {
    "user_name": "Timeo Buehrer",
    "user_url": "https://unsplash.com/@timib04?utm_source=unsample&utm_medium=referral&utm_campaign=api-credit",
    "photo_url": "https://unsplash.com/photos/WQEsRgTDLlE?utm_source=unsample&utm_medium=referral&utm_campaign=api-credit"
  },
  "rh3LnVkwk7E": {
    "user_name": "Evgeniy Ivanov",
    "user_url": "https://unsplash.com/@koriolan?utm_source=unsample&utm_medium=referral&utm_campaign=api-credit",
    "photo_url": "https://unsplash.com/photos/rh3LnVkwk7E?utm_source=unsample&utm_medium=referral&utm_campaign=api-credit"
  },
  "mMMgX3kC0_M": {
    "user_name": "chandra putra",
    "user_url": "https://unsplash.com/@chandra_31?utm_source=unsample&utm_medium=referral&utm_campaign=api-credit",
    "photo_url": "https://unsplash.com/photos/mMMgX3kC0_M?utm_source=unsample&utm_medium=referral&utm_campaign=api-credit"
  },
  "qVHoWtANelk": {
    "user_name": "Rio Lecatompessy",
    "user_url": "https://unsplash.com/@riolec?utm_source=unsample&utm_medium=referral&utm_campaign=api-credit",
    "photo_url": "https://unsplash.com/photos/qVHoWtANelk?utm_source=unsample&utm_medium=referral&utm_campaign=api-credit"
  },
  "tE2Q_9nYZms": {
    "user_name": "Brent Gorwin",
    "user_url": "https://unsplash.com/@brentg?utm_source=unsample&utm_medium=referral&utm_campaign=api-credit",
    "photo_url": "https://unsplash.com/photos/tE2Q_9nYZms?utm_source=unsample&utm_medium=referral&utm_campaign=api-credit"
  },
  "q3RBEoJAsAQ": {
    "user_name": "Veronica Gremes",
    "user_url": "https://unsplash.com/@verogre?utm_source=unsample&utm_medium=referral&utm_campaign=api-credit",
    "photo_url": "https://unsplash.com/photos/q3RBEoJAsAQ?utm_source=unsample&utm_medium=referral&utm_campaign=api-credit"
  },
  "SG08mFspGkE": {
    "user_name": "Juvian Duff",
    "user_url": "https://unsplash.com/@xtruh_terrestrial?utm_source=unsample&utm_medium=referral&utm_campaign=api-credit",
    "photo_url": "https://unsplash.com/photos/SG08mFspGkE?utm_source=unsample&utm_medium=referral&utm_campaign=api-credit"
  },
  "44FwM-ixRRU": {
    "user_name": "Huy Phan",
    "user_url": "https://unsplash.com/@huyphan2602?utm_source=unsample&utm_medium=referral&utm_campaign=api-credit",
    "photo_url": "https://unsplash.com/photos/44FwM-ixRRU?utm_source=unsample&utm_medium=referral&utm_campaign=api-credit"
  },
  "buA5_3PDBXw": {
    "user_name": "Omar Lopez",
    "user_url": "https://unsplash.com/@omarlopez1?utm_source=unsample&utm_medium=referral&utm_campaign=api-credit",
    "photo_url": "https://unsplash.com/photos/buA5_3PDBXw?utm_source=unsample&utm_medium=referral&utm_campaign=api-credit"
  },
  "N3h6yA2_1hk": {
    "user_name": "Joah Legg",
    "user_url": "https://unsplash.com/@sohcahjoah?utm_source=unsample&utm_medium=referral&utm_campaign=api-credit",
    "photo_url": "https://unsplash.com/photos/N3h6yA2_1hk?utm_source=unsample&utm_medium=referral&utm_campaign=api-credit"
  },
  "-A6aZMpux-c": {
    "user_name": "Erik Mclean",
    "user_url": "https://unsplash.com/@introspectivedsgn?utm_source=unsample&utm_medium=referral&utm_campaign=api-credit",
    "photo_url": "https://unsplash.com/photos/-A6aZMpux-c?utm_source=unsample&utm_medium=referral&utm_campaign=api-credit"
  },
  "GKpbJP60bZ0": {
    "user_name": "Sébastien Goldberg",
    "user_url": "https://unsplash.com/@sebastiengoldberg?utm_source=unsample&utm_medium=referral&utm_campaign=api-credit",
    "photo_url": "https://unsplash.com/photos/GKpbJP60bZ0?utm_source=unsample&utm_medium=referral&utm_campaign=api-credit"
  },
  "wAkIQ1zEo30": {
    "user_name": "Darpan Dodiya",
    "user_url": "https://unsplash.com/@darpandodiya?utm_source=unsample&utm_medium=referral&utm_campaign=api-credit",
    "photo_url": "https://unsplash.com/photos/wAkIQ1zEo30?utm_source=unsample&utm_medium=referral&utm_campaign=api-credit"
  },
  "40nRSaQNYYs": {
    "user_name": "Uriel Soberanes",
    "user_url": "https://unsplash.com/@soberanes?utm_source=unsample&utm_medium=referral&utm_campaign=api-credit",
    "photo_url": "https://unsplash.com/photos/40nRSaQNYYs?utm_source=unsample&utm_medium=referral&utm_campaign=api-credit"
  },
  "PO4mYiIjI9o": {
    "user_name": "Ryan Loughlin",
    "user_url": "https://unsplash.com/@rylomedia?utm_source=unsample&utm_medium=referral&utm_campaign=api-credit",
    "photo_url": "https://unsplash.com/photos/PO4mYiIjI9o?utm_source=unsample&utm_medium=referral&utm_campaign=api-credit"
  },
  "VWMOZa4dH3o": {
    "user_name": "Troy T",
    "user_url": "https://unsplash.com/@ttcollect?utm_source=unsample&utm_medium=referral&utm_campaign=api-credit",
    "photo_url": "https://unsplash.com/photos/VWMOZa4dH3o?utm_source=unsample&utm_medium=referral&utm_campaign=api-credit"
  },
  "ofwW7Qvb3co": {
    "user_name": "Sumat Singh",
    "user_url": "https://unsplash.com/@iamsumat?utm_source=unsample&utm_medium=referral&utm_campaign=api-credit",
    "photo_url": "https://unsplash.com/photos/ofwW7Qvb3co?utm_source=unsample&utm_medium=referral&utm_campaign=api-credit"
  },
  "PxuLE7N57Ac": {
    "user_name": "Patrick Hendry",
    "user_url": "https://unsplash.com/@worldsbetweenlines?utm_source=unsample&utm_medium=referral&utm_campaign=api-credit",
    "photo_url": "https://unsplash.com/photos/PxuLE7N57Ac?utm_source=unsample&utm_medium=referral&utm_campaign=api-credit"
  },
  "mClbVUd0YVg": {
    "user_name": "Annie Spratt",
    "user_url": "https://unsplash.com/@anniespratt?utm_source=unsample&utm_medium=referral&utm_campaign=api-credit",
    "photo_url": "https://unsplash.com/photos/mClbVUd0YVg?utm_source=unsample&utm_medium=referral&utm_campaign=api-credit"
  },
  "b7iVDLIWgEU": {
    "user_name": "Tim Mossholder",
    "user_url": "https://unsplash.com/@timmossholder?utm_source=unsample&utm_medium=referral&utm_campaign=api-credit",
    "photo_url": "https://unsplash.com/photos/b7iVDLIWgEU?utm_source=unsample&utm_medium=referral&utm_campaign=api-credit"
  }
}