{
	"common": {
		"format": "格式",
		"notnow": "不是現在",
		"more": "更多",
		"outline": "大綱",
		"bible": "聖經",
		"reset": "重置",
		"error": "錯誤",
		"new": "新",
		"verse": "節",
		"note": "注意",
		"annotate": "註釋",
		"annotations": "釋文",
		"cancel": "取消",
		"ok": "確定",
		"yes": "有",
		"no": "沒有",
		"other": "其它",
		"done": "完成",
		"top": "頂",
		"edit": "編輯",
		"add": "加入",
		"save": "儲存",
		"delete": "刪除",
		"remove": "銷毀",
		"search": "搜尋",
		"options": "選項",
		"chapter": "章",
		"article": "文章",
		"title": "標題",
		"image_viewer": "圖像查看器",
		"reference": "參考",
		"topic": "主題",
		"heading": "頭標題",
		"reloading": "重新加載",
		"loading": "加載",
		"settings": "設定",
		"confirm": "請確認",
		"forums": "論壇",
		"history": "記錄",
		"historyclear": "清除記錄",
		"historyconfirm": "這將刪除所有記錄，請確定是否要繼續進行",
		"subheadings": "副標題",
		"copied": "複製到剪貼板",
		"page": "頁",
		"pages": "頁面",
		"paragraphs": "段落",
		"footnote": "腳註",
		"about": "關於",
		"news": "新聞",
		"general": "一般",
		"word_search": "單詞搜尋",
		"tip": "提示",
		"recent": "最近",
		"recently_opened": "最近打開",
		"frontcover": "封面",
		"reorder": "重新排序",
		"order": "排序",
		"favourites": "收藏夾",
		"favouritesave": "保存收藏夾",
		"websites": "網站",
		"contents": "內容",
		"clearcache": "清除緩存",
		"size": "大小",
		"height": "高度",
		"width": "寬度",
		"small": "小",
		"default": "預設",
		"medium": "中",
		"large": "大",
		"larger": "更大",
		"largest": "最大",
		"fullscreen": "全屏",
		"home": "主頁",
		"back": "回到",
		"forward": "往前",
		"toggle2lines": "切換兩行",
		"list": "列表",
		"grid": "格線",
		"map": "地圖",
		"hybrid": "混合",
		"choose": "請選擇",
		"selectall": "選擇所有",
		"online": "在線",
		"file": "文件",
		"layout": "更換設計",
		"never": "尚未",
		"sync": "同步",
		"syncing": "同步中",
		"current": "當前",
		"saved": "保存",
		"active": "啟動",
		"alert": "警報",
		"warning": "警告",
		"important": "重要",
		"acknowledge": "承認",
		"any": "任何",
		"none": "沒有",
		"enable": "開啟",
		"enabled": "已開啟",
		"disable": "關閉",
		"disabled": "已關閉",
		"update": "更新",
		"modify": "修改",
		"created": "建立",
		"overdue": "逾期",
		"cannot": "無法繼續",
		"all": "所有",
		"website": "網站",
		"epub": "EPUB",
		"pdf": "PDF",
		"open_prompt": "打開%1$s",
		"view_prompt": "觀看%1$s",
		"download_prompt": "下載%1$s",
		"details": "細節",
		"stop": "停止",
		"start": "開始",
		"custom": "自定",
		"summary": "總結",
		"please_note": "請注意",
		"when": "時間",
		"bookmarks": "書籤欄",
		"bookmark": "書籤",
		"territory": "地區",
		"territories": "地區",
		"congregation": "會眾",
		"show_prompt": "顯示%1$s",
		"hide_prompt": "隱藏%1$s",
		"delete_prompt": "刪除%1$s",
		"remove_prompt": "銷毀%1$s",
		"open_in_prompt": "在%1$sd打開",
		"open_item_in_prompt": "在%2$s中打開%1$s",
		"edit_in_prompt": "在%1$s中編輯",
		"view_in_prompt": "在%1$s查看",
		"download_from_prompt": "從%1$s下載",
		"sync_prompt": "同步%1$s",
		"syncing_prompt": "%1$s同步中",
		"notes": "記錄",
		"read_only": "唯讀",
		"editable": "可編輯",
		"required": "需要",
		"unknown": "未知",
		"confirmed": "確定",
		"calendar": "日曆",
		"end": "結束",
		"ahead": "提前",
		"behind": "延遲"
	},
	"time": {
		"tomorrow": "明日",
		"today": "今日",
		"yesterday": "昨日",
		"earlier_this_week": "本週早些時候",
		"next_week": "下週",
		"this_week": "這個星期",
		"last_week": "上個星期",
		"next_month": "下個月",
		"this_month": "這個月",
		"last_month": "上個月",
		"older": "舊的",
		"newer": "新的",
		"next_year": "明年",
		"this_year": "今年",
		"last_year": "去年",
		"on_or_before": "在%1$s或之前 ",
		"over_years_ago": "超過%1$s年前",
		"over_year_ago": "超過1年前",
		"over_months_ago": "超過%1$s個月前",
		"over_month_ago": "一個月前",
		"over_weeks_ago": "超過%1$s個星期前",
		"over_week_ago": "一個星期前",
		"over_days_ago": "超過%1$s日前",
		"within_days": "最近%1$s日前",
		"within_next_days": "過去%1$s日內",
		"over_days_away": "超過%1$s日後",
		"over_week_away": "超過1週後",
		"over_weeks_away": "超過%1$s週後",
		"over_month_away": "超過1個月後",
		"over_months_away": "超過%1$s個月後",
		"over_year_away": "超過1年後",
		"over_years_away": "超過%1$s年後",
		"future": "未來",
		"day": "日",
		"week": "週",
		"month": "月",
		"year": "年",
		"hours": "小時",
		"hour": "小時",
		"minutes": "分鐘",
		"date": "日期",
		"date_added": "新增日期",
		"date_created": "新增日期",
		"date_updated": "修改日期",
		"date_picker": "日期選擇表",
		"time": "時數",
		"time_picker": "時數選擇表",
		"format": {
			"time": {
				"standard": "g:i a",
				"full": "g:i:s a"
			},
			"date": {
				"day": "l",
				"year": "Y年",
				"full": "Y/n/j",
				"full_short": "y/n/j",
				"day_date_suffix": "jS l",
				"day_date_month": "n/d D",
				"day_month_date": "Fj日 l",
				"day_month_date_year": "Y年Fj日 l",
				"month_year": "Y年F",
				"date_month": "n/d",
				"date_month_year": "Y年Fj日",
				"picker": "M j D"
			},
			"datetime": {
				"long": "Y/n/j G:i:s A",
				"full": "Y年Fj日, l G:i A",
				"month": "Fj日, l G:i A",
				"month_short": "F n/d G:i A",
				"day_date_month_time": "n/j D\\a\\t g:i A"
			}
		},
		"abbreviations": {
			"hours_minutes": "時:分",
			"minutes_seconds": "分:秒",
			"mins": "分",
			"am": "上午",
			"pm": "下午",
			"st": "st",
			"nd": "nd",
			"rd": "rd",
			"th": "th"
		},
		"days": {
			"long": {
				"sunday": "星期日",
				"monday": "星期一",
				"tuesday": "星期二",
				"wednesday": "星期三",
				"thursday": "星期四",
				"friday": "星期五",
				"saturday": "星期六"
			},
			"short": {
				"sun": "週日",
				"mon": "週一",
				"tue": "週二",
				"wed": "週三",
				"thu": "週四",
				"fri": "週五",
				"sat": "週六"
			}
		},
		"months": {
			"long": {
				"january": "1月",
				"february": "2月",
				"march": "3月",
				"april": "4月",
				"may": "5月",
				"june": "6月",
				"july": "7月",
				"august": "8月",
				"september": "9月",
				"october": "10月",
				"november": "11月",
				"december": "12月"
			},
			"short": {
				"jan": "1月",
				"feb": "2月",
				"mar": "3月",
				"apr": "4月",
				"may": "5月",
				"jun": "6月",
				"jul": "7月",
				"aug": "8月",
				"sep": "9月",
				"oct": "10月",
				"nov": "11月",
				"dec": "12月"
			}
		}
	},
	"measurement": {
		"long": {
			"km": "公里",
			"mi": "英里",
			"gal": "加侖",
			"L": "升"
		}
	},
	"titles": {
		"mr": "先生",
		"mrs": "太太",
		"miss": "小姐",
		"ms": "女士",
		"dr": "醫生"
	},
	"email": {
		"feedback": "發送意見",
		"standard": "Email標準格式",
		"send": "發送電郵",
		"confirm": "首先請檢查您的問題、難題或想法是否未在公告或用戶論壇中討論過。",
		"english": "所有支援均以英語來進行，所以請對我表現耐心",
		"import": "轉入到%1$s",
		"footer": "由%1$s編寫的電郵"
	},
	"forms": {
		"validation": {
			"alert_title": "無效",
			"alert_message": "請修復以下內容...",
			"missing_value": "\"%1$s\" 需要有個同等值",
			"url": "請輸入一個有效的網址，開頭為http:// or https://"
		}
	},
	"search": {
		"placeholder": "搜尋%1$s",
		"searching": "正在搜尋",
		"nothing": "未找到匹配的"
	},
	"browser": {
		"reload": "重新載入頁面",
		"open": "開啟瀏覽器",
		"safari": "使用Safari開啟",
		"clipboard": "複製連結到剪貼板",
		"email": "郵件連結到此頁面"
	},
	"apps": {
		"email": "電郵",
		"sms": "短訊",
		"telegram": "Telegram",
		"whatsapp": "WhatsApp",
		"wechat": "微信",
		"viber": "Viber",
		"line": "LINE",
		"hourglass": "Hourglass",
		"nwpublisher": "NW Publisher",
		"dropbox": "Dropbox",
		"th": "Territory Helper",
		"tasks": {
			"alert": "%1$s警報",
			"error": "%1$s錯誤",
			"account": "%1$s賬戶",
			"connect": "連接到%1$s",
			"sign_in": "登錄",
			"sign_into": "登入%1$s",
			"permissions": "重整權限",
			"register": "向%1$s註冊",
			"registering": "正在向%1$s註冊",
			"errors": {
				"duplicate": "一個%1$s同步已在進行中。請等待它完成，然後再重試。",
				"registering": "無法向%1$s註冊.請\n\n稍後再試或向%2$s發送電郵，以便我可以確認%3$sAPI是否可以正常運行.\n\n抱歉給您所帶來的不便。",
				"expired": "您所登錄的%1$s賬戶已過期。請再次登錄以重整您的權限。",
				"something": "哎呀，出現了問題。\n\n您可能沒有權限來執行這個動作。也許%1$s正處於離線狀態或出現問題。\n\n請您再次檢查，然後試一次或將此問題提告上去。",
				"disconnected": "您已與%1$s斷線。請打開設定並再次連接"
			}
		}
	},
	"alerts": {
		"phone": {
			"title": "電話",
			"confirm": "確定要給\n%1$s撥電話嗎？"
		},
		"sms": {
			"title": "短訊",
			"confirm": "確定要給%1$s發短訊嗎？",
			"cannot": "此設備無法發送SMS短訊"
		},
		"ziperror": "此檔案\"%1$s\"無效。下載檔案時可能出了點問題 - 可以嘗試再次下載。\n\n檔案現在將被刪除。",
		"import": {
			"failed": "很抱歉，嘗試轉入資料時出了點問題。所以未轉入任何內容。"
		},
		"noemail": "此設備似乎不支援電郵。您是否配置了iOS郵件設置？",
		"restart": "請重新啟動%1$s，以使更新的設置生效。",
		"yousure": "您確定要這麼做嗎？",
		"internet": {
			"cannot": "無法連接到互聯網",
			"tryagain": "請連接並重試",
			"offline": "您目前不在線上。請連接到互聯網，然後再重試。"
		},
		"permissions": {
			"calendar": "無法讀取設備的日曆。請檢查權限在 設定 > 隱私 > 日曆."
		},
		"tables": {
			"pulldown": "向下拉以重整...",
			"release": "釋放以重整...",
			"loading": "加載提要數據"
		}
	},
	"calls": {
		"title": "探訪",
		"today_none": "今日未安排任何續訪",
		"date_none": "%1$s並未安排任何續訪",
		"today_hint": "修改下次續訪日期，便可在此查看",
		"actions": {
			"first": "新增初次探訪",
			"another": "新增探訪",
			"new": "新建探訪",
			"verifying": "探訪驗證中",
			"delete": "刪除探訪",
			"share": "共享探訪"
		},
		"types": {
			"first_call": "初次探訪",
			"return_visit": "續訪",
			"magazine_route": "雜誌路線",
			"top_priority": "當務之急",
			"bible_study": "聖經學生",
			"custom": "自定類型",
			"inactive": "不活躍 "
		},
		"types_abbreviated": {
			"first_call": "FC",
			"return_visit": "RV",
			"magazine_route": "MR",
			"top_priority": "TP",
			"bible_study": "BS",
			"custom": "CT",
			"inactive": "I"
		}
	},
	"contacts": {
		"title": "聯絡人",
		"contact": "聯絡",
		"selected": "%1$s選擇了",
		"name": "姓名",
		"phone": "電話",
		"email": "電郵",
		"link": "連結",
		"actions": {
			"first": "新增初次探訪",
			"another": "新增探訪",
			"first_hint": "點選右上角的\"+\"按鈕...",
			"add": "新增聯絡人",
			"new": "新聯絡人",
			"import": "從設備聯絡人轉入",
			"verifying": "驗證聯絡人",
			"filter": "篩選聯絡人",
			"edit": "更改聯絡資料",
			"delete": "刪除聯絡人",
			"deleted": "已刪除的聯絡人",
			"message": "發送消息",
			"share": "共享聯絡人",
			"search": "搜尋聯絡人",
			"search_hint": "搜尋名稱或地址"
		},
		"shared": {
			"subject": "共享來自ServicePlanner的聯絡人",
			"intro": "此聯絡人已從此處與您共享 <a href=\"https://serviceplanner.me\">ServicePlanner</a>。 如果您有使用ServicePlanner，您可以打開電郵的附件來轉入此聯絡人。",
			"email": "電郵摘要",
			"file": "共享檔案",
			"choose": "您想使用哪種方法來分享此聯絡人",
			"import": {
				"confirm": "您確定要轉入此聯絡人嗎？\n\n 如果聯絡人已存在，此資料會被覆蓋。由於此轉入，不會對【活動】或【報告】進行任何更改。"
			}
		},
		"headings": {
			"details": "探訪者細節",
			"profile": "資料",
			"this_visit": "探訪日期",
			"last_visit": "上一次探訪",
			"next_visit": "下一次探訪",
			"next_visit_day": "探訪日",
			"next_visit_on": "下次探訪在%1$s"
		},
		"filters": {
			"save": "儲存當前篩選條件",
			"overwrite": "使用當前篩選條件覆蓋",
			"header_include": "包括",
			"footer_include": "要包括在列表中的探訪者",
			"header_exclude": "排除",
			"footer_exclude": "要從列表中排除的探訪者",
			"include_before": "包括之前的日期",
			"types": "類型",
			"all": "所有探訪者",
			"default": {
				"bylocality": "按地區的探訪者",
				"bylocality_desc": "按地區來分組並以下次探訪日期來排序",
				"bytype": "按類型的探訪者",
				"bytype_desc": "按類型來分組並以下次探訪日期來排序",
				"inactive": "不活躍探訪者",
				"inactive_desc": "按上次探訪日期分組和排序，從最久的開始",
				"overdue": "逾期探訪",
				"overdue_desc": "按上次探訪日期分組和排序，從最久的開始"
			},
			"sorting": {
				"sort_by": "排序方式",
				"sort_field": "欄位",
				"sort_value": "值",
				"sort_group_by": "按組內排序",
				"primary": "主要排序",
				"secondary": "次要排序",
				"order": "排序順序",
				"ascending": "由新到舊",
				"descending": "由舊到新",
				"asc": "由新到舊",
				"desc": "由舊到新",
				"footer": "編排列出的聯絡人",
				"footer_grouped": "對組內的聯絡人進行排序",
				"last_visit": "上一個探訪日期",
				"next_visit": "下一個探訪日期"
			},
			"saved": {
				"saved": "保存篩選",
				"default": "預設篩選",
				"other": "其它篩選",
				"name": "篩選名稱",
				"description": "篩選描述",
				"delete": "刪除篩選",
				"delete_confirm": "您確定要刪除此篩選嗎？",
				"reorder": "重新編排篩選",
				"reorder_save": "保存篩選的順序",
				"reset": "重置篩選",
				"reset_confirm": "這將刪除您自定義保存的篩選並重置為預設系統篩選.\n\n您確定要這麼做嗎？",
				"footer": "滑動來編輯或刪除篩選。 使用工具欄選項更改順序。 最上篩選總是預設的篩選。"
			},
			"grouping": {
				"group_by": "分組",
				"turn_off": "關閉分組",
				"disabled": "分組已禁用",
				"footer": "在節標題下對聯絡人進行分組"
			},
			"alerts": {
				"no_types": "請選擇至少一種聯絡方式",
				"no_matches": "沒有匹配的聯絡人",
				"no_matches_hint": "請更改篩選設置",
				"apply_today_filter": "這將更改當前篩選以顯示\"所有聯絡人\"與\"下次探訪日期\"設置為%1$s.",
				"apply_on_or_before_filter": "這將更改當前篩選以顯示\"所有聯絡人\"與\"下次探訪日期\"為在%1$s或之前。"
			}
		},
		"type": "類型",
		"language": "語言",
		"tags": "標籤",
		"tag": "標籤名稱",
		"placed": "已分發",
		"placed_qty": "分發數量",
		"no_placements": "您還沒分發任何出版物",
		"no_videos": "您還沒播放任何影片",
		"shown": "已播放影片",
		"shown_qty": "已播放次數",
		"videos": "影片",
		"visits": {
			"title": "探訪",
			"visit": "探訪",
			"type": "探訪類型",
			"by_type": "探訪類型",
			"plans": "計劃",
			"details": "探訪細節",
			"next": "下次預定探訪時間",
			"previous": "之前的探訪",
			"no_placements": "沒有分發任何刊物或播放任何影片",
			"days_since": "自上次探訪以來的天數",
			"days_until": "到下次探訪的天數",
			"days_overdue": "逾期天數",
			"actions": {
				"first": "新增初次探訪",
				"first_hint": "點選左上方的\"+\"按鈕...",
				"new": "新探訪",
				"new_on": "%1$s上新增探訪",
				"edit": "編輯探訪",
				"view": "上次的探訪",
				"remind": "發送提醒",
				"delete": "刪除探訪",
				"confirmDelete": "您確定要刪除此探訪嗎？這會從報告中刪除探訪次數和所分發的出版物。",
				"manual": "僅在此處放置值，以便輸入歷史報告數據。 否則，請針對每個探訪記錄您的探訪。",
				"plans": {
					"previous": "之前的安排",
					"insert_this": "加入此探訪的記錄",
					"insert_next": "加進下一次探訪的安排裡"
				}
			},
			"types": {
				"not_home": "不在家",
				"secular": "世俗"
			}
		},
		"alerts": {
			"calculated": "該值是根據您進行的探訪自動計算得出的。",
			"inactive": "更改為不活躍",
			"permanent": "永久刪除",
			"confirmDelete": "您是否要將%1$s的探訪類型更改為 \"不活躍\"? 還是要永久刪除他們？\n\nNote: 注意：刪除聯絡人並不會從報表中刪除其探訪次數和所留下的出版物 (如果要達到這目的您可以先把個別探訪刪除).",
			"confirmDeleteSelected": "您確定要刪除%1$s所選的探訪嗎？\n\n或者您要將其類型更改為\"不活躍\"?",
			"confirmDate": "將%1$s所選探訪人的下一個探訪日期設為:"
		},
		"pickers": {
			"type": "探訪類型",
			"type_hint": "您可以在【設定>流程】編輯此類型",
			"tags": "選擇標籤",
			"thisvisitdate": "這一次的探訪",
			"nextvisitdate": "下一次的探訪",
			"dateNextVisit": "下一次探訪的日期",
			"next_week": "+1星期",
			"next_fortnight": "+2星期",
			"next_month": "+4星期",
			"location": {
				"title": "強制定位",
				"message": "使用來自GPS的坐標以強制定位...",
				"my_location": "我的目前位置",
				"insert_location": "插入當前位置",
				"previous_address": "插入上一個地址"
			}
		}
	},
	"partners": {
		"partner": "同伴",
		"start": "開始時數",
		"end": "結束時數",
		"calendars": {
			"header": "設備日曆選項",
			"device": "設備日曆",
			"readonly": "只讀日曆並未列出",
			"add": "新增到日曆",
			"remove": "從日曆中刪除",
			"notes": "在ServicePlanner中更改活動詳細信息"
		}
	},
	"qrcode": {
		"show": "顯示二維碼",
		"saved": "二維碼已儲存到您的照片庫。",
		"error": "無法將二維碼儲存到您的照片庫。"
	},
	"maps": {
		"title": "地圖",
		"type": {
			"choose": "選擇地圖類型：",
			"normal": "標準",
			"hybrid": "混合",
			"satellite": "衛星",
			"terrain": "地形"
		},
		"options": {
			"tracking_on": "我的位置開啟",
			"tracking_off": "我的位置關閉",
			"traffic_on": "交通情況開啟",
			"traffic_off": "交通情況關閉",
			"poi_on": "啟用興趣點",
			"poi_off": "關閉興趣點"
		},
		"apps": {
			"applemaps": "Apple地圖",
			"googlemaps": "Google地圖",
			"waze": "Waze"
		},
		"ask": "每次詢問",
		"address": {
			"select": "請選擇正確的地址：",
			"invalid": "無效的地址。請再試一遍。",
			"askapp": "使用...打開地址"
		},
		"manual": {
			"confirm": "您確定要將\"%1$s\"的位置更改為這些新坐標嗎？\n\n注意：這不會更新聯絡人的書面地址，只會更新在地圖上的標記位置。"
		},
		"locator": {
			"message": "您想如何處理這個地址？",
			"what": "您想查看什麼？",
			"current": "我目前的位置",
			"contact": "建立新聯絡人",
			"move": "移動現有聯絡人"
		},
		"locations": {
			"message": "您打算做什麼？",
			"open_in": "在%1$s裡打開",
			"drive": "開車到位置",
			"star": "位置已加星標",
			"flag": "區域標誌",
			"car": "汽車位置",
			"hall": "王國聚會所",
			"home": "家",
			"set": "設定%1$s",
			"remove": "刪除位置標記"
		}
	},
	"addresses": {
		"address": "地址",
		"geocode": "地理代碼",
		"location": "位置",
		"locations": "地點",
		"locality": "區域",
		"unit": "單位",
		"units": "單位",
		"floor": "樓",
		"ground": "一樓",
		"number": "號碼",
		"street": "街",
		"city": "城市",
		"postcode": "郵遞區號",
		"locale": "區域",
		"components": "地址組件",
		"latitude": "緯度",
		"longitude": "經度",
		"suburb": "郊區",
		"county": "縣",
		"state": "州",
		"state_code": "州代碼",
		"country": "國家",
		"country_code": "國家代碼",
		"place_id": "地點編號",
		"place_id_hint": "谷歌地點編號",
		"formatted": "格式化",
		"formatted_hint": "完整地址",
		"actions": {
			"lookup": "查找地址",
			"lookup_footer": "這將查找您輸入的地址並自動完成地理代碼和地址組件。或者，您可以手動編輯下面的所有地址詳細信息。",
			"lookup_location": "查找位置",
			"lookup_location_footer": "這將查找您當前的位置並自動完成地址、地理代碼和地址組件。或者，您可以手動輸入地址並進行查找。",
			"current_location": "使用當前位置",
			"current_location_footer": "這將自動檢測您當前的緯度和經度。"
		}
	},
	"territories": {
		"name": "會眾名稱",
		"pick": "哪個地區？",
		"none": "您尚未建立任何地區。",
		"map_number": "地圖%1$s",
		"map_number_type": "地圖%1$s (%2$s)",
		"add": {
			"new": "新增地區",
			"sorry": "目前僅支援從Territory Helper（territoryhelper.com）轉入的地區。在將來的更新中，您將能夠手動建立自己的地區。謝謝您的耐心。",
			"import": "從Territory Helper轉入",
			"manual": "手動建立"
		},
		"search": {
			"congregation": "搜尋%1$s地圖",
			"map": "搜尋地圖%1$s (%2$s)"
		},
		"maps": {
			"none": "此地區還沒有地圖",
			"types": "地圖類型",
			"types_footer": "重新排序或單擊以更改顏色",
			"type": "地圖類型",
			"details": "地圖細節",
			"number": "地圖編號",
			"label": "地圖標籤",
			"image": "地圖圖像",
			"assigned": "分配",
			"assigned_to": "分配給%1$s",
			"unassigned": "未分配"
		},
		"locations": {
			"details": "地區細節",
			"type": "地區類型",
			"status": "地區狀態",
			"language": "地區語言",
			"first": "新增您的第一個地區",
			"add_to": "新增到地圖%1$s",
			"visibility": {
				"title": "能見度",
				"approved": "已批准用於顯示",
				"unapproved": "尚未批准"
			}
		},
		"units": {
			"floor_hint": "樓層0 等於一樓",
			"details": "單元細節",
			"type": "單元類別",
			"status": "單元狀態",
			"add": "新增單元"
		},
		"statistics": {
			"title": "統計數據",
			"unique": "獨特"
		},
		"types": {
			"house": "房子",
			"apartment": "公寓",
			"business": "商業",
			"trainstation": "火車站",
			"busstation": "公車站",
			"school": "學校",
			"store": "店面",
			"language": "語言",
			"harbour": "港口",
			"airport": "飛機場",
			"truckstop": "卡車停靠站",
			"elderlyhome": "安老院",
			"park": "公園",
			"camp": "露營區",
			"restaurant": "餐廳",
			"hotel": "飯店",
			"vacation": "渡假村"
		},
		"statuses": {
			"unknown": "未知",
			"returnvisit": "續訪",
			"biblestudy": "聖經研究",
			"donotcall": "不要打擾",
			"eldersonly": "只限年長者",
			"locked": "封鎖",
			"lettersonly": "只限郵件",
			"vacant": "空屋",
			"notrespassing": "禁止進入",
			"daysleeper": "日間睡覺",
			"witness": "做見證",
			"phoneonly": "只限電話",
			"referral": "被介紹",
			"bewareofdog": "小心狗"
		},
		"visits": {
			"add": "新增探訪",
			"delete": "刪除探訪",
			"status": "探訪狀態",
			"visited": {
				"last": "上次探訪",
				"never": "未探訪",
				"date": "探訪日期"
			},
			"statuses": {
				"unvisited": "未探訪",
				"visited": "已探訪",
				"skipped": "跳過",
				"nothome1": "不在家 1",
				"nothome2": "不在家 2",
				"nothome3": "不在家 3"
			}
		},
		"languages": {
			"unknown": "語言未知"
		},
		"filters": {
			"matches": "篩選條件查無資料",
			"change": "請更改篩選條件",
			"maps": {
				"title": "地圖篩選條件",
				"include": {
					"title": "包含的地圖",
					"all": "所有地圖",
					"assigned": "目前已分配",
					"mine": "已分配給我"
				},
				"group": {
					"title": "分類",
					"type": "地圖類",
					"none": "無分類"
				},
				"sort": {
					"title": "排序",
					"number": "地圖號碼",
					"oldest": "舊到新",
					"assigned": "最近委派",
					"addresses": "獨特地址"
				}
			},
			"locations": {
				"title": "位置篩選",
				"types": "位置和單位類別",
				"statuses": "位置和單位狀態",
				"languages": "位置和單位語言",
				"apply_list": "採用名單",
				"apply_map": "採用地圖"
			}
		},
		"th": {
			"form": {
				"import": "轉入地圖",
				"nosync": "Territory Helper帳戶尚未在設備之間同步。 請在每台設備上登錄。",
				"geocode": "請按地址字段右側的定位按鈕，使用經緯度坐標對地址進行地理編碼。",
				"address": "地址細節只能在Territory Helper內更改。",
				"online": "您必須在線上來更改Territory Helper的資料。",
				"details": "這細節來源從Territory Helper。",
				"privacy": "筆記存放在Territory Helper。請確保該筆記符合當地政府隱私法。",
				"list": "這清單來自Territory Helper。",
				"remove": "您確定要從此系統刪除區域\"%1$s\"?"
			},
			"setup": {
				"publisher": "讀取傳道員資料",
				"congregaton": "讀取會眾資料"
			},
			"sync": {
				"title": "使用重整按鈕",
				"hint": "請使用右上角重整按鈕來讀取最新的地圖（來自Territory Helper）。",
				"importing": "轉入區域地圖 ...",
				"wait": "請稍等，正在從Territory Helper轉入地圖。",
				"map": "重整地圖資料",
				"location": "重整位置資料",
				"sending": "發送更新資料至Territory Helper"
			},
			"assignments": {
				"status": "分配狀態",
				"assigned": "已分配",
				"assigned_to": "分配給%1$s",
				"assigned_me": "分配給我",
				"assigned_date": "分配給%1$s (%2$s天)",
				"assigned_none": "無區域分配給我",
				"not": "未分配",
				"request": "請求地圖",
				"request_made": "您的地圖請求已成功。請等區域僕人處理您的請求。",
				"return": "已做歸還",
				"unworked": "未做歸還"
			},
			"roles": {
				"0": "傳道員",
				"10": "進階",
				"30": "長老",
				"35": "監督",
				"40": "助手",
				"50": "管理員",
				"60": "翻譯員",
				"100": "系統管理員"
			},
			"permissions": {
				"reset": "重整權限",
				"low": "抱歉，您沒有權限在Territory Helper做此設定。",
				"changed": "如果您的權限在Territory Helper已經更新，請到區域設定重設您的權限。"
			}
		}
	},
	"today": {
		"title": "今日",
		"plugins": {
			"timer": "計時器",
			"media": "影片",
			"bookshelf": "書刊",
			"territories": "區域",
			"contacts": "需拜訪的人",
			"hours": "時數總結",
			"activity": "活動"
		},
		"settings": {
			"title": "今日設定",
			"plugins": "插件",
			"heading": "標題",
			"activity": "活動插件項目",
			"hours": "時數總結項目"
		}
	},
	"timer": {
		"stop": "關閉計時器",
		"start": "開啟計時器",
		"pause": "暫停計時器",
		"resume": "繼續定時",
		"confirm": {
			"more": "您至少需要報5分鐘的時數。",
			"message": "請問您要加%1$s (%2$s)到%3$s的活動嗎?",
			"ministry": "新增到傳道時數",
			"other": "新增到%1$s時數",
			"stop": "停止計時器",
			"done_ministry": "%1$s (%2$s)被新增到您的%3$s傳道時數",
			"done_other": "%1$s (%2$s)被新增到%3$s時數至%4$s."
		}
	},
	"library": {
		"title": "書庫"
	},
	"clipboard": {
		"cover": {
			"add": "新增頁面",
			"title": "您可以從書庫揀選圖檔或把您複製的圖檔貼上...",
			"choose": "選者圖檔",
			"clipboard": "使用剪貼板的圖",
			"zoom": "顯示頁面",
			"remove": "刪除頁面"
		},
		"paste": {
			"no_image_title": "沒有圖檔",
			"no_image_message": "剪貼板無圖檔。\n\n請在瀏覽器或其它APP上揀選圖檔，用長安來複製到剪貼板上。"
		}
	},
	"bookshelf": {
		"title": "書架",
		"publications": "書物",
		"hints": {
			"first_item": "請在工具欄按\"+\"來新增您的第一個%1$s",
			"add_item": "請在工具欄按\"+\"來新增%1$s",
			"no_recent": "隨著時數的過去最近的項目都會新增。請在工具欄選\"全部\"來讀取您的第一個項目。"
		},
		"default": {
			"description": "您可以使用工具欄上方的\"+\"按鈕來新增出版物到該類別。\n\n請問您要新增一些預設出版物嗎？ 您可以隨時編輯或刪除它們。",
			"confirm": "請問您想新增一些預設出版物到此類別嗎？系統會試著根據出版縮寫把重複的跳過。",
			"button": "新增預設%1$s"
		},
		"sections": {
			"magazines": "雜誌",
			"awake": "警醒!",
			"watchtower": "守望台",
			"books": "書刊",
			"brochures": "冊子",
			"tracts": "單張",
			"invites": "邀請函",
			"other": "其它"
		},
		"singular": {
			"magazines": "雜誌",
			"awake": "警醒!",
			"watchtower": "守望台",
			"watchtower_public": "守望台 (大眾)",
			"watchtower_study": "守望台 (研讀)",
			"watchtower_simplified": "守望台 (簡體)",
			"books": "書本",
			"brochures": "冊子",
			"tracts": "單張",
			"invites": "邀請函",
			"other": "書刊",
			"card": "名片",
			"letter": "書信",
			"link": "網址連結"
		},
		"form": {
			"new": "新增%1$s",
			"today": "新增到今日的畫面",
			"remove": "從今日畫面移除",
			"header": "書刊細節",
			"advanced": "進階細節",
			"abbr": "縮寫",
			"url": "網址(www)",
			"issue": "問題",
			"issue_number": "問題編號",
			"title": "標題",
			"locations": "下載位置",
			"pdf_url": "下載網址",
			"epub_url": "下載網址",
			"short_title": "短標題（建議）",
			"published": "出版年份",
			"count": "計為分發",
			"confirmTodayAdded": "此書刊已加入到今日畫面。",
			"confirmTodayRemoved": "此書刊已從今日畫面移除。",
			"confirmDelete": "您確定要刪除%1$s \"%2$s\"?\n\n這是無法返回！",
			"cannot_delete": "此書刊已有分發，所以不能刪除。\n\n您可以先用篩選功能來找到有發放的住戶而手動移除分發紀錄。",
			"tips": {
				"lookup": "此查詢按鈕只是個幫助者。它會儘量試著自動填寫書刊細節但常會有不完整或空白結果。您可能需要自己補寫一些書刊細節。",
				"no_image": "此按鈕不會再自動顯示書刊封面。您可以自行用【新增封面】功能。請看此網站的幫助瀾細節說明。",
				"abbr": {
					"books": "縮寫 (bh, lv ...)",
					"brochures": "縮寫 (fg, lc ...)",
					"tracts": "縮寫 (T-36, T-37 ...)"
				}
			},
			"errors": {
				"abbreviation": "所選語言中似乎沒有關於此出版物縮寫的任何詳細信息。 請嘗試不同的縮寫，或手動輸入出版物詳細信息。",
				"imported": "此出版物已轉入，未連結到您的ServicePlanner庫中的任何出版物。\n\n如果您想重整此列表，可以在您的探訪中重新新增刊物。"
			}
		}
	},
	"media": {
		"title": "媒體",
		"videos": "影片",
		"video": "影片",
		"default": {
			"description": "您可以使用工具欄上方的\"+\"按鈕來新增視頻到該類別。\n\n請問您要新增一些預設視頻嗎？ 這些可用於向住戶顯示的視頻報告上，而無需特定新增每個可用的視頻。您可以隨時編輯或刪除它們。",
			"confirm": "請問您想新增一些預設視頻到此類別嗎？系統會試著把重複的跳過。",
			"button": "新增預設視頻",
			"section": "視頻%1$s段"
		},
		"sections": {
			"ministry": "傳道",
			"study": "聖經研究",
			"children": "孩童",
			"whiteboard": "白板",
			"songs": "歌曲",
			"other": "其它"
		},
		"singular": {
			"videos": "影片",
			"ministry": "傳道影片",
			"study": "研究影片",
			"children": "孩童影片",
			"whiteboard": "白板動畫",
			"songs": "歌曲",
			"other": "影片"
		},
		"plural": {
			"videos": "影片",
			"ministry": "傳道影片",
			"study": "研究影片",
			"children": "孩童影片",
			"whiteboard": "白板動畫",
			"songs": "歌曲",
			"other": "影片"
		},
		"sizes": {
			"240": "240p",
			"360": "360p",
			"480": "480p",
			"720": "720p"
		},
		"form": {
			"new": "新增%1$s",
			"today": "新增至今日畫面",
			"remove": "從今日畫面刪除",
			"header": "影片細節",
			"downloaded_footer": "已下載影片不會跟Dropbox同步",
			"advanced": "進階細節",
			"duration": "期間",
			"locations": "影片地點",
			"website": "網址",
			"website_url": "網站URL",
			"broadcast_url": "廣播URL",
			"no_broadcast_url": "請輸入合法的廣播URL。請到tv.jw.org找到您要新增的影片，從地址欄複製到此欄位。",
			"online": "線上資源",
			"download_url": "下載URL",
			"download": "下載影片",
			"downloaded": "已下載%1$s",
			"title": "標題",
			"short_title": "短標題(建議)",
			"play": "播放%1$s",
			"stream": "播放%1$s",
			"confirm_today_added": "這影片已經新增到您今日的畫面。",
			"confirm_today_removed": "這影片已經從您今日的畫面移除。",
			"confirm_delete": "您確定要移除%1$s \"%2$s\"?\n\n這動作是無法返回！",
			"cannot_delete": "此影片已顯示給聯絡人，因此無法刪除。\n\n您可以使用篩選器找到看過此影片的聯絡人，然後先手動刪除此影片。",
			"no_videos": "您尚未為此影片定義任何位置。",
			"tips": {
				"lookup": "這個查找按鈕只是一個幫手。 它將嘗試幫助您填充影片詳細信息。 但是它可能會返回不完整或空的結果。 在這種情況下，您將需要手動輸入缺少的影片詳細信息。",
				"no_image": "此按鈕將不再插入影片的封面圖像。 您可以使用【新增封面】按鈕自己完成此操作。 有關詳細信息，請參閱網站的幫助部分。"
			},
			"errors": {
				"url": "它似乎不是所選語言的有效廣播網址。 請輸入有效的廣播網址或選擇其它語言，然後重試。 否則手動輸入影片詳細信息。",
				"imported": "此影片已轉入，未連結到您的ServicePlanner庫中的任何影片。\n\n如果您想重整此列表，可以在您的探訪中重新新增影片。"
			}
		}
	},
	"languages": {
		"single": "語言",
		"multiple": "語言",
		"available": "可用%1$s",
		"selected": "點選%1$s",
		"other": "其它%1$s",
		"search": "搜尋%1$s",
		"app": {
			"title": "語言",
			"hint": "用於按鈕和標籤",
			"restart": "請重新啟動應用程序以更改語言。"
		},
		"beta": {
			"title": "不完整的翻譯（測試版）",
			"hint": "如果想提供協助：support@serviceplanner.me"
		},
		"chinese": {
			"options": "中文選項",
			"characters": "僅字符",
			"pi": "拼音",
			"zhu": "注音",
			"lau": "Sidney Lau",
			"yale": "Yale",
			"twoline": "%1$s兩行",
			"oneline": "%1$s行"
		}
	},
	"websites": {
		"tasks": {
			"bookmark": "新增書籤",
			"video": "新增影片",
			"video_cat": "您要將此影片新增到哪個類別?",
			"briefcase": "新增至公文包",
			"safari": "從Safari開啟",
			"copy": "複製URL",
			"email": "電郵閱讀器"
		},
		"bookmarks": {
			"none": "沒有保存的書籤",
			"first": "提示：瀏覽到一個網站。然後您就可以使用工具欄按鈕將該網站新增為書籤。",
			"added": "已新增書籤"
		},
		"icon": {
			"add": "新增圖標",
			"title": "您可以從您的照片庫中選擇一個圖標或插入您已復製到剪貼板的圖像...",
			"zoom": "顯示圖標",
			"remove": "刪除圖標"
		},
		"browser": {
			"search": "搜尋或網址",
			"reader": "有阅读器",
			"2line": "有羅馬拼音",
			"video": "有影片"
		},
		"form": {
			"new": "新增%1$s",
			"today": "新增至今日畫面",
			"remove": "從今日畫面移除",
			"header": "網站細節",
			"footer": "網址擺放區: %Y (年), %m (月), %d (日)",
			"advanced": "進階細節",
			"share_link": "Share Link",
			"website": "網站",
			"website_url": "網址",
			"online": "線上資源",
			"title": "標題",
			"short_title": "短標題 (建議)",
			"confirm_today_added": "此網站已被加入至今日畫面。",
			"confirm_today_removed": "此網站已從今日畫面移除。",
			"confirm_delete": "您確定要移除%1$s\"%2$s\"?\n\n這是不能返回。",
			"errors": {
				"url": "這看來不是個合法網址。請再試一次。"
			}
		}
	},
	"activity": {
		"title": "活動",
		"current": "目前",
		"reports": "報告",
		"month": "月",
		"year": "年",
		"other": "其它",
		"manual": "手動",
		"auto": "自動",
		"planned": "計畫",
		"scheduled": "預定",
		"ministry": "傳道",
		"theocratic": "神制",
		"personal": "個人",
		"actual": "實際",
		"report": {
			"title": "%1$s報告",
			"send": "發送報告",
			"hours": "時間",
			"credits": "學分",
			"minutes": "%1$s分鐘",
			"hours_ministry": "傳道時數",
			"hours_other": "%1$s小時",
			"hours_under_planned": "達成目標剩%1$s",
			"hours_over_planned": "超過目標%1$s",
			"hours_progress": "%1$s小時，共%2$s小時",
			"hours_under": "低於%1$s",
			"hours_over": "高於%1$s",
			"hours_behind": "落後%1$s",
			"hours_ahead": "超前%1$s",
			"hours_ok": "在計畫內",
			"hours_met": "目標達成",
			"hours_projected": "預計%1$s",
			"hours_projected_short": "預計%1$s",
			"hours_reported": "實際%1$s",
			"hours_reported_short": "實際%1$s",
			"hours_total": "%1$s total",
			"hours_total_short": "%1$s T",
			"hours_show": "日曆上顯示時間",
			"hours_hide": "日曆上隱藏時間",
			"placements": "分發",
			"placements_show": "顯示發放書籍，影片，續訪",
			"placements_hide": "隱藏發放書籍，影片，續訪",
			"mileage": "里程",
			"videos": "影片",
			"visits": "續訪",
			"visits_all": "所有續訪",
			"studies": "研究",
			"studies_unique": "個別研究",
			"nothing": "沒有報告",
			"remove": "從報告移除"
		},
		"hours": {
			"target": "每月目標",
			"target_total": "目標綜合",
			"target_alert": "請設定此月的目標。這會覆寫預設每月目標。設定在【設定>時數表】",
			"carried_title": "結轉分鐘",
			"carried_label": "從上月",
			"planned": "預計時數",
			"planned_total": "綜合預計時數",
			"planned_ok": "=目標",
			"actual": "實際時數",
			"progress": "至今日綜合",
			"future": "未來計畫",
			"summary": "活動總結",
			"total": "總時數",
			"calculated": "統計",
			"projected": "預計時數",
			"reported": "填寫時數",
			"credits": {
				"add": "新增學分",
				"delete": "刪除學分",
				"singular": "學分",
				"plural": "學分",
				"reason": "原因",
				"hint": "例如：先驅訓練班",
				"hours": "學分時數",
				"confirmDelete": "您確定要刪除此學分時數?"
			},
			"footers": {
				"goals": "您可以覆蓋預設每月目標",
				"planned": {
					"over": "%1$s超過預計目標",
					"under": "%1$s預計達成目標",
					"ok": "預計時數 = 您的每月目標"
				},
				"actual": {
					"ahead": "到目前您已超越計畫%1$s",
					"behind": "到目前您還落後計畫%1$s",
					"ok": "您正在按照計劃的時數進行"
				},
				"projected": {
					"over": "您將比本月的目標提前%1$s",
					"under": "您將低於本月目標%1$s",
					"ok": "您有望實現本月的目標"
				},
				"projected_goal": {
					"over": "您比每月目標提前%1$s",
					"under": "您低於每月目標%1$s",
					"ok": "您已達成每月目標"
				},
				"projected_planned": {
					"over": "您將比計劃時數提前%1$s",
					"under": "您將比計劃時數少%1$s",
					"ok": "您將實現計劃的時數"
				}
			}
		},
		"notes": {
			"none": {
				"title": "沒有可顯示的註釋",
				"description": "此列表將顯示當月及以後的所有註釋。"
			}
		},
		"service_year": {
			"summary": "%1$s服務年度報告"
		},
		"send": {
			"greeting": "%1$s您好，",
			"intro": "這是我%1$s的傳道報告：",
			"carried": "%1$s分鐘已新增到下個月的報告(km 9/88 3)",
			"credit_hours": {
				"included_hours": "此報告為了%2$s已含%1$s小時。",
				"comment_only": "請注意有%1$s小時是為了%2$s。"
			},
			"other_hours": {
				"included_hours": "此報告是包含%1$s%2$s。",
				"adjusted_hours": "報告的時間包括%1$s%2$s的一些學分。",
				"comment_only": "請留意%1$s%2$s。"
			}
		},
		"schedule": {
			"daily_apply": "使用每日時數表",
			"daily_confirm": "這將循環遍歷%1$s 中的每一天，並將您的每日目標覆蓋到【計劃時數】列。",
			"recalc_apply": "重新計算報告總計",
			"recalc_confirm": "這將遍歷%1$s 中的每一天並重新計算該月的報告總數。"
		},
		"alerts": {
			"manual_ttl": "獨自發放",
			"manual_msg": "這些獨自發放並不與聯絡人或探訪連結。",
			"videos_ttl": "播放影片",
			"videos_ttl_manual": "獨自播放影片",
			"videos_msg": "這些獨自播放影片並不與聯絡人或探訪連結。"
		}
	},
	"settings": {
		"title": "設定",
		"dropbox": {
			"title": "Dropbox同步",
			"connect": "連結至Dropbox",
			"connect_footer": "連接到Dropbox以自動備份您的資料或在多台設備之間同步。\n如果您沒有Dropbox帳戶，您可以自行建立一個免費帳戶。",
			"disconnect": "登出Dropbox",
			"confirm_disconnect": "您確定要登出Dropbox並停止同步您的資料嗎？",
			"last_sync": "上次同步:%1$s",
			"sync_options": "同步選項",
			"auto_sync": "自動同步",
			"wifi_only": "將自動同步限制為Wifi",
			"sync_now": "立即同步所有資料",
			"sync_complete": "同步完成",
			"syncing": "正在同步...",
			"account": {
				"details": "連結帳戶",
				"name": "名稱",
				"email": "電郵"
			}
		},
		"backup": {
			"title": "手動備份",
			"button": "立即備份資料",
			"last": "最近備份:%1$s",
			"footer": "通過電郵發送您的應用程序資料的備份",
			"confirm": {
				"title": "產生備份",
				"progress": "正在產生備份 ...",
				"message": "這將生成一個壓縮檔案。 您可以選擇保存檔案的位置/方式。\n\n生成備份檔案可能需要幾秒鐘。"
			},
			"reminder": {
				"enable": "啟用備份提醒",
				"7day": "每7日",
				"14day": "每14日",
				"30day": "每30日",
				"60day": "每60日",
				"alert": {
					"title": "備份提醒",
					"message": "備份資料的時間到了。 您現在要產生備份嗎？\n\n您可以在設定那裡調整備份提醒。"
				}
			},
			"restore": {
				"title": "還原備份",
				"progress": "正在還原備份...",
				"restored": "數據恢復",
				"confirm": "您確定要還原壓縮檔案中的資料嗎？\n\n這將覆蓋此ServicePlanner中目前的所有資料。",
				"complete": "您的資料已成功還原。\n\n某些還原的內容可能僅在ServicePlanner重新啟動後才會顯示。",
				"blocked": "壓縮檔案有問題。\n\n還原被取消，並且在此Service Planner任何資料都無更改。",
				"cancelled": "還原被取消，並且在此Service Planner任何資料都無更改。"
			}
		},
		"appearance": {
			"title": "外貌",
			"color": "主題色"
		},
		"workflow": {
			"title": "工作流程",
			"next_visit": "離下次探訪的天數",
			"turn_orange": "日直到橘色",
			"turn_red": "日直到紅色",
			"turn_blood": "日直到深紅色",
			"default_visit_type": "預設探訪類型",
			"visit_time": "使用預定時間",
			"hints": {
				"overview": "當您向聯絡人新增探訪時，工作流會控制什麼會發生。\n\n每個聯絡人類型都有自己的流程規則。 例如，如果您將新增探訪到聯絡人類型\"聖經研究\"，那麼您會希望探訪類型預設為\"續訪\"。 並且您也會希望下一次探訪自動安排在未來 X 天后。\n\n通常下一次探訪的時間預設為您當前新增的探訪時間，邏輯上假設您今天這個時間成功聯繫了以下人員，下次會用同樣時間做探訪。 但是，您可以指定工作流改用上次的“計劃時間”——意思是使用計劃時間，而不是記錄探訪時間。 這對於固定每週同個時間的聖經研究會比較方便。\n\n“離..還有多少天”選項可以讓您控制幾天前日期指示和標籤改變顏色。\n\n鼓勵您試試自定規則以配您的個人工作流程！ 您現在甚至可以單擊聯絡人類型並對其重命名。",
				"visit_time": "預設為現在時間",
				"next_visit": "該數字將用於自動定義下次探訪日期。",
				"change_color": "天數從上次探訪日期開始計算。",
				"default_visit_type": "新增探訪時，它將預設為此探訪類型。",
				"restart": "在您重新啟動應用程序之前，更改此設置可能不會生效。"
			}
		},
		"partners": {
			"title": "夥伴",
			"event": {
				"calendar": "預設日曆",
				"event": "日曆事件",
				"event_footer": "僅適用於第一個同伴",
				"auto_add": "自動新增到日曆",
				"tentative_title": "事件標題 - 暫定",
				"tentative_event": "跟%n一起傳道?",
				"confirmed_title": "事件標題 - 確定",
				"confirmed_event": "跟%n一起傳道",
				"footer": "%n = 夥伴名稱"
			},
			"name": {
				"title": "夥伴名稱",
				"full": "全名",
				"first": "名"
			}
		},
		"schedule": {
			"title": "時數表",
			"form": {
				"annual_goal": "每年目標",
				"monthly_goal": "每月目標",
				"daily_goals": "每日目標",
				"daily_footer": "從“活動”屏幕上的“...”選項將計劃應用於月份時，重置為空白 (—) 以跳過日期。"
			}
		},
		"reporting": {
			"title": "報告",
			"overseer": {
				"send_to": "送給",
				"name": "名稱",
				"mobile": "手機",
				"email": "電郵"
			},
			"apps": {
				"method": "報告發送使用",
				"not_installed": "看來%1$s沒有安裝在此設備上。請使用其它方法。"
			},
			"calendar": {
				"title": "一週開始日"
			},
			"hours": {
				"time": {
					"title": "報告時數以",
					"tick": "參與了傳道工作",
					"hours": "整小時(預設)",
					"minutes": "15種增量",
					"footer": "以特殊安排"
				},
				"other": {
					"title": "其它時數",
					"enable": "啟動其它時數",
					"label": "標籤為",
					"one_word": "請把標籤設為單個字。",
					"options": {
						"title": "其它時數類別",
						"include_hours": "包含在活動時數",
						"include_report": "包含在報告時數",
						"include_comment": "包含在報告註解",
						"include_breakdown": "顯示時數分析",
						"maximum_hours": "最大其它時數",
						"footer": "如果每月總數超過最大值，其他時數將減少。"
					}
				},
				"alerts": {
					"format_prompt_title": "選者報告格式",
					"format_prompt_message": "您想填寫傳道時間（如果您是先驅）還是只填寫您有參與某些形式的傳道活動？\n\n您可以隨時在“設定”>“報告”中更改預設設定。\n\n在「活動」畫面上，您可以變更特定月份的報告格式。 您也可以選擇在日曆上顯示或隱藏您的時間（請參閱上部/右側選單選項）。",
					"format_tick": "顯示有參與傳道活動 ✓",
					"format_hours": "顯示傳道時間",
					"month_switch_title": "切換報告格式",
					"month_switch_hours": "您想切換為報告本月的完整小時數嗎？\n\n注意：這不會影響從上部/右側選單控制的日曆上顯示的小時數。",
					"month_switch_tick": "您想切換到僅表明您本月有參與傳道活動 - 即不分享您的時間嗎？\n\n注意：這不會影響從上部/右側菜單控制的日曆上顯示的時間。"
				}
			},
			"mileage": {
				"title": "里程記錄",
				"enable": "啟用里程記錄",
				"units_fuel": "單位-燃油",
				"units_distance": "單位-距離"
			},
			"options": {
				"title": "其它選項",
				"notes": "在報告中包含註釋",
				"zero": "包括零值",
				"footer": "可選擇隱藏報告行是0。時數都會顯示。"
			},
			"comment": {
				"title": "報告結尾",
				"footer": "例如：謝謝您的服務，「簽名」"
			}
		},
		"ministry": {
			"title": "傳道"
		},
		"social": {
			"website": "網站",
			"facebook": "臉書",
			"twitter": "推特"
		},
		"help": {
			"title": "支援和幫助"
		},
		"issues": {
			"title": "問題追踪"
		},
		"maps": {
			"title": "地址",
			"open_in": "位置開啟在...",
			"contacts": {
				"title": "查看聯絡人地址",
				"reformat": "重新編排地址",
				"locality": "自動填寫地區",
				"footer": "地區等於郊區或鄰里。"
			},
			"address": {
				"title": "地址格式",
				"street": "街道地址",
				"no_city": "街道地址，郊區",
				"no_country": "街道地址，郊區，城市",
				"full": "街道地址，郊區，城市，國家",
				"footer": "街道地址包含數字。城市通常包含郵遞區號."
			},
			"locality": {
				"title": "地區格式",
				"suburb": "郊區或鄰里",
				"postcode_city": "郵遞區號 城市",
				"city_postcode": "城市 郵遞區號",
				"footer": "地區用於把聯絡人分組在某塊區。"
			},
			"restrictions": {
				"title": "反向地理編碼",
				"country": "將地址結果限制為%1$s"
			}
		},
		"timer": {
			"title": "計時器",
			"enable": "啟用計時器",
			"rounding": {
				"title": "5分鐘間隔",
				"down": "總是進位",
				"nearest": "四捨五入",
				"footer": "決定將13分鐘記錄為10分鐘還是15分鐘。"
			},
			"seconds": {
				"title": "秒",
				"hide": "超過00:00:59隱藏",
				"always": "總是顯示秒數",
				"footer": "隱藏秒數可以減少分心。"
			},
			"badge": {
				"label": "使用應用程序徽章",
				"footer": "如果計時器正在運行，則顯示\"1\""
			},
			"color": {
				"title": "計時器運行顏色",
				"slate_gray": "石板灰",
				"light_blue": "淺藍",
				"dark_blue": "深藍",
				"light_green": "淺綠",
				"dark_green": "深綠"
			},
			"logs": {
				"title": "日誌",
				"none": "尚未有紀錄。",
				"alert": "刪除計時器日誌紀錄不會更改您的活動或報告的時數。",
				"footer": "只會保留最近的30個紀錄。 計時器設置和日誌紀錄不會跨設備同步。"
			}
		},
		"debug": {
			"title": "回報工具",
			"device": "設備信息",
			"memory": "可用記憶體",
			"network": "網絡類型",
			"email": {
				"title": "發送調試數據",
				"footer": "除非為了協助解決您的問題我有特地請您這樣做，請不要發送此電郵。",
				"message": "不要嘗試將此檔案用於任何用途-只需將其通過電郵發送至%1$s。",
				"button": "發送電郵"
			}
		},
		"beta": {
			"title": "測試人員",
			"gitlab": {
				"title": "測試追踪器",
				"button": "測試人員問題追踪",
				"footer": "用於測試版的錯誤報告和反饋。 請建立一個免費GitLab帳戶並將您的Email發送給我來獲取權限。"
			},
			"report": {
				"title": "提交新問題",
				"email": "您的GitLab Email(選修)",
				"button": "反馈意见",
				"footer": "從GitLab問題跟踪器上的問題列表底部獲取您的個人Email。"
			}
		},
		"appstore": {
			"title": "App Store"
		},
		"tags": {
			"edit": "更改標籤名稱",
			"delete": {
				"title": "刪除標籤",
				"warning": "此標籤\"%1$s\"會從所有聯絡人上移除。\n\n您確定嗎?"
			}
		},
		"notifications": {
			"title": "通知",
			"sync": "通知設定不會在不同設備上同步",
			"report": {
				"title": "報告提醒",
				"last": "每月底",
				"first": "每月初",
				"notification": {
					"message": "要提交傳道報告了嗎?"
				}
			},
			"visits": {
				"title": "探訪提醒",
				"tomorrow": "前一日晚上",
				"today": "當日早上",
				"notification": {
					"message": "您有在%3$s%1$s%2$s的安排。"
				}
			},
			"partner": {
				"title": "傳道夥伴",
				"tomorrow": "前一日晚上",
				"today": "當日早上",
				"notification": {
					"message": "您正在與%1$s%2$s工作。",
					"join_middle": ",",
					"join_last": "和"
				}
			}
		},
		"gdpr": {
			"title": "GDPR合規性",
			"footer": "禁用聯絡人屏幕和數據",
			"alert": "此模式強制英國和歐盟的用戶遵守 GDPR。\n\n1) 它將禁用\"今日\"屏幕上的\"呼叫\"選項卡和\"聯絡人\"部分。\n\n2)任何現有探訪都將永久刪除。",
			"notice": "在世界某些地區，用戶需要遵守通用數據保護條例（GDPR）。這意味著不可收集聯絡人的數據。\n\n如果您受到您所在國家/地區的 GDPR 影響，請進入\"設置\"並啟用\"GDPR Compliance\" 模式。\n\n對此有任何疑問，請詢問您當地的長老或查看網站。",
			"important": "重要通知",
			"understand": "我明白"
		}
	}
}