{
	"common": {
		"format": "Format",
		"notnow": "Inte Nu",
		"more": "Mer",
		"outline": "Kontur",
		"bible": "Bibel",
		"reset": "Återställ",
		"error": "Fel",
		"new": "Ny",
		"verse": "Vers",
		"note": "Anteckning",
		"annotate": "Kommentera",
		"annotations": "Kommentarer",
		"cancel": "Avbryt",
		"ok": "OK",
		"yes": "Yes",
		"no": "No",
		"other": "Annan",
		"done": "Klar",
		"top": "Topp",
		"edit": "Redigera",
		"add": "Lägg till",
		"save": "Spara",
		"delete": "Radera",
		"remove": "Ta bort",
		"search": "Sök",
		"options": "Inställningar",
		"chapter": "Kapitel",
		"article": "Artikel",
		"title": "Titel",
		"image_viewer": "Bildvisare",
		"reference": "Referens",
		"topic": "Ämne",
		"heading": "Rubrik",
		"reloading": "Laddar om",
		"loading": "Laddar",
		"settings": "Inställningar",
		"confirm": "Godkänn",
		"forums": "Forum",
		"history": "Historik",
		"historyclear": "Rensa Historik",
		"historyconfirm": "Det här kommer att radera alla objekt under historik. Är du säker på att du vill göra det?",
		"subheadings": "Underrubriker",
		"copied": "Kopierat till Urklippet",
		"page": "Sida",
		"pages": "Sidor",
		"paragraphs": "Par.",
		"footnote": "Fotnot",
		"about": "Om",
		"news": "Nyheter",
		"general": "Allmänt",
		"word_search": "Sök efter ett ord",
		"tip": "Tips",
		"recent": "Nyligen",
		"recently_opened": "Nyligen öppnad",
		"frontcover": "Framsida",
		"reorder": "Ordna om",
		"order": "Ordning",
		"favourites": "Favoriter",
		"favouritesave": "Spara som Favorit",
		"websites": "Webbsidor",
		"contents": "Innehåll",
		"clearcache": "Rensa Cache",
		"size": "Storlek",
		"height": "Höjd",
		"width": "Bredd",
		"small": "Liten",
		"default": "Standard",
		"medium": "Medium",
		"large": "Stor",
		"larger": "Större",
		"largest": "Störst",
		"fullscreen": "Fullskärm",
		"home": "Hem",
		"back": "Tillbaka",
		"forward": "Framåt",
		"toggle2lines": "Byt 2 Rader",
		"list": "Lista",
		"grid": "Rutnät",
		"map": "Karta",
		"hybrid": "Hybrid",
		"choose": "Välj",
		"selectall": "Markera Alla",
		"online": "Online",
		"file": "Fil",
		"layout": "Ändra Layout",
		"never": "Aldrig",
		"sync": "Synk",
		"syncing": "Synkar",
		"current": "Aktuell",
		"saved": "Sparad",
		"active": "Aktiv",
		"alert": "Varning",
		"warning": "Varning",
		"important": "Viktigt",
		"acknowledge": "OK",
		"any": "Några",
		"none": "Inga",
		"enable": "Aktivera",
		"enabled": "Aktiverad",
		"disable": "Avaktivera",
		"disabled": "Avaktiverad",
		"update": "Updatera",
		"modify": "Modifiera",
		"created": "Skapad",
		"overdue": "Försenad",
		"cannot": "Kan inte fortsätta",
		"all": "Alla",
		"website": "Webbsida",
		"epub": "EPUB",
		"pdf": "PDF",
		"open_prompt": "Öppna %1$s",
		"view_prompt": "Visa %1$s",
		"download_prompt": "Ladda ner %1$s",
		"details": "Detaljer",
		"stop": "Stopp",
		"start": "Starta",
		"custom": "Annat",
		"summary": "Sammanfattning",
		"please_note": "Notera",
		"when": "När",
		"bookmarks": "Bokmärken",
		"bookmark": "Bokmärk",
		"territory": "Område",
		"territories": "Områden",
		"congregation": "Församling",
		"show_prompt": "Visa %1$s",
		"hide_prompt": "Dölj %1$s",
		"delete_prompt": "Radera %1$s",
		"remove_prompt": "Ta bort %1$s",
		"open_in_prompt": "Öppna i %1$s",
		"open_item_in_prompt": "Öppna %1$s i %2$s",
		"edit_in_prompt": "Redigera i %1$s",
		"view_in_prompt": "Visa i %1$s",
		"download_from_prompt": "Ladda ner från %1$s",
		"sync_prompt": "Synka med %1$s",
		"syncing_prompt": "Synkar med %1$s",
		"notes": "Anteckningar",
		"read_only": "Enbart Läsbart",
		"editable": "Redigerbar",
		"required": "Nödvändig",
		"unknown": "Okänd",
		"confirmed": "Bekräftad",
		"calendar": "Kalender",
		"end": "Sluta",
		"ahead": "Framför",
		"behind": "Bakom"
	},
	"time": {
		"tomorrow": "Imorgon",
		"today": "Idag",
		"yesterday": "Igår",
		"earlier_this_week": "Tidigare den här veckan",
		"next_week": "Next Week",
		"this_week": "Den här veckan",
		"last_week": "Förra veckan",
		"next_month": "Next Month",
		"this_month": "Den här månaden",
		"last_month": "Förra månaden",
		"older": "Äldre",
		"newer": "Nyare",
		"next_year": "Next Year",
		"this_year": "Det här året",
		"last_year": "Förra året",
		"on_or_before": "Den %1$s eller tidigare datum",
		"over_years_ago": "Over %1$s years ago",
		"over_year_ago": "Over 1 year ago",
		"over_months_ago": "Över %1$s månader sedan",
		"over_month_ago": "Över 1 månad sedan",
		"over_weeks_ago": "Över %1$s veckor sedan",
		"over_week_ago": "Över 1 vecka sedan",
		"over_days_ago": "Över %1$s dagar sedan",
		"within_days": "Inom de senaste %1$s dagarna",
		"within_next_days": "Within the next %1$s days",
		"over_days_away": "Over %1$s days away",
		"over_week_away": "Over 1 week away",
		"over_weeks_away": "Over %1$s weeks away",
		"over_month_away": "Over 1 month away",
		"over_months_away": "Over %1$s months away",
		"over_year_away": "Over 1 year away",
		"over_years_away": "Over %1$s years away",
		"future": "Future",
		"day": "Dag",
		"week": "Vecka",
		"month": "Månad",
		"year": "År",
		"hours": "timmar",
		"hour": "timme",
		"minutes": "minuter",
		"date": "Datum",
		"date_added": "Date Added",
		"date_created": "Date Created",
		"date_updated": "Date Updated",
		"date_picker": "Datumväljare",
		"time": "Tid",
		"time_picker": "Tidsväljare",
		"format": {
			"time": {
				"standard": "G:i",
				"full": "G:i:s"
			},
			"date": {
				"day": "l",
				"year": "Y",
				"full": "d/m/Y",
				"full_short": "d/m/y",
				"day_date_suffix": "l jS",
				"day_date_month": "D d/m",
				"day_month_date": "l, j F",
				"day_month_date_year": "l, j F Y",
				"month_year": "F Y",
				"date_month": "d/m",
				"date_month_year": "j F Y",
				"picker": "D j M"
			},
			"datetime": {
				"long": "d/m/Y G:i:s",
				"full": "l, j F Y, G:i",
				"month": "l j F, G:i",
				"month_short": "d/m F G:i",
				"day_date_month_time": "D d/m \\a\\t G:i"
			}
		},
		"abbreviations": {
			"hours_minutes": "TT:MM",
			"minutes_seconds": "MM:SS",
			"mins": "min",
			"am": "am",
			"pm": "pm",
			"st": "a",
			"nd": "a",
			"rd": "e",
			"th": "e"
		},
		"days": {
			"long": {
				"sunday": "Söndag",
				"monday": "Måndag",
				"tuesday": "Tisdag",
				"wednesday": "Onsdag",
				"thursday": "Torsdag",
				"friday": "Fredag",
				"saturday": "Lördag"
			},
			"short": {
				"sun": "Sön",
				"mon": "Mån",
				"tue": "Tis",
				"wed": "Ons",
				"thu": "Tor",
				"fri": "Fre",
				"sat": "Lör"
			}
		},
		"months": {
			"long": {
				"january": "Januari",
				"february": "Februari",
				"march": "Mars",
				"april": "April",
				"may": "Maj",
				"june": "Juni",
				"july": "Juli",
				"august": "Augusti",
				"september": "September",
				"october": "Oktober",
				"november": "November",
				"december": "December"
			},
			"short": {
				"jan": "Jan",
				"feb": "Feb",
				"mar": "Mar",
				"apr": "Apr",
				"may": "Maj",
				"jun": "Jun",
				"jul": "Jul",
				"aug": "Aug",
				"sep": "Sep",
				"oct": "Okt",
				"nov": "Nov",
				"dec": "Dec"
			}
		}
	},
	"measurement": {
		"long": {
			"km": "KM",
			"mi": "Engelsk Mil",
			"gal": "Gallon",
			"L": "Liter"
		}
	},
	"titles": {
		"mr": "Herr",
		"mrs": "Fru",
		"miss": "Fröken",
		"ms": "Ms",
		"dr": "Doktor"
	},
	"email": {
		"feedback": "Skicka Feedback",
		"standard": "E-post Standard Format",
		"send": "Skicka E-post",
		"confirm": "Var god kolla om din fråga, ditt problem eller din idé inte redan är behandlad i Nyheter eller Användarforumen.",
		"english": "All support ges på Engelska så ha tålamod med mig",
		"import": "Importera till %1$s",
		"footer": "E-post genererat av %1$s"
	},
	"forms": {
		"validation": {
			"alert_title": "Ogiltig",
			"alert_message": "Fixa följande...",
			"missing_value": "\"%1$s\" måste ha ett värde",
			"url": "Lägg till en giltig URL som börjar med http:// eller https://"
		}
	},
	"search": {
		"placeholder": "Sök %1$s",
		"searching": "Söker",
		"nothing": "Inga matchande objekt hittades"
	},
	"browser": {
		"reload": "Ladda om sida",
		"open": "Open Browser",
		"safari": "Öppna i Safari",
		"clipboard": "Kopiera Länk till Urklippet",
		"email": "E-posta Länk till den här sidan"
	},
	"apps": {
		"email": "E-post",
		"sms": "Textmeddelande",
		"telegram": "Telegram",
		"whatsapp": "WhatsApp",
		"wechat": "WeChat",
		"viber": "Viber",
		"line": "LINE",
		"hourglass": "Hourglass",
		"nwpublisher": "NW Publisher",
		"dropbox": "Dropbox",
		"th": "Territory Helper",
		"tasks": {
			"alert": "%1$s Varning",
			"error": "%1$s Fel",
			"account": "%1$s Konto",
			"connect": "Anslut till %1$s",
			"sign_in": "Logga in",
			"sign_into": "Logga in till %1$s",
			"permissions": "Ladda om Behörigheter",
			"register": "Registrera med %1$s",
			"registering": "Registrerar med %1$s",
			"errors": {
				"duplicate": "En %1$s synkning är aktiv. Vänta tills synkningen är klar och försök igen.",
				"registering": "Kan inte registrera med %1$s.\n\nFörsök igen senare eller maila %2$s så att jag kan verifiera om %3$s APIn fungerar som den ska.\n\nUrsäkta för besväret.",
				"expired": "Ditt inlogg till %1$s har gått ut. Logga in igen för att ladda om dina behörigheter.",
				"something": "Ojdå, något gick snett.\n\nDu kanske inte hade rätt behörighet att utföra handlingen. %1$s är kanske offline eller upplever störningar.\n\nKolla upp om något är fel och försök igen, eller rapportera felet.",
				"disconnected": "Du har blivit av med anslutningen till %1$s. Öppna inställningar och anslut igen."
			}
		}
	},
	"alerts": {
		"phone": {
			"title": "Telefonsamtal",
			"confirm": "Vill du verkligen ringa\n%1$s?"
		},
		"sms": {
			"title": "Meddelande",
			"confirm": "Är du säker på att du vill skicka ett meddelande till %1$s?",
			"cannot": "Den här enheten kan inte skicka SMS meddelanden."
		},
		"ziperror": "Följande fil: \"%1$s\" är inte giltig. Förmodligen hände något när filen laddades ner - försök ladda ner filen igen.\n\nFilen kommer att raderas.",
		"import": {
			"failed": "Ursäkta, något gick fel vid importen av data. Inget blev importerat."
		},
		"noemail": "E-post verkar inte stödjas av din enhet. Har du konfigurerat dina iOS E-postinställningar?",
		"restart": "Starta om %1$s för att inställningarna ska börja gälla.",
		"yousure": "Är du säker på att du vill göra det här?",
		"internet": {
			"cannot": "Kan inte ansluta till Internet",
			"tryagain": "Var god anslut och försök igen",
			"offline": "Du är för närvarande inte online. Var god anslut till Internet och försök igen."
		},
		"permissions": {
			"calendar": "Jag kommer inte åt din enhets kalendrar. Var god kolla upp behörigheter i Inställningar > Integritet > Kalendrar."
		},
		"tables": {
			"pulldown": "Dra neråt för att uppdatera...",
			"release": "Släpp för att uppdatera...",
			"loading": "Laddar flödes-data"
		}
	},
	"calls": {
		"title": "Besök",
		"today_none": "Inga besök planerade idag",
		"date_none": "Inga besök planerade den %1$s",
		"today_hint": "Ändra ett besöks Nästa Besöksdatum för att se det här",
		"actions": {
			"first": "Lägg till ditt första Besök",
			"another": "Lägg till nytt Besök",
			"new": "Nytt Besök",
			"verifying": "Verifierar Besök",
			"delete": "Radera Besök",
			"share": "Dela Besök"
		},
		"types": {
			"first_call": "Förstabesök",
			"return_visit": "Återbesök",
			"magazine_route": "Tidningsrutt",
			"top_priority": "Högsta Prioritet",
			"bible_study": "Bibelstudie",
			"custom": "Custom Type",
			"inactive": "Inaktiv"
		},
		"types_abbreviated": {
			"first_call": "FB",
			"return_visit": "ÅB",
			"magazine_route": "TR",
			"top_priority": "HP",
			"bible_study": "BS",
			"custom": "CT",
			"inactive": "I"
		}
	},
	"contacts": {
		"title": "Kontakter",
		"contact": "Kontakt",
		"selected": "%1$s Valt",
		"name": "Namn",
		"phone": "Telefon",
		"email": "E-post",
		"link": "Link",
		"actions": {
			"first": "Lägg till din första kontakt",
			"another": "Lägg till ny kontakt",
			"first_hint": "Tryck på + knappen topp/höger...",
			"add": "Lägg till kontakt",
			"new": "Ny kontakt",
			"import": "Importera från Enhetens Kontakter",
			"verifying": "Verifierar Kontakter",
			"filter": "Filtrera Kontakter",
			"edit": "Redigera Kontakt",
			"delete": "Radera Kontakt",
			"deleted": "Raderad Kontakt",
			"message": "Skicka Meddelande",
			"share": "Dela Kontakt",
			"search": "Sök bland Kontakter",
			"search_hint": "Sök efter Namn eller Adress"
		},
		"shared": {
			"subject": "Kontakt delad från ServicePlanner",
			"intro": "Den här kontakten har blivit delad med dig från <a href=\"https://serviceplanner.me\">ServicePlanner</a>. Om du också använder ServicePlanner så kan du importera den här kontakten genom att öppna bilagan i mailet.",
			"email": "Sammanfattning E-post",
			"file": "Dela Fil",
			"choose": "Hur vill du dela den här kontakten?",
			"import": {
				"confirm": "Är du säker på att du vill importera den här kontakten?\n\nOm kontakten redan finns, så kommer den skrivas över av den importerade kontakten. Inga ändringar görs i din Aktivitet eller i din Rapport vid lyckad import."
			}
		},
		"headings": {
			"details": "Kontaktdetaljer",
			"profile": "Profil",
			"this_visit": "Detta Besök",
			"last_visit": "Förra Besöket",
			"next_visit": "Nästa Besök",
			"next_visit_day": "Besöksdag",
			"next_visit_on": "Nästa Besök %1$s"
		},
		"filters": {
			"save": "Spara Nuvarande Filterinställningar",
			"overwrite": "Overwrite Using Current Filter Settings",
			"header_include": "Inkludera",
			"footer_include": "Kontakterna som ska inkluderas i listan",
			"header_exclude": "Exkludera",
			"footer_exclude": "Kontakter att exkludera från listan",
			"include_before": "Inkludera Tidigare Datum ",
			"types": "Typer",
			"all": "Alla Kontakter",
			"default": {
				"bylocality": "Kontakter Via Locality",
				"bylocality_desc": "Grupperade via Locality och sorterade efter Nästa Besöksdatum",
				"bytype": "Kontakter Via Typ",
				"bytype_desc": "Grupperade via Typ och sorterade efter Nästa Besöksdatum",
				"inactive": "Inaktiva Kontakter",
				"inactive_desc": "Grupperade och sorterade efter Senaste Besöksdatum, äldsta först",
				"overdue": "Försenade Kontakter",
				"overdue_desc": "Grupperade och sorterade efter Senaste Besöksdatum, äldsta först"
			},
			"sorting": {
				"sort_by": "Sortera Efter",
				"sort_field": "Fält",
				"sort_value": "Värde",
				"sort_group_by": "Sortera inom Grupp Efter",
				"primary": "Primär Sortering",
				"secondary": "Sekundär Sortering",
				"order": "Sorteringsordning",
				"ascending": "Stigande",
				"descending": "Sjunkande",
				"asc": "UPP",
				"desc": "NED",
				"footer": "Ordna de listade kontakterna",
				"footer_grouped": "Ordna Kontakterna inom gruppen",
				"last_visit": "Senaste Besöksdatum",
				"next_visit": "Nästa Besöksdatum"
			},
			"saved": {
				"saved": "Sparade Filter",
				"default": "Standardfilter",
				"other": "Andra Filter",
				"name": "Filternamn",
				"description": "Filterbeskrivning",
				"delete": "Radera Filter",
				"delete_confirm": "Är du säker på att du vill radera det här filtret?",
				"reorder": "Ordna om Filter",
				"reorder_save": "Spara Filterordningen",
				"reset": "Återställ Filter",
				"reset_confirm": "Det här kommer ta bort dina egna sparade filter och återställa dina filter till standardfiltrena.\n\nÄr du säker på att du vill göra detta?",
				"footer": "Swipa för att redigera eller radera ett filter. Använd verktygsmenyn för att ändra ordningen. Filtret som är längst upp är alltid standardfiltret."
			},
			"grouping": {
				"group_by": "Gruppera Efter",
				"turn_off": "Stäng av Gruppering",
				"disabled": "Gruppering är Avstängd",
				"footer": "Grupperade kontakter under sektionsrubriker"
			},
			"alerts": {
				"no_types": "Var god välj minst en Kontakttyp",
				"no_matches": "Inga matchande kontakter",
				"no_matches_hint": "Var god ändra dina Filterinställningar",
				"apply_today_filter": "Det här kommer att ändra det nuvarande filtret så att det visar \"Alla Kontakter\" med \"Nästa Besöksdatum\" inställt på %1$s.",
				"apply_on_or_before_filter": "Det här kommer att ändra det nuvarande filtret så att det visar \"Alla Kontakter\" med \"Nästa Besöksdatum\" den %1$s eller innan."
			}
		},
		"type": "Typ",
		"language": "Språk",
		"tags": "Taggar",
		"tag": "Taggnamn",
		"placed": "Placerat",
		"placed_qty": "Antal Placerat",
		"no_placements": "Du har inte placerat något än",
		"no_videos": "Du har inte visat några videor än",
		"shown": "Antal Videor du Visat",
		"shown_qty": "Totalt antal Visningar",
		"videos": "Videor",
		"visits": {
			"title": "Besök",
			"visit": "Besök",
			"type": "Visit Type",
			"by_type": "Besök Efter Typ",
			"plans": "Planer",
			"details": "Besökdetaljer",
			"next": "Nästa Schemalagda Besök",
			"previous": "Föregående Besök",
			"no_placements": "Inga placeringar eller videor visade",
			"days_since": "Dagar sen senaste besök",
			"days_until": "Dagar till nästa besök",
			"days_overdue": "Dagar för sent",
			"actions": {
				"first": "Lägg till ditt första besök",
				"first_hint": "Klicka på + knappen topp/vänster...",
				"new": "Nytt Besök",
				"new_on": "Nytt Besök %1$s",
				"edit": "Redigera Besök",
				"view": "Föregående Besök",
				"remind": "Skicka Påminnelse",
				"delete": "Radera Besök",
				"confirmDelete": "Är du säker på att du vill radera det här besöket? Detta kommer också att radera besöket och alla placeringar från rapporter.",
				"manual": "Lägg bara till ett värde här för att lägga till historisk rapportdata. Logga annars dina besök mot varje Kontakt.",
				"plans": {
					"previous": "Föregående Planer",
					"insert_this": "Lägg till det här i det här Besökets Anteckningar",
					"insert_next": "Lägg till i Nästa Besöks planer"
				}
			},
			"types": {
				"not_home": "Inte Hemma",
				"secular": "Secular"
			}
		},
		"alerts": {
			"calculated": "Det här värdet räknas automatiskt ut från Besöken du gör.",
			"inactive": "Ändra till Inaktiv",
			"permanent": "Radera Permanent",
			"confirmDelete": "Vill du ändra Kontakttypen för %1$s till \"Inaktiv\"? Eller vill du hellre radera dem permanent?\n\nNotera: Radering av en kontakt tar inte bort deras besök eller placeringar från Rapporter (du kan göra det här genom att radera varje individuellt besök först).",
			"confirmDeleteSelected": "Är du säker på att du vill radera de %1$s kontakter som är valda?\n\nEller vill du hellre ändra deras typ till \"Inaktiv\" istället?",
			"confirmDate": "Ange Nästa Besöksdatum för %1$s valda kontakter till:"
		},
		"pickers": {
			"type": "Kontakttyp",
			"type_hint": "You can rename these types in Settings > Workflow",
			"tags": "Välj Taggar",
			"thisvisitdate": "Det här Besöket",
			"nextvisitdate": "Nästa Besök",
			"dateNextVisit": "Nästa Besöksdatum",
			"next_week": "+ 1 vecka",
			"next_fortnight": "+ 2 veckor",
			"next_month": "+ 4 veckor",
			"location": {
				"title": "Tvinga Position",
				"message": "Tvinga adressen att använda GPS koordinater från...",
				"my_location": "Min Nuvarande Position",
				"insert_location": "Lägg till Nuvarande Position",
				"previous_address": "Lägg till Föregående Adress"
			}
		}
	},
	"partners": {
		"partner": "Samarbete",
		"start": "Starta Tid",
		"end": "Stoppa Tid",
		"calendars": {
			"header": "Enhetens Kalenderinställningar",
			"device": "Enhetens Kalendrar",
			"readonly": "Skrivskyddade kalendrar visas inte",
			"add": "Lägg till i Kalender",
			"remove": "Ta bort från Kalender",
			"notes": "Ändra eventdetaljer i ServicePlanner."
		}
	},
	"qrcode": {
		"show": "Show QR Code",
		"saved": "QR Code saved to your Photo Library.",
		"error": "Could not save the QR code to your Photo Library."
	},
	"maps": {
		"title": "Kartor",
		"type": {
			"choose": "Välj en karttyp:",
			"normal": "Standard",
			"hybrid": "Hybrid",
			"satellite": "Satellit",
			"terrain": "Terräng"
		},
		"options": {
			"tracking_on": "Min Position På",
			"tracking_off": "Min Position Av",
			"traffic_on": "Trafik På",
			"traffic_off": "Trafik Av",
			"poi_on": "Points of Interest On",
			"poi_off": "Points of Interest Off"
		},
		"apps": {
			"applemaps": "Apple Kartor",
			"googlemaps": "Google Kartor",
			"waze": "Waze"
		},
		"ask": "Fråga Varje Gång",
		"address": {
			"select": "Var god välj den korrekta adressen:",
			"invalid": "Inte en giltig adress. Försök igen.",
			"askapp": "Öppna adress i ..."
		},
		"manual": {
			"confirm": "Är du säker på att du vill ändra \"%1$s\"s position till följande nya koordinater?\n\nNotera: Det här kommer inte att ändra Kontaktens skrivna adress, bara platsnålens position på kartan."
		},
		"locator": {
			"message": "Vad vill du göra med den här adressen?",
			"what": "Vad vill du se?",
			"current": "Min Nuvarande Position",
			"contact": "Skapa Ny Kontakt",
			"move": "Flytta Existerande Kontakt"
		},
		"locations": {
			"message": "Vad vill du göra?",
			"open_in": "Öppna i %1$s",
			"drive": "Kör till Plats",
			"star": "Stjärnmärkt Plats",
			"flag": "Distriktsflagga",
			"car": "Bilens position",
			"hall": "Rikets Sal",
			"home": "Hem",
			"set": "Ange %1$s",
			"remove": "Ta bort Platsnål"
		}
	},
	"addresses": {
		"address": "Adress",
		"geocode": "Geokod",
		"location": "Position",
		"locations": "Positioner",
		"locality": "Lokalitet",
		"unit": "Enhet",
		"units": "Enheter",
		"floor": "Våning",
		"ground": "Bottenvåning",
		"number": "Nummer",
		"street": "Gata",
		"city": "Stad",
		"postcode": "Postnummer",
		"locale": "Plats",
		"components": "Adresskomponenter",
		"latitude": "Latitud",
		"longitude": "Longitud",
		"suburb": "Kvarter",
		"county": "Län",
		"state": "Stat",
		"state_code": "Statsnummer",
		"country": "Land",
		"country_code": "Landskod",
		"place_id": "Plats ID",
		"place_id_hint": "Google Plats ID",
		"formatted": "Formatterad",
		"formatted_hint": "Komplett Adress",
		"actions": {
			"lookup": "Slå upp Adress",
			"lookup_footer": "Det här kommer att slå upp den ifyllda adressen och auto-fylla geokoden och alla adresskomponenter. Eller så kan du redigera alla adressdetaljer manuellt nedan.",
			"lookup_location": "Slå upp Position",
			"lookup_location_footer": "Detta kommer att slå upp din nuvarande position och auto-fylla adressen, geokoden samt alla adresskomponenter. Eller så kan du redigera alla detaljer manuellt nedan.",
			"current_location": "Använd Nuvarande Position",
			"current_location_footer": "Det här kommer automatiskt känna av din nuvarande latitud och longitud."
		}
	},
	"territories": {
		"name": "Församlingens Namn",
		"pick": "Vilket Distrikt?",
		"none": "Du har inte skapat några Distrikt än.",
		"map_number": "Karta %1$s",
		"map_number_type": "Karta %1$s (%2$s)",
		"add": {
			"new": "Lägg till Nytt Distrikt",
			"sorry": "För tillfället är det bara Distrikt som importerats via Territory Helper (territoryhelper.com) som stöds. I en framtida uppdatering kommer du kunna skapa egna Distrikt manuellt. Tack för ditt tålamod.",
			"import": "Importera från Territory Helper",
			"manual": "Skapa Manuellt"
		},
		"search": {
			"congregation": "Sök efter kartor i %1$s",
			"map": "Sök Karta %1$s (%2$s)"
		},
		"maps": {
			"none": "Det finns inga Kartor för detta Distrikt än.",
			"types": "Karttyper",
			"types_footer": "Ordna-om eller klicka för att ändra färg",
			"type": "Karttyp",
			"details": "Kartdetaljer",
			"number": "Kartnummer",
			"label": "Kartetikett",
			"image": "Kartbild",
			"assigned": "Tilldelat",
			"assigned_to": "Tilldelat till %1$s",
			"unassigned": "Inte Tilldelat"
		},
		"locations": {
			"details": "Positionsdetaljer",
			"type": "Positionstyp",
			"status": "Positionsstatus",
			"language": "Positionsspråk",
			"first": "Lägg till din första position",
			"add_to": "Lägg till på Karta %1$s",
			"visibility": {
				"title": "Synlighet",
				"approved": "Godkänt att Visa",
				"unapproved": "Inte Godkänt Än"
			}
		},
		"units": {
			"floor_hint": "Våning 0 = Bottenvåning",
			"details": "Enhetsdetaljer",
			"type": "Enhetstyp",
			"status": "Enhetsstatus",
			"add": "Lägg till en Enhet"
		},
		"statistics": {
			"title": "Statistik",
			"unique": "Unik"
		},
		"types": {
			"house": "Hus",
			"apartment": "Lägenhet",
			"business": "Företag",
			"trainstation": "Tågstation",
			"busstation": "Busstation",
			"school": "Skola",
			"store": "Affär",
			"language": "Språk",
			"harbour": "Hamn",
			"airport": "Flygplats",
			"truckstop": "Långtradarkafé",
			"elderlyhome": "Ålderdomshem",
			"park": "Park",
			"camp": "Kamping",
			"restaurant": "Restaurang",
			"hotel": "Hotell",
			"vacation": "Sommarhus"
		},
		"statuses": {
			"unknown": "Okänd status",
			"returnvisit": "Återbesök",
			"biblestudy": "Bibelstudie",
			"donotcall": "Ej-besök",
			"eldersonly": "Enbart Äldstebröder",
			"locked": "Låst",
			"lettersonly": "Enbart Brev",
			"vacant": "Tomt",
			"notrespassing": "Privat",
			"daysleeper": "Sover på dagarna",
			"witness": "Vittne",
			"phoneonly": "Enbart Telefon",
			"referral": "Hänvisning",
			"bewareofdog": "Varning för Hund"
		},
		"visits": {
			"add": "Lägg till ett Besök",
			"delete": "Radera Besök",
			"status": "Besöksstatus",
			"visited": {
				"last": "Senast Besökt",
				"never": "Aldrig Besökt",
				"date": "Datum för Besök"
			},
			"statuses": {
				"unvisited": "Obesökt",
				"visited": "Besökt",
				"skipped": "Skippat",
				"nothome1": "Inte Hemma 1",
				"nothome2": "Inte Hemma 2",
				"nothome3": "Inte Hemma 3"
			}
		},
		"languages": {
			"unknown": "Okänt Språk"
		},
		"filters": {
			"matches": "Inga matcher för det nuvarande filtret hittades",
			"change": "Var god ändra filterinställningarna",
			"maps": {
				"title": "Kartfilter",
				"include": {
					"title": "Kartor att Inkludera",
					"all": "Alla Kartor",
					"assigned": "För närvarande Tilldelad",
					"mine": "Tilldelad Mig"
				},
				"group": {
					"title": "Gruppera Efter",
					"type": "Karttyp",
					"none": "Ingen Gruppering"
				},
				"sort": {
					"title": "Sortera Efter",
					"number": "Kartnummer",
					"oldest": "Äldsta Först",
					"assigned": "Nyligen Tilldelad",
					"addresses": "Unika Adresser"
				}
			},
			"locations": {
				"title": "Positionsfilter",
				"types": "Position & Enhetstyper",
				"statuses": "Position & Enhetsstatusar",
				"languages": "Position & Enhetsspråk",
				"apply_list": "Tillämpa på Lista",
				"apply_map": "Tillämpa på Karta"
			}
		},
		"th": {
			"form": {
				"import": "Importera Kartor",
				"nosync": "Kontodetaljer för Territory Helper synkas inte mellan enheter. Var god logga in på varje enhet.",
				"geocode": "Var god tryck på positionsknappen till höger om adressfältet för att geokoda adressen med latitud och longitudkoordinater.",
				"address": "Adressdetaljer kan bara ändras i Territory Helper.",
				"online": "Du måste vara online för att ändra data i Territory Helper.",
				"details": "De här detaljerna kommer från Territory Helper.",
				"privacy": "Anteckningar sparas i Territory Helper. Se till att dina anteckningar uppfyller de lokala dataskyddslagarna.",
				"list": "Den här listan kommer från Territory Helper.",
				"remove": "Är du säker på att du vill ta bort Distriktet \"%1$s\" från ServicePlanner?"
			},
			"setup": {
				"publisher": "Hämtar Förkunnardetaljer",
				"congregaton": "Hämtar Församlingsdetaljer"
			},
			"sync": {
				"title": "Använd Ladda om Knappen",
				"hint": "Använd Ladda om Knappen topp/höger för att hämta den senaste Kartdatan från Territory Helper.",
				"importing": "Importerar Distriktskartor ...",
				"wait": "Var vänlig vänta medans kartorna importeras från Territory Helper.",
				"map": "Ladda om Kartdata",
				"location": "Ladda om Positionsdata",
				"sending": "Skickar ändringar till Territory Helper"
			},
			"assignments": {
				"status": "Status för Tilldelning",
				"assigned": "Tilldelat",
				"assigned_to": "Tilldelat %1$s",
				"assigned_me": "Tilldelat Mig",
				"assigned_date": "Tilldelat %1$s (%2$s dagar)",
				"assigned_none": "Inga Kartor är Tilldelade Mig",
				"not": "För närvarande inte tilldelat",
				"request": "Begär Karta",
				"request_made": "Din kartbegäran har skickat in. Var god vänta tills Distriktstjänaren gått igenom begäran.",
				"return": "Lämna in Genomgånget",
				"unworked": "Lämna in Ej-Genomgånget"
			},
			"roles": {
				"0": "Förkunnare",
				"10": "Avancerad",
				"30": "Äldste",
				"35": "Tillsyningsman",
				"40": "Medhjälpare",
				"50": "Administratör",
				"60": "Översättare",
				"100": "Systemadministratör"
			},
			"permissions": {
				"reset": "Återställ Behörigheter",
				"low": "Du har inte rätt behörighet att göra det här i Territory Helper.",
				"changed": "Om dina behörigheter nyss uppgraderats i Territory Helper, gå då in i distriktets inställningar i ServicePlanner och tryck \"Återställ Behörigheter\"."
			}
		}
	},
	"today": {
		"title": "Idag",
		"plugins": {
			"timer": "Timer",
			"media": "Videor",
			"bookshelf": "Publikationer",
			"territories": "Distrikt",
			"contacts": "Kontakter att besöka",
			"hours": "Totalt antal Timmar",
			"activity": "Aktivitet"
		},
		"settings": {
			"title": "Idaginställningar",
			"plugins": "Tillägg",
			"heading": "Rubrik",
			"activity": "Aktivitetspluginsobjekt",
			"hours": "Summering av Timobjekt"
		}
	},
	"timer": {
		"stop": "Stoppa Timer",
		"start": "Starta Timer",
		"pause": "Pausa Timer",
		"resume": "Fortsätt Timer",
		"confirm": {
			"more": "Du behöver minst 5 minuter för att kunna rapportera.",
			"message": "Vill du lägga till %1$s (%2$s) till din aktivitet för %3$s?",
			"ministry": "Lägg till i Tjänstetimmar",
			"other": "Lägg till i %1$s Timmar",
			"stop": "Bara Stoppa Timern",
			"done_ministry": "%1$s (%2$s) lades till i dina Tjänstetimmar för %3$s.",
			"done_other": "%1$s (%2$s) lades till i  dina %3$s Timmar för %4$s."
		}
	},
	"library": {
		"title": "Bibliotek"
	},
	"clipboard": {
		"cover": {
			"add": "Lägg till Framsida",
			"title": "Du kan välha en framsida från ditt bildbibliotek eller klistra in en bild som du har kopierat till urklippet...",
			"choose": "Välj Bild",
			"clipboard": "Använd Bild från Urklippet",
			"zoom": "Visa Framsida",
			"remove": "Ta bort Framsida"
		},
		"paste": {
			"no_image_title": "Ingen Bild Hittades",
			"no_image_message": "Ditt urklipp innehåller inte någon bild.\n\nVar god hitta en bild i din webbläsare, eller i en app som tillåter bilder att att kopieras, och klicka+håll kvar fingret på bilden för att \"Kopiera\" bilden till ditt urklipp."
		}
	},
	"bookshelf": {
		"title": "Bokhylla",
		"publications": "Publikationer",
		"hints": {
			"first_item": "Tryck på + knappen i verktygsfältet för att lägga till din första %1$s",
			"add_item": "Tryck på + knappen i verktygsfältet för att lägga till en %1$s",
			"no_recent": "Nyligen använda objekt läggs till allteftersom. Välj \"Alla\" i verktygsfältet för att välja ditt första objekt."
		},
		"default": {
			"description": "You can use the \"+\" button in the top toolbar to add publications to this category.\n\nTo get you started, would you like to add some default publications? You can edit or delete them at any time.",
			"confirm": "Would you like to add some default publications to this category? It will try to skip duplicate entries based on the publication abbreviation.",
			"button": "Add Default %1$s"
		},
		"sections": {
			"magazines": "Tidskrifter",
			"awake": "Vakna!",
			"watchtower": "Vakttornet",
			"books": "Böcker",
			"brochures": "Broschyrer",
			"tracts": "Traktater",
			"invites": "Inbjudningar",
			"other": "Annat"
		},
		"singular": {
			"magazines": "Tidning",
			"awake": "Vakna!",
			"watchtower": "Vakttorn",
			"watchtower_public": "Vakttorn (Offentlig)",
			"watchtower_study": "Vakttorn (Studieupplagan)",
			"watchtower_simplified": "Vakttorn (Förenklat)",
			"books": "Bok",
			"brochures": "Broschyr",
			"tracts": "Traktat",
			"invites": "Inbjudan",
			"other": "Publikation",
			"card": "Kontaktkort",
			"letter": "Brev",
			"link": "Webbplatslänk"
		},
		"form": {
			"new": "Ny %1$s",
			"today": "Lägg till under Aktuellt Idag",
			"remove": "Ta bort från Aktuellt Idag",
			"header": "Detaljer om Publikationen",
			"advanced": "Avancerade Detaljer",
			"abbr": "Förkortning",
			"url": "Webbsideadress (www)",
			"issue": "Utgåva",
			"issue_number": "Nr.",
			"title": "Titel",
			"locations": "Nedladdningsplatser",
			"pdf_url": "Nedladdningslänk",
			"epub_url": "Nedladdningslänk",
			"short_title": "Kort titel (Rekommenderas)",
			"published": "Publiceringsår",
			"count": "Räkna som Placering",
			"confirmTodayAdded": "Den här publikationen har lagts till under Aktuellt Idag.",
			"confirmTodayRemoved": "Den här puklikationen har tagits bort från Aktuellt Idag.",
			"confirmDelete": "Är du säker på att du vill radera %1$s \"%2$s\"?\n\nDetta kan inte ångras.",
			"cannot_delete": "Den här publikationen har placerats hos ett besök och kan inte raderas.\n\nDu kan använda Filtrena för att hitta Kontakter som har den här publikationen i sitt Bibliotek, och manuellt ta bort Placeringen först.",
			"tips": {
				"lookup": "Den här funktionen är bara en hjälpreda. Den kommer att försöka fylla i alla publikationsdetaljer åt dig. Men den kan komma att fylla i inkompletta eller tomma resultat. Om det händer så måste du manuellt fylla i de saknade publikationsdetaljerna.",
				"no_image": "Den här knappen kommer inte längre att klistra in framsidebilden för publikationer. Du kan använda “Lägg till Framsida” knappen för att göra det själv. Kolla in Hjälpsektionen på hemsidan för mer detaljer.",
				"abbr": {
					"books": "Förkortning (bh, lv ...)",
					"brochures": "Förkortning (fg, lc ...)",
					"tracts": "Förkortning (T-36, T-37 ...)"
				}
			},
			"errors": {
				"abbreviation": "Det verkar inte finnas några detaljer för den här publikationens förkortning under det valda språket. Var god pröva en annan förkortning, eller skriv in publikationens detaljer manuellt.",
				"imported": "Den här publikationen importerades och är inte kopplad till någon publikation i ditt ServicePlanner-bibliotek."
			}
		}
	},
	"media": {
		"title": "Media",
		"videos": "Videor",
		"video": "Video",
		"default": {
			"description": "You can use the \"+\" button in the top toolbar to add videos to this category.\n\nTo get you started, would you like to add some generic video placeholders? These can be used to report videos shown to householders without having to add every specific video available. You can edit or delete them at any time.",
			"confirm": "Would you like to add some generic videos to this category? It will try to skip duplicate entries.",
			"button": "Add Generic Videos",
			"section": "Section %1$s Video"
		},
		"sections": {
			"ministry": "Tjänsten",
			"study": "Bible Study",
			"children": "Barn",
			"whiteboard": "Tips på tavlan",
			"songs": "Sånger",
			"other": "Annat"
		},
		"singular": {
			"videos": "Video",
			"ministry": "Tjänstevideo",
			"study": "Study Video",
			"children": "Barnvideo",
			"whiteboard": "Tips på tavlan-animation",
			"songs": "Sång",
			"other": "Video"
		},
		"plural": {
			"videos": "Videor",
			"ministry": "Tjänstevideor",
			"study": "Study Videos",
			"children": "Barnvideor",
			"whiteboard": "Tips på tavlan-animationer",
			"songs": "Sånger",
			"other": "Videor"
		},
		"sizes": {
			"240": "240p",
			"360": "360p",
			"480": "480p",
			"720": "720p"
		},
		"form": {
			"new": "Ny %1$s",
			"today": "Lägg till under Aktuellt Idag",
			"remove": "Ta bort från Aktuellt Idag",
			"header": "Videodetaljer",
			"downloaded_footer": "Nerladdade videor kommer inte att synkas via Dropbox",
			"advanced": "Avancerade Detaljer",
			"duration": "Längd",
			"locations": "Videoplatser",
			"website": "Webbsideadress",
			"website_url": "Webbsidelänk",
			"broadcast_url": "Broadcasting-länk",
			"no_broadcast_url": "Var god skriv in en giltig Broadcasting-länk. Gå till tv.jw.org, hitta videon du vill lägga till, kopiera länken från adressfältet och klistra in i det här fältet.",
			"online": "Onlineresurser",
			"download_url": "Nerladdningslänk",
			"download": "Ladda ner Video",
			"downloaded": "Nerladdad %1$s",
			"title": "Titel",
			"short_title": "Kort Titel (Rekommenderas)",
			"play": "Spela %1$s",
			"stream": "Streama %1$s",
			"confirm_today_added": "Den här videon har lagts till under Aktuellt Idag.",
			"confirm_today_removed": "Den här videon har tagits bort från Aktuellt Idag.",
			"confirm_delete": "Är du säker på att du vill radera %1$s \"%2$s\"?\n\nDet här kan inte ångras.",
			"cannot_delete": "Den här videon har visats för kontakter och kan därför inte raderas.\n\nDu kan använda Filtrena för att hitta de Kontakter som har sett den här videon och manuellt ta bort den här videon först.",
			"no_videos": "Du har inte specificerat några platser för den här videon.",
			"tips": {
				"lookup": "Den här funktionen är bara en hjälpreda. Den kommer att försöka fylla i alla videodetaljer åt dig. Men den kan komma att fylla i inkompletta eller tomma resultat. Om det händer så måste du manuellt fylla i de saknade videodetaljerna.",
				"no_image": "Den här knappen kommer inte längre att klistra in framsidebilden för videor. Du kan använda “Lägg till Framsida” knappen för att göra det själv. Kolla in Hjälpsektionen på hemsidan för mer detaljer."
			},
			"errors": {
				"url": "Det här verkar inte vara en giltig Broadcasting-länk för det valda språket. Var god skriv in en giltig Broadcasting-länk eller välj ett annat språk och försök igen. Annars kan du lägga till videodetaljerna manuellt.",
				"imported": "Den här videon importerades och är inte kopplad till någon av dina videor i ditt ServicePlanner-bibliotek.\n\nDu kan lägga till videorna på nytt i dina besök om du vill ladda om den här listan."
			}
		}
	},
	"languages": {
		"single": "Språk",
		"multiple": "Språk",
		"available": "Tillgängliga %1$s",
		"selected": "Valt %1$s",
		"other": "Annat %1$s",
		"search": "Sök %1$s",
		"app": {
			"title": "Appens Språk",
			"hint": "Används för knappar och etiketter",
			"restart": "Var god starta om appen för att ändra språket."
		},
		"beta": {
			"title": "Inkompletta Översättningar (Beta)",
			"hint": "Emaila support@serviceplanner.me för att hjälpa till"
		},
		"chinese": {
			"options": "Kinesiska Val",
			"characters": "Enbart Tecken",
			"pi": "Pinyin",
			"zhu": "Zhuyin",
			"lau": "Sidney Lau",
			"yale": "Yale",
			"twoline": "%1$s 2-Line",
			"oneline": "%1$s Enbart"
		}
	},
	"websites": {
		"tasks": {
			"bookmark": "Lägg till Bokmärke",
			"video": "Lägg till Video",
			"video_cat": "Vilken kategori vill du lägga denna video under?",
			"briefcase": "Lägg till i Portfölj",
			"safari": "Öppna i Safari",
			"copy": "Kopiera Länk",
			"email": "Eposta Läs-Läge"
		},
		"bookmarks": {
			"none": "Inga Sparade Bokmärken",
			"first": "Tips: Navigera till en webbsida. Där kommer du att kunna Bokmärka hemsidan genom att använda verktygsfältets knappar.",
			"added": "Bokmärke tillagt"
		},
		"icon": {
			"add": "Lägg till Ikon",
			"title": "Du kan välja en ikon från ditt bilbibliotek eller klistra in en bild som du kopierat till urklippet...",
			"zoom": "Visa Ikon",
			"remove": "Ta bort Ikon"
		},
		"browser": {
			"search": "Sök eller webbsidelänk",
			"reader": "Läs-läge Tillgängligt",
			"2line": "Romanisering Tillgänglig",
			"video": "Video Hittad"
		},
		"form": {
			"new": "Ny %1$s",
			"today": "Lägg till under Aktuellt Idag",
			"remove": "Ta bort från Aktuellt Idag",
			"header": "Webbsidedetaljer",
			"footer": "Länk-platshållare: %Y (År), %m (månad), %d (dag)",
			"advanced": "Avancerade Detaljer",
			"share_link": "Share Link",
			"website": "Webbsideadress",
			"website_url": "Webbsidelänk",
			"online": "Onlineresurser",
			"title": "Titel",
			"short_title": "Kort Titel (Rekommenderas)",
			"confirm_today_added": "Den här webbsidan har lagts till under Aktuellt Idag.",
			"confirm_today_removed": "Den här webbsidan har tagits bort från Aktuellt Idag.",
			"confirm_delete": "Är du säker på att du vill ta bort %1$s \"%2$s\"?\n\nDet här kan inte ångras.",
			"errors": {
				"url": "Det här verkar inte vara en giltig Länk. Var god försök igen."
			}
		}
	},
	"activity": {
		"title": "Aktivitet",
		"current": "Aktuell",
		"reports": "Rapporter",
		"month": "Månad",
		"year": "År",
		"other": "Annat",
		"manual": "Manuell",
		"auto": "räknas ut",
		"planned": "Planerat",
		"scheduled": "Schemalagt",
		"ministry": "Tjänsten",
		"theocratic": "Teokratisk",
		"personal": "Personlig",
		"actual": "Nuvarande",
		"report": {
			"title": "Rapport för %1$s",
			"send": "Skicka Rapport",
			"hours": "Timmar",
			"credits": "Credits",
			"minutes": "%1$s minuter",
			"hours_ministry": "Tjänstetimmar",
			"hours_other": "%1$s Timmar",
			"hours_under_planned": "%1$s kvar att planeras",
			"hours_over_planned": "%1$s över målet",
			"hours_progress": "%1$s av %2$s timmar",
			"hours_under": "%1$s under",
			"hours_over": "%1$s över",
			"hours_behind": "%1$s efter",
			"hours_ahead": "%1$s före",
			"hours_ok": "Enligt planerna",
			"hours_met": "Målet Uppnått",
			"hours_projected": "Beräknade timmar %1$s",
			"hours_projected_short": "%1$s Bt",
			"hours_reported": "%1$s rapporterade",
			"hours_reported_short": "%1$s R",
			"hours_total": "%1$s total",
			"hours_total_short": "%1$s T",
			"hours_show": "Show Hours on Calendar",
			"hours_hide": "Hide Hours on Calendar",
			"placements": "Placeringar",
			"placements_show": "Show Placements, Videos, RVs",
			"placements_hide": "Hide Placements, Videos, RVs",
			"mileage": "Miltal",
			"videos": "Videor",
			"visits": "Återbesök",
			"visits_all": "Alla Besökstyper",
			"studies": "Bibelstudier",
			"studies_unique": "Unika Bibelstudier",
			"nothing": "Inget rapporterat än",
			"remove": "Ta bort Från Rapport"
		},
		"hours": {
			"target": "Mål för månaden",
			"target_total": "Totalt av Mål",
			"target_alert": "Ange målet för den här månaden. Det här kommer att skriva över standardinstäälingen för Månadens Mål som är specifierat i Inställningar > Schema.",
			"carried_title": "Minuter tillgodo",
			"carried_label": "Från Föregående Månad",
			"planned": "Plannerat antal Timmar",
			"planned_total": "Totalt Plannerade",
			"planned_ok": "= Goal",
			"actual": "Faktiska Timmar",
			"progress": "Totalt fram tills Idag",
			"future": "Planerat för Framtiden",
			"summary": "Summering av Aktivitet",
			"total": "Totalt antal Timmar",
			"calculated": "Beräknat",
			"projected": "Beräknade Timmar",
			"reported": "Rapporterat antal Timmar",
			"credits": {
				"add": "Lägg till Timmar tillgodo",
				"delete": "Ta bort Timmar tillgodo",
				"singular": "Timme tillgodo",
				"plural": "Timmar tillgodo",
				"reason": "Anledning",
				"hint": "T.ex. Pionjärskola",
				"hours": "Timmar tillgodo",
				"confirmDelete": "Är du säker på att du vill ta bort det här antalet timmar som är dig tillgodo?"
			},
			"footers": {
				"goals": "Du kan skriva över månadens mål som du har ställt in som standard",
				"planned": {
					"over": "%1$s planerat över ditt mål",
					"under": "%1$s att planera för att nå ditt mål",
					"ok": "Planerat antal timmar = ditt månatliga mål"
				},
				"actual": {
					"ahead": "Så här långt är du %1$s framför planen",
					"behind": "Så här långt är du %1$s bakom din plan",
					"ok": "Du är på god väg mot att upfylla dina planerade timmar"
				},
				"projected": {
					"over": "Du kommer att ligga %1$s framför målet för den här månaden",
					"under": "Du kommer att ligga %1$s bakom den här månadens mål",
					"ok": "Du är på god väg mot att nå den här månadens mål"
				},
				"projected_goal": {
					"over": "Du är %1$s framför de månatliga målet",
					"under": "Du är %1$s bakom det månatliga målet",
					"ok": "Du har uppnått det månatliga målet"
				},
				"projected_planned": {
					"over": "Du kommer att ligga %1$s framför dina planerade timmar",
					"under": "Du kommer att ligga %1$s bakom dina planerade timmar",
					"ok": "Du kommer att uppnå dina planerade timmar"
				}
			}
		},
		"notes": {
			"none": {
				"title": "No notes to show",
				"description": "This list will show all notes from the currently selected calendar month and forward."
			}
		},
		"service_year": {
			"summary": "%1$s Summering för Tjänsteåret"
		},
		"send": {
			"greeting": "Hej %1$s,",
			"intro": "Här är min rapport för %1$s:",
			"carried": "%1$s minuter överfördes till nästa månad (km 9/88 3)",
			"credit_hours": {
				"included_hours": "Den rapporterade tiden inkluderar %1$s timmar tillgodo för %2$s.",
				"comment_only": "Var god notera %1$s timmar tillgodo för %2$s."
			},
			"other_hours": {
				"included_hours": "Den rapporterade tiden inkluderar %1$s %2$s.",
				"adjusted_hours": "The reported time includes some credit hours contributed from %1$s %2$s.",
				"comment_only": "Var god notera %1$s %2$s."
			}
		},
		"schedule": {
			"daily_apply": "Tillämpa Dagligt Schema",
			"daily_confirm": "Det här kommer att gå igenom varje dag i %1$s och tillämpa dina dagliga mål till Plannerat antal timmar-kolumnen.",
			"recalc_apply": "Räkna-om Rapportens Totalsumma",
			"recalc_confirm": "Det här kommer att gå igenom varje dag i %1$s och räkna-om rapportens totalsumma för månaden."
		},
		"alerts": {
			"manual_ttl": "Manuella Placeringar",
			"manual_msg": "Dessa manuella placeringar är inte kopplade med en Kontakt eller ett Besök.",
			"videos_ttl": "Videor Visade",
			"videos_ttl_manual": "Manuella Videor Visade",
			"videos_msg": "Dessa vidervisningar är inte kopplade med en Kontakt eller ett Besök."
		}
	},
	"settings": {
		"title": "Inställningar",
		"dropbox": {
			"title": "Dropbox Synkronisering",
			"connect": "Anslut till Dropbox",
			"connect_footer": "Anslut till Dropbox för att ställa in automatiska säkerhetskopior för dina data eller för att synka mellan flera enheter.\nOm du inte har ett Dropbox-konto så kan du skapa ett gratiskonto.",
			"disconnect": "Koppla ifrån from Dropbox",
			"confirm_disconnect": "Är du säker på att du vill koppla ifrån Dropbox och därmed sluta synka dina data?",
			"last_sync": "Senaste Synkning: %1$s",
			"sync_options": "Inställningar för Synk",
			"auto_sync": "Automatisk Synkning",
			"wifi_only": "Begränsa Autosynkning till Wifi",
			"sync_now": "Synka Alla Filer Nu",
			"sync_complete": "Synkning Färdig",
			"syncing": "Synkar ...",
			"account": {
				"details": "Anslutet Konto",
				"name": "Namn",
				"email": "Epost"
			}
		},
		"backup": {
			"title": "Manuell Säkerhetskopia",
			"button": "Säkerhetskopiera filer nu",
			"last": "Senaste Säkerhetskopia: %1$s",
			"footer": "Eposta en säkerhetskopia av dina appfiler",
			"confirm": {
				"title": "Generera Säkerhetskopia",
				"progress": "Genererar Säkerhetskopia ...",
				"message": "Det här kommer att generera en ZIP-fil. Du kan välja var/hur du vill spara filen.\n\nDet kan ta några sekunder att generera säkerhetskopian."
			},
			"reminder": {
				"enable": "Aktivera Påminnelser för Säkerhetskopior",
				"7day": "Var 7:e dag",
				"14day": "Var 14:e dag",
				"30day": "Var 30:e dag",
				"60day": "Var 60:e dag",
				"alert": {
					"title": "Påminnelse för Säkerhetskopiering",
					"message": "Det är dags att säkerhetskopiera dina filer. Vill du generera säkerhetskopian nu?\n\nDu kan konfigurera de här påminnelserna för säkerhetskopiering under Inställningar."
				}
			},
			"restore": {
				"title": "Återställ Säkerhetskopia",
				"progress": "Återställer Säkerhetskopia ...",
				"restored": "Data Återställd",
				"confirm": "Är du säker på att du vill återställa datan som finns i ZIP-filen?\n\nDet här kommer att ersätta all nuvarande data i den här installationen av ServicePlanner.",
				"complete": "Dina filer återställdes framgångsrikt.\n\nVisst innehåll som återställts kanske endast visas efter att ServicePlanner startats om.",
				"blocked": "Något var fel med ZIP-filen.\n\nÅterställningen blockerades och ingenting ändrades i den här installationen av ServicePlanner.",
				"cancelled": "Återställningen avbröts och ingenting ändrades i den här installationen av ServicePlanner."
			}
		},
		"appearance": {
			"title": "Utseende",
			"color": "Färg för Tema"
		},
		"workflow": {
			"title": "Arbetsflöde",
			"next_visit": "Dagar tills nästa Besök",
			"turn_orange": "Dagar tills Orange",
			"turn_red": "Dagar tills Röd",
			"turn_blood": "Dagar tills Blodsröd",
			"default_visit_type": "Besökstyp Standard",
			"visit_time": "Använd Schemalagd Tid",
			"hints": {
				"overview": "Workflow controls what happens when you add a new visit to a contact.\n\nEach Contact Type has it's own workflow rules. For example, if you add a new visit to a Contact Type = \"Bible Study\", then you want the Visit Type to be set to \"Return Visit\" by default. And you want the next visit to be automatically scheduled for X days into the future.\n\nNormally the time of the next visit is set to the time of the visit you are currently adding, logically assuming that if you successfully contacted the person at this time today, then try the same time again next visit. However you can tell the workflow to use the \"Scheduled Time\" of the previous visit instead - i.e. re-use the planned visit time, not the time that the visit is being recorded. This is handy for Bible Studies held at the same time each week for example.\n\nThe \"Days until ...\" options let you control the number of days before the date indicators and labels change colour.\n\nFeel free to experiment and customize the rules to match your personal workflow! You can now even click on a Contact Type and rename it.",
				"visit_time": "Sätt enligt standard till Aktuell Tid",
				"next_visit": "Det här numret kommer att användas för att automatiskt definiera Nästa Besöksdatum.",
				"change_color": "De här antalet dagar räknas från och med det Senaste Besöksdatumet.",
				"default_visit_type": "När ett nytt Besök läggs till kommer det automatiskt att ändras till denna Besökstyp.",
				"restart": "Den här ändringen kanske inte verkställs förrän du startat om appen."
			}
		},
		"partners": {
			"title": "Samarbete",
			"event": {
				"calendar": "Standardkalender",
				"event": "Kalenderevent",
				"event_footer": "Endast tillämpad på partner nummer 1",
				"auto_add": "Lägg automatiskt till i Kalender",
				"tentative_title": "Eventtitel - Preliminärt",
				"tentative_event": "Tjänst med %n?",
				"confirmed_title": "Eventtitel - Bekräftad",
				"confirmed_event": "Tjänst med %n",
				"footer": "%n = Tjänstepartnerns Namn"
			},
			"name": {
				"title": "Partnerns Namn",
				"full": "Fullständigt namn",
				"first": "Förnamn"
			}
		},
		"schedule": {
			"title": "Schema",
			"form": {
				"annual_goal": "Årligt Mål",
				"monthly_goal": "Månatligt Mål",
				"daily_goals": "Dagliga Mål",
				"daily_footer": "Återställ till blankt (—) för att skippa en dag när Schemat för en månad tillämpas från \"...\" menyn under Aktivitet."
			}
		},
		"reporting": {
			"title": "Rapportering",
			"overseer": {
				"send_to": "Skicka Rapport Till",
				"name": "Namn",
				"mobile": "Mobil",
				"email": "Epost"
			},
			"apps": {
				"method": "Skicka Rapport Via",
				"not_installed": "%1$s verkar inte vara installerad på den här enheten. Var god välj en annan metod."
			},
			"calendar": {
				"title": "Starta Kalendervecka på"
			},
			"hours": {
				"time": {
					"title": "Rapportera Tid I",
					"tick": "Shared in Ministry",
					"hours": "Hela Timmar (Standard)",
					"minutes": "15 Minutersintervaller",
					"footer": "Endast enligt Särskild Överenskommelse"
				},
				"other": {
					"title": "Andra Timmar",
					"enable": "Aktivera Andra Timmar",
					"label": "Märk Som",
					"one_word": "Var god använd endast ett ord i etiketten.",
					"options": {
						"title": "Other Hours Options",
						"include_hours": "Inkludera i Aktivitetstimmar",
						"include_report": "Inkludera i Rapporttimmar",
						"include_comment": "Inkludera i Rapportkommentar",
						"include_breakdown": "Visa uppdelning av timmar",
						"maximum_hours": "Maximum Other Hours",
						"footer": "Other Hours will be reduced if monthly total exceeds maximum."
					}
				},
				"alerts": {
					"format_prompt_title": "Choose Report Format",
					"format_prompt_message": "Would you like to report your hours (if you are a pioneer) or just that you shared in the ministry?\n\nYou can change the default in Settings > Reporting at any time.\n\nOn the Activity screen you can change the report format for a specific month. You can also choose to show or hide your hours on the calendar (see the top / right menu options).",
					"format_tick": "Report Shared in Ministry ✓",
					"format_hours": "Report Full Hours",
					"month_switch_title": "Switch Report Format",
					"month_switch_hours": "Would you like to switch to reporting full hours for this month?\n\nNote: This does not affect hours displaying on the calendar which is controlled from the top / right menu.",
					"month_switch_tick": "Would you like to switch to just indicating that you shared in the ministry this month - i.e. do not share your hours?\n\nNote: This does not affect hours displaying on the calendar which is controlled from the top / right menu."
				}
			},
			"mileage": {
				"title": "Logg för Miltal",
				"enable": "Aktivera Logg för Miltal",
				"units_fuel": "Enheter - Bränsle",
				"units_distance": "Enheter - Avstånd"
			},
			"options": {
				"title": "Ytterligare Inställningar",
				"notes": "Inkludera Anteckningar i Rapport",
				"zero": "Inkludera Värden som inte innehåller något",
				"footer": "Du kan välja att dölja innehåll som motsvarar = 0. Timmar inkluderas alltid."
			},
			"comment": {
				"title": "Rapportkommentar",
				"footer": "Används som en signatur för Rapporten"
			}
		},
		"ministry": {
			"title": "Tjänst"
		},
		"social": {
			"website": "Webbsida",
			"facebook": "Facebook",
			"twitter": "Twitter"
		},
		"help": {
			"title": "Hjälp & Support"
		},
		"issues": {
			"title": "Problem och buggar"
		},
		"maps": {
			"title": "Adresser",
			"open_in": "Öppna Platser i ...",
			"contacts": {
				"title": "Slå upp Kontaktadress",
				"reformat": "Omformatera Adressen",
				"locality": "Fyll automatiskt i Lokaliteten",
				"footer": "Lokalitet = Förort eller Område."
			},
			"address": {
				"title": "Adressformat",
				"street": "Gatuadress",
				"no_city": "Gatuadress, Förort",
				"no_country": "Gatuadress, Förort, Stad",
				"full": "Gatuadress, Förort, Stad, Land",
				"footer": "Gatuadress inkluderar numret på gatan. Stad brukar inkludera Postnummret."
			},
			"locality": {
				"title": "Lokalitetsformat",
				"suburb": "Förort eller Område",
				"postcode_city": "Postnummer Stad",
				"city_postcode": "Stad Postnummer",
				"footer": "Lokalitet används för att gruppera kontakter tillsammans efter område."
			},
			"restrictions": {
				"title": "Omvänd Geokodning",
				"country": "Begränsa Adressresultat till %1$s"
			}
		},
		"timer": {
			"title": "Timer",
			"enable": "Aktivera Timer",
			"rounding": {
				"title": "5 Minutersintervaller",
				"down": "Avrunda alltid Nedåt",
				"nearest": "Avrunda till Närmsta",
				"footer": "Avgör om 13 minuter räknas som 10 eller 15 minuter."
			},
			"seconds": {
				"title": "Sekunder",
				"hide": "Göm om Över 00:00:59",
				"always": "Visa alltid Sekunder",
				"footer": "Att gömma sekunder minimerar distraktioner."
			},
			"badge": {
				"label": "Använd Appemblem",
				"footer": "Visar en \"1\" om Timern är startad"
			},
			"color": {
				"title": "Färg när Timern är Aktiv",
				"slate_gray": "Skiffergrå",
				"light_blue": "Ljusblå",
				"dark_blue": "Mörkblå",
				"light_green": "Ljusgrön",
				"dark_green": "Mörkgrön"
			},
			"logs": {
				"title": "Logg",
				"none": "Inga loggar för Timern på den här enheten.",
				"alert": "Att radera en logg för Timern ändrar inte din aktivitet eller din rapporterade tid.",
				"footer": "Endast de 30 senaste posterna behålls. Timerinställningar och Loggar synkas inte mellan enheter."
			}
		},
		"debug": {
			"title": "Debugverktyg",
			"device": "Enhetsinformation",
			"memory": "Tillgängligt Minne",
			"network": "Nätverkstyp",
			"email": {
				"title": "Skicka Debuggdata via Epost",
				"footer": "Var god använd inte detta alternativ så länge jag inte specifikt efterfrågar denna data för att kunna hjälpa dig att åtgärda ett fel som du har upplevt med appen.",
				"message": "Försök inte att använda den här filen till något - skicka den bara via epost till %1$s.",
				"button": "Generera Epost"
			}
		},
		"beta": {
			"title": "Beta Testare",
			"gitlab": {
				"title": "Beta Tracker",
				"button": "Fel Tracker för Beta Testare",
				"footer": "Används för bugrapporter och feedback som är specifik för betan. Skapa ett gratis GitLab konto och skicka ditt användarnamn till mig för att få tillgång."
			},
			"report": {
				"title": "Lägg till nytt Fel",
				"email": "Din GitLab Epostadress (Valfritt)",
				"button": "Skicka Feedback",
				"footer": "Få din personliga epostadress från botten i listan av Fel i GitLabs Fel Tracker."
			}
		},
		"appstore": {
			"title": "App Store"
		},
		"tags": {
			"edit": "Ändra Taggnamn",
			"delete": {
				"title": "Radera Tagg",
				"warning": "Taggen \"%1$s\" kommer att tas bort från alla Kontakter.\n\nÄr du säker på att du vill göra det här?"
			}
		},
		"notifications": {
			"title": "Notifikationer",
			"sync": "Notifikationsinställningar synkas inte mellan enheter",
			"report": {
				"title": "Rapportpåminnare",
				"last": "På Sista Dagen i Månaden",
				"first": "På Första Dagen Nästkommande Månad",
				"notification": {
					"message": "Dags att skicka in din tjänsterapport?"
				}
			},
			"visits": {
				"title": "Besökspåminnare",
				"tomorrow": "Natten innan",
				"today": "På morgonen den",
				"notification": {
					"message": "Du har %1$s %2$s plannerat för %3$s."
				}
			},
			"partner": {
				"title": "Tjänstepartner",
				"tomorrow": "Natten innan",
				"today": "På morgonen den",
				"notification": {
					"message": "Du samarbetar med %1$s %2$s.",
					"join_middle": ",",
					"join_last": "och"
				}
			}
		},
		"gdpr": {
			"title": "GDPR-Läge",
			"footer": "Avaktivera kontaktvyn och data",
			"alert": "Det här läget tvingar appen att rätta sig efter GDPR för användare i UK och EU.\n\n1) Detta kommer att avaktivera Besök-knappen och Kontakt-sektionen under Aktuellt idag.\n\n2) Alla existerande besök kommer att raderas permanent.",
			"notice": "I vissa delar av världen så behöver användare rätta sig efter General Data Protection Regulation (GDPR). Det här betyder att INGEN kontakt-data kommer att lagras eller sparas..\n\nOm landet du bor i omfattas av GDPR så aktivera \"GDPR-Läge\" under inställningar.\n\nAlla frågor om detta tas upp med äldstebröderna i din församling, eller så kan du kolla hemsidan.",
			"important": "Viktigt meddelande",
			"understand": "Jag förstår"
		}
	}
}
