{
	"common": {
		"format": "Format",
		"notnow": "Nu acum",
		"more": "Mai mult",
		"outline": "Contur",
		"bible": "Biblie",
		"reset": "Resetare",
		"error": "Eroare",
		"new": "Nou",
		"verse": "Verset",
		"note": "Note",
		"annotate": "Comentariu",
		"annotations": "Comentarii",
		"cancel": "Anulare",
		"ok": "OK",
		"yes": "Yes",
		"no": "No",
		"other": "Alte",
		"done": "Gata",
		"top": "Sus",
		"edit": "Editare",
		"add": "Adaugă",
		"save": "Salvare",
		"delete": "Şterge",
		"remove": "Elimină",
		"search": "Caută",
		"options": "Opţiuni",
		"chapter": "Capitol",
		"article": "Articol",
		"title": "Titlu",
		"image_viewer": "Vizualizator de imagini",
		"reference": "Referinţă",
		"topic": "Subiect",
		"heading": "Rubrică",
		"reloading": "Reîncarcă",
		"loading": "Încarcă",
		"settings": "Configurări",
		"confirm": "Confirmă te rog",
		"forums": "Forumuri",
		"history": "Istoric",
		"historyclear": "Şterge istoricul",
		"historyconfirm": "Aceasta va şterge toate elementele din istoric. Sigur vrei să faci asta?",
		"subheadings": "Subtitluri",
		"copied": "Copiat în Clipboard",
		"page": "Pagină",
		"pages": "Pagini",
		"paragraphs": "Par.",
		"footnote": "Notă de subsol",
		"about": "Despre",
		"news": "Noutăţi",
		"general": "General",
		"word_search": "Caută un cuvânt",
		"tip": "Sfat",
		"recent": "Recent",
		"recently_opened": "Deschise recent",
		"frontcover": "Coperta din faţă",
		"reorder": "Reordonare",
		"order": "Ordonare",
		"favourites": "Favorite",
		"favouritesave": "Salvează ca Favorit",
		"websites": "Site-uri",
		"contents": "Cuprins",
		"clearcache": "Şterge cache-ul",
		"size": "Mărime",
		"height": "Înălţime",
		"width": "Lăţime",
		"small": "Mic",
		"default": "Implicit",
		"medium": "Mediu",
		"large": "Mare",
		"larger": "Mai mare",
		"largest": "Cel mai mare",
		"fullscreen": "Ecran complet",
		"home": "Acasă",
		"back": "Înapoi",
		"forward": "Înainte",
		"toggle2lines": "Comutare la 2 linii",
		"list": "Listă",
		"grid": "Grilă",
		"map": "Hartă",
		"hybrid": "Hibrid",
		"choose": "Alege te rog",
		"selectall": "Selectează tot",
		"online": "Online",
		"file": "Fişier",
		"layout": "Modificaţi aspectul",
		"never": "Niciodată",
		"sync": "Sincronizează",
		"syncing": "Se sincronizează",
		"current": "Actual",
		"saved": "Salvat",
		"active": "Activ",
		"alert": "Alertă",
		"warning": "Avertisment",
		"important": "Important",
		"acknowledge": "Recunoaşte",
		"any": "Orice",
		"none": "Nimic",
		"enable": "Activare",
		"enabled": "Activat",
		"disable": "Dezactivare",
		"disabled": "Dezactivat",
		"update": "Actualizare",
		"modify": "Modificaţi",
		"created": "Creat",
		"overdue": "Întârziere",
		"cannot": "Nu poate continua",
		"all": "Tot",
		"website": "Site web",
		"epub": "EPUB",
		"pdf": "PDF",
		"open_prompt": "Deschide %1$s",
		"view_prompt": "Examinează %1$s",
		"download_prompt": "Descarcă %1$s",
		"details": "Detalii",
		"stop": "Stop",
		"start": "Start",
		"custom": "Personalizare",
		"summary": "Rezumat",
		"please_note": "Reţine te rog",
		"when": "Când",
		"bookmarks": "Marcaje",
		"bookmark": "Marcaj",
		"territory": "Teritoriu",
		"territories": "Teritorii",
		"congregation": "Congregaţie",
		"show_prompt": "Afişează %1$s",
		"hide_prompt": "Ascunde %1$s",
		"delete_prompt": "Şterge %1$s",
		"remove_prompt": "Elimină %1$s",
		"open_in_prompt": "Deschide în %1$s",
		"open_item_in_prompt": "Deschide %1$s în %2$s",
		"edit_in_prompt": "Editează în %1$s",
		"view_in_prompt": "Vizualizează în %1$s",
		"download_from_prompt": "Descarcă din %1$s",
		"sync_prompt": "Sincronizează cu %1$s",
		"syncing_prompt": "Se sincronizează cu %1$s",
		"notes": "Notiţe",
		"read_only": "Doar citire",
		"editable": "Editabil",
		"required": "Necesar",
		"unknown": "Necunoscut",
		"confirmed": "Confirmat",
		"calendar": "Calendar",
		"end": "Sfârşit",
		"ahead": "Înainte",
		"behind": "În urmă"
	},
	"time": {
		"tomorrow": "Mâine",
		"today": "Astăzi",
		"yesterday": "Ieri",
		"earlier_this_week": "La începutul săptămânii",
		"next_week": "Săptămâna următoare",
		"this_week": "Această săptămână",
		"last_week": "Ultima săptămână",
		"next_month": "Luna următoare",
		"this_month": "Această lună",
		"last_month": "Ultima lună",
		"older": "Mai vechi",
		"newer": "Recente",
		"next_year": "Anul următor",
		"this_year": "Acest an",
		"last_year": "Ultimul an",
		"on_or_before": "Pe sau înainte de %1$s",
		"over_years_ago": "De peste %1$s ani în urmă",
		"over_year_ago": "De peste 1 an în urmă",
		"over_months_ago": "De peste %1$s luni în urmă",
		"over_month_ago": "De peste 1 lună în urmă",
		"over_weeks_ago": "De peste %1$s săptămâni în urmă",
		"over_week_ago": "De peste 1 săptămână în urmă",
		"over_days_ago": "De peste %1$s zile în urmă",
		"within_days": "În ultimele %1$s zile",
		"within_next_days": "În următoarele %1$s zile",
		"over_days_away": "De peste %1$s zile distanță",
		"over_week_away": "De peste 1 săptămână distanță",
		"over_weeks_away": "De peste %1$s săptămâni distanță",
		"over_month_away": "De peste 1 lună distanță",
		"over_months_away": "De peste %1$s luni distanță",
		"over_year_away": "De peste 1 an distanță",
		"over_years_away": "De peste %1$s ani distanță",
		"future": "Viitor",
		"day": "Zi",
		"week": "Săptămână",
		"month": "Lună",
		"year": "An",
		"hours": "ore",
		"hour": "oră",
		"minutes": "minute",
		"date": "Data",
		"date_added": "Data adăugată",
		"date_created": "Data creată",
		"date_updated": "Data actualizată",
		"date_picker": "Alege data",
		"time": "Ora",
		"time_picker": "Alege ora",
		"format": {
			"time": {
				"standard": "G:i",
				"full": "G:i:s"
			},
			"date": {
				"day": "l",
				"year": "Y",
				"full": "d/m/Y",
				"full_short": "d/m/y",
				"day_date_suffix": "l j",
				"day_date_month": "D j/M",
				"day_month_date": "l, j F",
				"day_month_date_year": "l, j F Y",
				"month_year": "F Y",
				"date_month": "d/m",
				"date_month_year": "j F Y",
				"picker": "D j M"
			},
			"datetime": {
				"long": "d/m/Y G:i:s",
				"full": "l, j F Y, G:i",
				"month": "l, j F G:i",
				"month_short": "F j/m G:i",
				"day_date_month_time": "D j/m \\l\\a G:i"
			}
		},
		"abbreviations": {
			"hours_minutes": "HH:MM",
			"minutes_seconds": "MM:SS",
			"mins": "min",
			"am": "am",
			"pm": "pm",
			"st": "st",
			"nd": "nd",
			"rd": "rd",
			"th": "th"
		},
		"days": {
			"long": {
				"sunday": "Duminică",
				"monday": "Luni",
				"tuesday": "Marţi",
				"wednesday": "Miercuri",
				"thursday": "Joi",
				"friday": "Vineri",
				"saturday": "Sâmbătă"
			},
			"short": {
				"sun": "Dum",
				"mon": "Lun",
				"tue": "Mar",
				"wed": "Mie",
				"thu": "Joi",
				"fri": "Vin",
				"sat": "Sâm"
			}
		},
		"months": {
			"long": {
				"january": "Ianuarie",
				"february": "Februarie",
				"march": "Martie",
				"april": "Aprilie",
				"may": "Mai",
				"june": "Iunie",
				"july": "Iulie",
				"august": "August",
				"september": "Septembrie",
				"october": "Octombrie",
				"november": "Noiembrie",
				"december": "Decembrie"
			},
			"short": {
				"jan": "Ian",
				"feb": "Feb",
				"mar": "Mar",
				"apr": "Apr",
				"may": "Mai",
				"jun": "Iun",
				"jul": "Iul",
				"aug": "Aug",
				"sep": "Sept",
				"oct": "Oct",
				"nov": "Nov",
				"dec": "Dec"
			}
		}
	},
	"measurement": {
		"long": {
			"km": "km",
			"mi": "milă",
			"gal": "galon",
			"L": "litru"
		}
	},
	"titles": {
		"mr": "Dl",
		"mrs": "D-na",
		"miss": "D-ra",
		"ms": "D-na",
		"dr": "Dr"
	},
	"email": {
		"feedback": "Trimite fedback",
		"standard": "Formatul standard de e-mail",
		"send": "Trimite e-mail",
		"confirm": "Te rog verifică mai întâi dacă întrebarea, problema sau ideea ta nu este deja cuprinsă în Anunţuri sau în Forumurile utilizatorilor.",
		"english": "Tot suportul este în engleză, deci te rog să ai răbdare cu mine",
		"import": "Importă în %1$s",
		"footer": "E-mail generat de %1$s"
	},
	"forms": {
		"validation": {
			"alert_title": "Invalid",
			"alert_message": "Te rog corectează următoarele...",
			"missing_value": "\"%1$s\" trebuie indicat o valoare",
			"url": "Introdu o adresă URL validă începând cu http:// sau https://"
		}
	},
	"search": {
		"placeholder": "Caută %1$s",
		"searching": "Căutare",
		"nothing": "Nicio potrivire găsită"
	},
	"browser": {
		"reload": "Reîncarcă pagina",
		"open": "Open Browser",
		"safari": "Deschide în Safari",
		"clipboard": "Copie link-ul în Clipboard",
		"email": "Link pe e-mail către această pagină"
	},
	"apps": {
		"email": "Email",
		"sms": "Mesaj SMS",
		"telegram": "Telegram",
		"whatsapp": "WhatsApp",
		"wechat": "WeChat",
		"viber": "Viber",
		"line": "LINE",
		"hourglass": "Hourglass",
		"nwpublisher": "NW Publisher",
		"dropbox": "Dropbox",
		"th": "Territory Helper",
		"tasks": {
			"alert": "Alertă %1$s",
			"error": "Eroare %1$s",
			"account": "Cont %1$s",
			"connect": "Conectează-te la %1$s",
			"sign_in": "Conectează-te",
			"sign_into": "Conectează-te cu %1$s",
			"permissions": "Actualizează permisiunile",
			"register": "Înregistrează-te cu %1$s",
			"registering": "Înregistrare cu %1$s",
			"errors": {
				"duplicate": "O sincronizare %1$s este în curs de desfăşurare. Aşteaptă finalizarea şi încearcă din nou.",
				"registering": "Nu se poate înregistra cu %1$s.\n\nÎncearcă din nou mai târziu sau trimite-mi un e-mail %2$s aşa voi putea verifica dacă %3$s API funcţionează bine.\n\nÎmi pare rău pentru incomoditate.",
				"expired": "Conectarea ta la %1$s a expirat. Conectează-te din nou pentru a reîmprospăta permisiunile.",
				"something": "Ops! Ceva nu a mers bine.\n\nPoate că nu ai avut permisiunile de acces pentru a îndeplini însărcinarea. Poate că %1$s este offline sau întâmpină unele probleme în acest moment.\n\nVerifică ce poţi face şi încearcă din nou mai târziu sau raportează această problemă.",
				"disconnected": "Ai fost deconectat de la %1$s. Conectează-te din nou."
			}
		}
	},
	"alerts": {
		"phone": {
			"title": "Apel telefonic",
			"confirm": "Eşti sigur că vrei să apelezi pe \n%1$s?"
		},
		"sms": {
			"title": "Mesaj",
			"confirm": "Eşti sigur că doreşti să trimiţi un mesaj către %1$s?",
			"cannot": "Acest dispozitiv nu poate trimite mesaje SMS."
		},
		"ziperror": "Fişierul \"%1$s\" nu este valid. Probabil că s-a întâmplat ceva când fişierul se descărca - poate încerci să-l descarci din nou.\n\nAcum fişierul va fi şters.",
		"import": {
			"failed": "Ne pare rău, ceva a nu a mers când ai încercat să importezi datele. Nu s-a importat nimic."
		},
		"noemail": "Se pare că e-mailul nu este acceptat pe acest dispozitiv. Ai configurat setările de e-mail în iOS?",
		"restart": "Te rog să reporneşti %1$s pentru ca setările să aibă efect.",
		"yousure": "Eşti sigur că vrei să faci asta?",
		"internet": {
			"cannot": "Nu se poate conecta la internet",
			"tryagain": "Conectează-te şi încearcă din nou",
			"offline": "Nu eşti online acum. Conectează-te la internet şi încearcă din nou."
		},
		"permissions": {
			"calendar": "Nu se pot accesa calendarele dispozitivului. Verifică te rog permisiunile din Configurări > Intimitate > Calendare."
		},
		"tables": {
			"pulldown": "Glisează în jos pentru a reîmprospăta...",
			"release": "Eliberează pentru a reîmprospăta...",
			"loading": "Încărcarea datelor de alimentare"
		}
	},
	"calls": {
		"title": "Vizite",
		"today_none": "Nici o vizită programată pentru astăzi",
		"date_none": "Nici o vizită programată pentru %1$s",
		"today_hint": "Modifică data Vizitei următoare pentru a o vedea aici",
		"actions": {
			"first": "Adaugă prima vizită",
			"another": "Adaugă o nouă vizită",
			"new": "Vizită nouă",
			"verifying": "Verificarea vizitelor",
			"delete": "Şterge vizita",
			"share": "Partajează vizita"
		},
		"types": {
			"first_call": "Vizită iniţială",
			"return_visit": "Vizită ulterioară",
			"magazine_route": "Traseu cu reviste",
			"top_priority": "Prioritate de vârf",
			"bible_study": "Studiu biblic",
			"custom": "Tip personalizat",
			"inactive": "Inactiv"
		},
		"types_abbreviated": {
			"first_call": "VI",
			"return_visit": "VU",
			"magazine_route": "Tr",
			"top_priority": "Pr",
			"bible_study": "SB",
			"custom": "TP",
			"inactive": "I"
		}
	},
	"contacts": {
		"title": "Contacte",
		"contact": "Contact",
		"selected": "%1$s Selectat(e)",
		"name": "Nume",
		"phone": "Telefon",
		"email": "Email",
		"link": "Link",
		"actions": {
			"first": "Adaugă primul contact",
			"another": "Adaugă un contact nou",
			"first_hint": "Fă clic pe butonul + dreapta/sus...",
			"add": "Adaugă contactul",
			"new": "Contact nou",
			"import": "Importă din contactele dispozitivului",
			"verifying": "Verificare contacte",
			"filter": "Filtrează contacte",
			"edit": "Editează contactul",
			"delete": "Şterge contactul",
			"deleted": "Contact şters",
			"message": "Trimite mesaj",
			"share": "Partajează contactul",
			"search": "Caută contacte",
			"search_hint": "Caută Nume sau Adresă"
		},
		"shared": {
			"subject": "Contact partajat din ServicePlanner",
			"intro": "Acest contact a fost partajat cu tine din <a href=\"https://serviceplanner.me\">ServicePlanner</a>. Dacă folosești ServicePlanner, poţi importa acest contact deschizând fişierul ataşat la e-mail.",
			"email": "Rezumat e-mail",
			"file": "Trimite fişierul",
			"choose": "Ce metodă doriţi să folosiţi pentru a partaja acest contact?",
			"import": {
				"confirm": "Eşti sigur că doreşti să importezi acest Contact?\n\nDacă contactul există deja, detaliile sale vor fi suprascrise. Nu se va face nicio modificare a Activităţii sau a Rapoartelor ca urmare a acestui import."
			}
		},
		"headings": {
			"details": "Datele de contact",
			"profile": "Profil",
			"this_visit": "Această vizită",
			"last_visit": "Ultima vizită",
			"next_visit": "Vizita următoare",
			"next_visit_day": "Ziua vizitei",
			"next_visit_on": "Vizita următoare la %1$s"
		},
		"filters": {
			"save": "Salvează configurările curente de filtrare",
			"overwrite": "Suprascrie folosind setările curenten de filtrare",
			"header_include": "Include",
			"footer_include": "Contacte incluse în listă",
			"header_exclude": "Exclude",
			"footer_exclude": "Contacte excluse din listă",
			"include_before": "Include datele înainte de",
			"types": "Tipuri",
			"all": "Toate contactele",
			"default": {
				"bylocality": "Contacte după Localitate",
				"bylocality_desc": "Grupate după Localitate şi sortate după Data vizitei următoare",
				"bytype": "Contacte după Tip",
				"bytype_desc": "Grupate după Tip şi sortate după Data vizitei următoare",
				"inactive": "Contacte inactive",
				"inactive_desc": "Grupate şi sortate după Data vizitei următoare, cele mai vechi primele",
				"overdue": "Contacte restante",
				"overdue_desc": "Grupate şi sortate după Data ultimei vizite, cele mai vechi primele"
			},
			"sorting": {
				"sort_by": "Filtrează după",
				"sort_field": "Teren",
				"sort_value": "Valoare",
				"sort_group_by": "Sortare grupate după",
				"primary": "Sortare primară",
				"secondary": "Sortare secundară",
				"order": "Ordinea sortării",
				"ascending": "Creştere",
				"descending": "Descreştere",
				"asc": "CRES",
				"desc": "DESC",
				"footer": "Ordonaţi contactele listate",
				"footer_grouped": "Ordonaţi contactele din cadrul grupului",
				"last_visit": "Data ultimei vizite",
				"next_visit": "Data vizitei următoare"
			},
			"saved": {
				"saved": "Filtru salvat",
				"default": "Filtru implicit",
				"other": "Alte filtre",
				"name": "Numele filtrului",
				"description": "Descrierea filtrului",
				"delete": "Şterge filtrul",
				"delete_confirm": "Eşti sigur că doreşti să ştergi acest filtru?",
				"reorder": "Reordonaţi filtrele",
				"reorder_save": "Salvează ordinea filtrelor",
				"reset": "Resetează filtrele",
				"reset_confirm": "Aceasta va şterge filtrele personalizate salvate şi va reseta la implicit sistemul filtrelor.\n\nEşti sigur că doreşti să faci acest lucru?",
				"footer": "Glisează pentru a edita sau a şterge un filtru. Utilizează meniul barei de instrumente pentru a schimba ordinea. Filtrul de sus este întotdeauna filtrul implicit."
			},
			"grouping": {
				"group_by": "Grupaţi după",
				"turn_off": "Dezactivaţi gruparea",
				"disabled": "Gruparea este dezactivată",
				"footer": "Gruparea contactelor sub titlurile secţiunii"
			},
			"alerts": {
				"no_types": "Selectează cel puţin un tip de contact",
				"no_matches": "Nu există contacte potrivite",
				"no_matches_hint": "Modifică configurările filtrului",
				"apply_today_filter": "Aceasta va schimba filtrul curent care afişa \"Toate contactele\" cu \"Data vizitei următoare\" setată la %1$s.",
				"apply_on_or_before_filter": "Aceasta va schimba filtrul curent care afişa \"Toate contactele\" cu \"Data vizitei următoare\" pe sau înainte de %1$s."
			}
		},
		"type": "Tip",
		"language": "Limba",
		"tags": "Etichete",
		"tag": "Numele etichetei",
		"placed": "Mt. distrib.",
		"placed_qty": "Cantitatea plasată",
		"no_placements": "Încă nu ai plasat nimic",
		"no_videos": "Încă nu ai arătat niciun video",
		"shown": "Mt. video vizionate",
		"shown_qty": "Total vizualizări",
		"videos": "Vizualizări",
		"visits": {
			"title": "Vizite",
			"visit": "Vizită",
			"type": "Visit Type",
			"by_type": "Vizite după tip",
			"plans": "Planuri",
			"details": "Detalii vizită",
			"next": "Vizita următoare planificată",
			"previous": "Vizite anterioare",
			"no_placements": "Nu există Mt. distrib. sau Vizualizări",
			"days_since": "Zile de la ultima vizită",
			"days_until": "Zile până la vizita urm.",
			"days_overdue": "Zile restante",
			"actions": {
				"first": "Adaugă prima vizită",
				"first_hint": "Fă clic pe butonul + stânga/sus...",
				"new": "Vizită nouă",
				"new_on": "Vizită nouă la %1$s",
				"edit": "Editează vizita",
				"view": "Vizita precedentă",
				"remind": "Trimite un memento",
				"delete": "Şterge vizita",
				"confirmDelete": "Eşti sigur că doreşti să ştergi această vizită? Acest lucru va şterge, în acelaşi timp, vizita şi orice Mt. distrib. din rapoarte.",
				"manual": "Indică o valoare aici pentru a introduce datele raportului în istoric. În caz contrar, înregistrează-ţi vizitele pentru fiecare contact.",
				"plans": {
					"previous": "Planuri anterioare",
					"insert_this": "Inserează în Notiţele acestei vizite",
					"insert_next": "Inserează în Planurile vizitei următoare"
				}
			},
			"types": {
				"not_home": "Lipsă",
				"secular": "Foarte vechi"
			}
		},
		"alerts": {
			"calculated": "Această valoare este calculată automat din Vizitele pe care le faci.",
			"inactive": "Schimbă ca Inactiv",
			"permanent": "Şterge definitiv",
			"confirmDelete": "Doreşti să modifici tipul contactului pentru %1$s ca \"Inactiv\"? Sau doreşti să-l ştergi definitiv?\n\nNotă: Ştergerea unui contact nu elimină vizitele sau Mt. distrib. din Rapoarte (poţi face acest lucru ştergând mai întâi fiecare vizită individual).",
			"confirmDeleteSelected": "Eşti sigur că doreşti să ştergi %1$s contactul(ele) selectat?\n\nSau doreşti mai degrabă să modifici tipul ca \"Inactiv\"?",
			"confirmDate": "Setează data vizitei următoare pentru %1$s contactul(ele) selectat(e) ca:"
		},
		"pickers": {
			"type": "Tipul contactului",
			"type_hint": "Poți redenumi aceste tipuri în Configurări > Fluxuri de lucru",
			"tags": "Selectează tag-uri",
			"thisvisitdate": "Această vizită",
			"nextvisitdate": "Vizita următoare",
			"dateNextVisit": "Data vizitei următoare",
			"next_week": "+ 1 săpt.",
			"next_fortnight": "+ 2 săpt.",
			"next_month": "+ 4 săpt.",
			"location": {
				"title": "Activează locaţia",
				"message": "Activează adresa pentru a utiliza coordonatele GPS din...",
				"my_location": "Locaţia curentă",
				"insert_location": "Inserează locaţia curentă",
				"previous_address": "Inserează adresa precedentă"
			}
		}
	},
	"partners": {
		"partner": "Partener",
		"start": "Ora începerii",
		"end": "Ora finalizării",
		"calendars": {
			"header": "Opţiuni pentru calendarul dispozitivului",
			"device": "Calendare dispozitiv",
			"readonly": "Calendarele doar-citire nu sunt listate",
			"add": "Adaugă în calendar",
			"remove": "Elimină din calendar",
			"notes": "Modifică detaliile evenimentului în ServicePlanner."
		}
	},
	"qrcode": {
		"show": "Afișează codul QR",
		"saved": "Cod QR salvat în Biblioteca ta foto.",
		"error": "Codul QR nu a putut fi salvat în Biblioteca ta foto."
	},
	"maps": {
		"title": "Hărţi",
		"type": {
			"choose": "Alege tipul hărţii:",
			"normal": "Standard",
			"hybrid": "Hibrid",
			"satellite": "Satelit",
			"terrain": "Teren"
		},
		"options": {
			"tracking_on": "Locaţia mea este activată",
			"tracking_off": "Locaţia mea este dezactivată",
			"traffic_on": "Trafic activat",
			"traffic_off": "Trafic dezactivat",
			"poi_on": "Puncte de interes activate",
			"poi_off": "Puncte de interes dezactivate"
		},
		"apps": {
			"applemaps": "Hărţi Apple",
			"googlemaps": "Hărţi Google",
			"waze": "Waze"
		},
		"ask": "Întreabă de fiecare dată",
		"address": {
			"select": "Selectează adresa corectă:",
			"invalid": "Adresa nu este validă. Încearcă din nou.",
			"askapp": "Deschideţi adresa folosind ... "
		},
		"manual": {
			"confirm": "Eşti sigur că doreşti să schimbi locaţia pentru \"%1$s\" cu coordonatele noi?\n\nNotă: Aceasta nu va actualiza adresa scrisă în contacte, ci doar locaţia marcatorului pe hartă."
		},
		"locator": {
			"message": "Ce doreşti să faci cu această adresă?",
			"what": "Ce doreşti să vizualizezi?",
			"current": "Locaţia curentă",
			"contact": "Creați un contact nou",
			"move": "Mutaţi un contact existent"
		},
		"locations": {
			"message": "Ce doreşti să faci?",
			"open_in": "Deschide cu %1$s",
			"drive": "Accesează locaţia",
			"star": "Locaţie cu stea",
			"flag": "Flag la teritoriu",
			"car": "Locaţia maşinii",
			"hall": "Sala Regatului",
			"home": "Acasă",
			"set": "Setează %1$s",
			"remove": "Elimină marcatorul locaţiei"
		}
	},
	"addresses": {
		"address": "Adresă",
		"geocode": "Geo-cod",
		"location": "Locaţia",
		"locations": "Locaţii",
		"locality": "Localitate",
		"unit": "Unitate",
		"units": "Unități",
		"floor": "Etaj",
		"ground": "Parter",
		"number": "Număr",
		"street": "Stradă",
		"city": "Oraş",
		"postcode": "Cod poştal",
		"locale": "Local",
		"components": "Componentele adresei",
		"latitude": "Latitudine",
		"longitude": "Longitudine",
		"suburb": "Suburbie",
		"county": "Judeţ",
		"state": "Stat",
		"state_code": "Codul statului",
		"country": "Ţară",
		"country_code": "Codul ţării",
		"place_id": "ID-ul locaţiei",
		"place_id_hint": "ID-ul locaţiei Google",
		"formatted": "Formatată",
		"formatted_hint": "Adresa completă",
		"actions": {
			"lookup": "Căutare adresă",
			"lookup_footer": "Aceasta va căuta adresa introdusă şi va completa automat componentele geocodului şi adresei. Sau poţi edita manual toate detaliile adresei de mai jos.",
			"lookup_location": "Caută locația",
			"lookup_location_footer": "Aceasta va căuta locaţia ta curentă şi va completa automat adresa, geocodul şi componentele adresei. Sau poţi edita manual toate detaliile de mai jos.",
			"current_location": "Foloseşte locaţia curentă",
			"current_location_footer": "Aceasta va detecta automat latitudinea şi longitudinea curentă."
		}
	},
	"territories": {
		"name": "Numele congregaţiei",
		"pick": "Care teritoriu?",
		"none": "Nu aţi creat încă niciun teritoriu.",
		"map_number": "Harta %1$s",
		"map_number_type": "Harta %1$s (%2$s)",
		"add": {
			"new": "Adaugă un teritoriu nou",
			"sorry": "În prezent, doar teritoriile importate din Territory Helper (territoryhelper.com) beneficiază de suport. Într-o actualizare ulterioară, vei putea crea manual propriul Teritoriu. Vă mulţumim pentru răbdare.",
			"import": "Importă din Territory Helper",
			"manual": "Creaţi manual"
		},
		"search": {
			"congregation": "Căutare %1$s hărţi",
			"map": "Căutare hărţi %1$s (%2$s)"
		},
		"maps": {
			"none": "Nu există încă hărţi pentru acest Teritoriu.",
			"types": "Tipuri de hărţi",
			"types_footer": "Reordonaţi sau faceţi clic pentru a schimba culoarea",
			"type": "Tipul hărţii",
			"details": "Detaliile hărţii",
			"number": "Numărul hărţii",
			"label": "Eticheta hărţii",
			"image": "Imaginea hărţii",
			"assigned": "Repartizate",
			"assigned_to": "Repartizat pentru %1$s",
			"unassigned": "Nerepartizate"
		},
		"locations": {
			"details": "Detalii locaţie",
			"type": "Tipul locaţiei",
			"status": "Starea locaţiei",
			"language": "Limba locaţiei",
			"first": "Adaugă prima locaţie",
			"add_to": "Adaugă la harta %1$s",
			"visibility": {
				"title": "Vizibilitate",
				"approved": "Aprobată pentru afişare",
				"unapproved": "Încă nu a fost aprobată"
			}
		},
		"units": {
			"floor_hint": "Etajul 0 = Parter",
			"details": "Detaliile unității",
			"type": "Tipul unității",
			"status": "Starea unității",
			"add": "Adaugă o unitate"
		},
		"statistics": {
			"title": "Statistici",
			"unique": "Unice"
		},
		"types": {
			"house": "Casă",
			"apartment": "Apartament",
			"business": "Comercial",
			"trainstation": "Staţie de tren",
			"busstation": "Staţie de autobuz",
			"school": "Şcoală",
			"store": "Magazin",
			"language": "Limbă",
			"harbour": "Port",
			"airport": "Aeroport",
			"truckstop": "Staţie de camioane",
			"elderlyhome": "Azil de bătrâni",
			"park": "Parc",
			"camp": "Tabără",
			"restaurant": "Restaurant",
			"hotel": "Hotel",
			"vacation": "Casă vacantă"
		},
		"statuses": {
			"unknown": "Necunoscut",
			"returnvisit": "Vizită ulterioară",
			"biblestudy": "Studiu biblic",
			"donotcall": "Nu vizitaţi",
			"eldersonly": "Doar bătrânii",
			"locked": "Încuiat",
			"lettersonly": "Doar scrisori",
			"vacant": "Vacantă",
			"notrespassing": "Acces interzis",
			"daysleeper": "Doarme ziua",
			"witness": "Martor",
			"phoneonly": "Doar telefonic",
			"referral": "Recomandare",
			"bewareofdog": "Feriţi-vă de câine"
		},
		"visits": {
			"add": "Adaugă o vizită",
			"delete": "Şterge vizita",
			"status": "Starea vizitei",
			"visited": {
				"last": "Ultima vizită",
				"never": "Niciodată vizitat",
				"date": "Data vizitei"
			},
			"statuses": {
				"unvisited": "Nevizitat",
				"visited": "Vizitat",
				"skipped": "Omis",
				"nothome1": "Lipsă 1",
				"nothome2": "Lipsă 2",
				"nothome3": "Lipsă 3"
			}
		},
		"languages": {
			"unknown": "Limbă necunoscută"
		},
		"filters": {
			"matches": "Nu există potriviri pentru filtrul actual",
			"change": "Te rugăm să modifici setările de filtrare",
			"maps": {
				"title": "Filtrare hărţi",
				"include": {
					"title": "Hărți de inclus",
					"all": "Toate hărţile",
					"assigned": "Repartizate în prezent",
					"mine": "Repartizate mie"
				},
				"group": {
					"title": "Grupaţi după",
					"type": "Tipul hărţii",
					"none": "Nicio grupare"
				},
				"sort": {
					"title": "Sortaţi după",
					"number": "Numărul hărţii",
					"oldest": "Cele mai vechi primele",
					"assigned": "Repartizate recent",
					"addresses": "Adrese unice"
				}
			},
			"locations": {
				"title": "Filtrarea locaţiilor",
				"types": "Locaţia şi tipurile unităților",
				"statuses": "Locaţia & starea unităților",
				"languages": "Locaţia & limbile unităților",
				"apply_list": "Aplică la listă",
				"apply_map": "Aplică la hartă"
			}
		},
		"th": {
			"form": {
				"import": "Importă hărţi",
				"nosync": "Detaliile contului Territory Helper nu sunt sincronizate între dispozitive. Te rugăm să te conectezi pe fiecare dispozitiv.",
				"geocode": "Apasă butonul de localizare din partea dreaptă a câmpului de adresă pentru a geocoda adresa cu coordonatele latitudinii şi longitudinii.",
				"address": "Detaliile privind adresa pot fi modificate numai în Territory Helper.",
				"online": "Trebuie să fii online pentru a modifica datele din Territory Helper.",
				"details": "Aceste detalii provin de la Territory Helper.",
				"privacy": "Notiţele sunt stocate în Territory Helper. Asigură-te că notiţa respectă legile locale privind confidenţialitatea datelor.",
				"list": "Această listă provine de la Territory Helper.",
				"remove": "Eşti sigur că vrei să elimini Teritoriul \"%1$s\" din ServicePlanner?"
			},
			"setup": {
				"publisher": "Obţinerea detaliilor vestitorului",
				"congregaton": "Obţinerea detaliilor congregaţiei"
			},
			"sync": {
				"title": "Utilizează butonul de reîmprospătare",
				"hint": "Utilizează butonul de reîmprospătare dreapta/sus pentru a obţine ultimele date ale hărţilor de la Territory Helper.",
				"importing": "Importarea hărţilor teritoriului ...",
				"wait": "Așteaptă până când sunt importate hărţile din Territory Helper.",
				"map": "Actualizează datele hărţii",
				"location": "Actualizează datele locaţiei",
				"sending": "Trimiterea modificărilor la Territory Helper"
			},
			"assignments": {
				"status": "Starea repartizării",
				"assigned": "Repartizat",
				"assigned_to": "Repartizat pentru %1$s",
				"assigned_me": "Repartizat mie",
				"assigned_date": "Repartizat %1$s (%2$s zile)",
				"assigned_none": "Nu mi-au fost repartizate hărţi",
				"not": "Nerepartizate în prezent",
				"request": "Solicită harta",
				"request_made": "Solicitarea hărții a fost trimisă. Te rugăm să aştepţi ca slujitorul responsabil de teritorii să proceseze solicitarea.",
				"return": "Returnare ca lucrat",
				"unworked": "Returnare ca nelucrat"
			},
			"roles": {
				"0": "Vestitor",
				"10": "Avansat",
				"30": "Bătrân",
				"35": "Supraveghetor",
				"40": "Asistent",
				"50": "Administrator",
				"60": "Traducător",
				"100": "Administrator de sistem"
			},
			"permissions": {
				"reset": "Resetează permisiunile",
				"low": "Ne pare rău, nu ai permisiunea de a face această însărcinare în Territory Helper.",
				"changed": "Dacă permisiunile tale din Territory Helper au fost recent actualizate, te rugăm să accesezi setările de teritoriu din ServicePlanner şi \"Resetează permisiunile\"."
			}
		}
	},
	"today": {
		"title": "Astăzi",
		"plugins": {
			"timer": "Cronometru",
			"media": "Mt. video",
			"bookshelf": "Publicaţii",
			"territories": "Teritorii",
			"contacts": "Contacte de vizitat",
			"hours": "Rezumatul orelor",
			"activity": "Activitatea"
		},
		"settings": {
			"title": "Setări Astăzi",
			"plugins": "Pluginuri",
			"heading": "Rubrică",
			"activity": "Activitatea - elemente plugin",
			"hours": "Rezumatul orelor - elemente plugin"
		}
	},
	"timer": {
		"stop": "Stop cronometru",
		"start": "Start cronometru",
		"pause": "Pauză cronometru",
		"resume": "Reluare cronometru",
		"confirm": {
			"more": "Ai nevoie de cel puţin 5 minute pentru a putea raporta.",
			"message": "Doreşti să adaugi %1$s (%2$s) la activitatea pentru %3$s?",
			"ministry": "Adaugă la orele de predicare",
			"other": "Adaugă la orele %1$s",
			"stop": "Doar opreşte cronometrul",
			"done_ministry": "%1$s (%2$s) au fost adăugate la Orele de Predicare pentru %3$s.",
			"done_other": "%1$s (%2$s) au fost adăugate la Orele %3$s pentru %4$s."
		}
	},
	"library": {
		"title": "Bibliotecă"
	},
	"clipboard": {
		"cover": {
			"add": "Adaugă coperta",
			"title": "Poţi alege o copertă din biblioteca foto sau poţi insera o imagine pe care ai copiat-o în clipboard...",
			"choose": "Alege foto",
			"clipboard": "Utilizează imaginea Clipboard",
			"zoom": "Afişare copertă",
			"remove": "Elimină coperta"
		},
		"paste": {
			"no_image_title": "Nicio imagine găsită",
			"no_image_message": "În prezent, în clipboard nu există nicio imagine.\n\nLocalizează o imagine în browser sau într-o aplicaţie care permite copierea imaginilor, apasă şi menţine apăsat, apoi \"Copie\" imaginea în clipboard."
		}
	},
	"bookshelf": {
		"title": "Raft de cărţi",
		"publications": "Publicaţii",
		"hints": {
			"first_item": "Apasă + pe bara de instrumente pentru a adăuga %1$s",
			"add_item": "Apasă + pe bara de instrumente pentru a adăuga %1$s",
			"no_recent": "Articolele recente sunt adăugate între timp. Alege \"Tot\" pe bara de instrumente pentru a selecta primul articol."
		},
		"default": {
			"description": "Poți folosi butonul \"+\" de pe bara de instrumente de mai sus pentru a adăuga publicații la această categorie.\n\nPentru început, ai dori să adaugi unele publicații ca implicite? Le poți edita sau șterge în orice moment.",
			"confirm": "Ai dori să adaugi unele publicații ca implicite la această categorie? Aceasta va încerca să omită introducerea duplicatelor bazânduse pe abrevierea publicației.",
			"button": "Adaugă %1$s implicite"
		},
		"sections": {
			"magazines": "Reviste",
			"awake": "Treziţi-vă!",
			"watchtower": "Turnul de veghe",
			"books": "Cărţi",
			"brochures": "Broşuri",
			"tracts": "Pliante",
			"invites": "Invitaţii",
			"other": "Alte"
		},
		"singular": {
			"magazines": "Revistă",
			"awake": "Treziţi-vă!",
			"watchtower": "Turnul de veghe",
			"watchtower_public": "Turnul de veghe (Public)",
			"watchtower_study": "Turnul de veghe (Studiu)",
			"watchtower_simplified": "Turnul de veghe (Simplificat)",
			"books": "Carte",
			"brochures": "Broşură",
			"tracts": "Pliant",
			"invites": "Invitaţie",
			"other": "Publicaţie",
			"card": "Carte de vizită",
			"letter": "Scrisoare",
			"link": "Link"
		},
		"form": {
			"new": "%1$s nou(ă)",
			"today": "Adaugă pe ecranul Astăzi",
			"remove": "Elimină de pe ecranul Astăzi",
			"header": "Detalii publicaţie",
			"advanced": "Detalii avansate",
			"abbr": "Abreviere",
			"url": "URL site web (www)",
			"issue": "Ediţia",
			"issue_number": "Nr.",
			"title": "Titlu",
			"locations": "Descarcă locaţii",
			"pdf_url": "Descarcă URL",
			"epub_url": "Descarcă URL",
			"short_title": "Titlu scurt (Recomandat)",
			"published": "Anul publicării",
			"count": "Calculează ca mat. distr.",
			"confirmTodayAdded": "Această publicaţie a fost adăugată pe ecranul Astăzi.",
			"confirmTodayRemoved": "Această publicaţie a fost eliminată de pe ecranul Astăzi.",
			"confirmDelete": "Eşti sigur că doreşti să ştergi %1$s \"%2$s\"?\n\nAcest lucru nu poate fi anulat.",
			"cannot_delete": "Această publicaţie a fost plasată şi nu poate fi ştearsă.\n\nPoţi folosi Filtrele pentru a găsi persoanele care au această publicaţie în Bibliotecă şi şterge mai întâi mat. distr. manual.",
			"tips": {
				"lookup": "Acest buton de căutare este doar un ajutor. El va încerca să te ajute la completarea detaliilor publicaţiei. Cu toate acestea, uneori va afişa rezultate incomplete sau goale. Astfel, va trebui să introduci manual detaliile lipsă ale publicaţiei.",
				"no_image": "Acest buton nu va mai insera imaginea-copertă pentru publicaţii. Poţi folosi butonul “Adaugă coperta” pentru a face acest lucru singur. Consultă secţiunea Ajutor de pe site pentru mai multe detalii.",
				"abbr": {
					"books": "Abreviere (bh, lv ...)",
					"brochures": "Abreviere (fg, lc ...)",
					"tracts": "Abreviere (T-36, T-37 ...)"
				}
			},
			"errors": {
				"abbreviation": "Se pare că nu există detalii pentru abrevierea acestei publicaţii în limba selectată. Încearcă o altă abreviere sau introdu manual detaliile publicaţiei.",
				"imported": "Această publicaţie a fost importată şi nu este legată de nicio publicaţie din Biblioteca ta ServicePlanner."
			}
		}
	},
	"media": {
		"title": "Multimedia",
		"videos": "Materiale video",
		"video": "Material video",
		"default": {
			"description": "Poți folosi butonul \"+\" de pe bara de instrumente de mai sus pentru a adăuga materiale video la această categorie.\n\nPentru început, ai dori să adaugi unele materiale video generice? Acestea pot fi folosite pentru a raporta materialele video arătate la locatari, fără a fi necesar de adăugat fiecare material video disponibil. Le poți edita sau șterge în orice moment.",
			"confirm": "Ai dori să adaugi unele materiale video generice la această categorie? Aceasta va încerca să omită introducerea duplicatelor.",
			"button": "Adaugă mt. video generice",
			"section": "Video - secțiunea %1$s"
		},
		"sections": {
			"ministry": "Predicare",
			"study": "Studiu biblic",
			"children": "Copii",
			"whiteboard": "Animaţii",
			"songs": "Cântări",
			"other": "Alte"
		},
		"singular": {
			"videos": "Material video",
			"ministry": "Video pt. predicare",
			"study": "Video la studiu",
			"children": "Video pt. copii",
			"whiteboard": "Animaţie pe tablă",
			"songs": "Cântare",
			"other": "Video"
		},
		"plural": {
			"videos": "Materiale video",
			"ministry": "Video pt. predicare",
			"study": "Video la studiu",
			"children": "Video pt. copii",
			"whiteboard": "Animaţii pe tablă",
			"songs": "Cântări",
			"other": "Video"
		},
		"sizes": {
			"240": "240p",
			"360": "360p",
			"480": "480p",
			"720": "720p"
		},
		"form": {
			"new": "%1$s nou(ă)",
			"today": "Adaugă pe ecranul Astăzi",
			"remove": "Elimină de pe ecranul Astăzi",
			"header": "Detalii video",
			"downloaded_footer": "Mt. video descărcate nu vor fi sincronizate prin Dropbox",
			"advanced": "Detalii avansate",
			"duration": "Durata",
			"locations": "Locaţii video",
			"website": "Adresa site-ului",
			"website_url": "Adresa URL a site-ului",
			"broadcast_url": "URL Broadcasting",
			"no_broadcast_url": "Introdu o adresă URL Broadcasting validă. Mergi la jw.org, găseşte mat. video pe care doreşti să-l adaugi, apoi copie adresa URL din bara de adrese în acest câmp.",
			"online": "Resurse online",
			"download_url": "Descărcă URL",
			"download": "Descărcă Video",
			"downloaded": "%1$s descărcat",
			"title": "Titlu",
			"short_title": "Titlu scurt (recomandat)",
			"play": "Redă %1$s",
			"stream": "Emite %1$s",
			"confirm_today_added": "Acest video a fost adăugat pe ecranul Astăzi.",
			"confirm_today_removed": "Acest video a fost eliminat de pe ecranul Astăzi.",
			"confirm_delete": "Eşti sigur că doreşti să ştergi %1$s \"%2$s\"?\n\nAcest lucru nu poate fi anulat.",
			"cannot_delete": "Acest video a fost vizionat de contacte şi nu poate fi şters.\n\nPoţi folosi Filtrele pentru a găsi persoanele care au vizionat acest video şi şterge mai întâi materialul video manual.",
			"no_videos": "Nu ai definit nici o locaţie pentru acest video.",
			"tips": {
				"lookup": "Acest buton de căutare este doar un ajutor. El va încerca să te ajute la completarea detaliilor video. Cu toate acestea, uneori va afişa rezultate incomplete sau goale. Astfel, va trebui să introduci manual detaliile lipsă ale mt. video.",
				"no_image": "Acest buton nu va mai insera imaginea-copertă pentru materiale video. Poţi folosi butonul “Adaugă coperta” pentru a face acest lucru singur. Consultă secţiunea Ajutor de pe site pentru mai multe detalii."
			},
			"errors": {
				"url": "Se pare că nu există o adresă URL Broadcasting validă pentru limba selectată. Introdu o adresă URL Broadcasting validă sau selectează o altă limbă şi încearcă din nou. În caz contrar, introdu manual detaliile materialului video.",
				"imported": "Acest video a fost importat şi nu este asociat cu niciun video din Biblioteca ta ServicePlanner.\n\nPoţi re-adăuga materialele video la vizitele tale dacă doreşti să actualizezi această listă."
			}
		}
	},
	"languages": {
		"single": "Limbă",
		"multiple": "Limbi",
		"available": "%1$s disponibile",
		"selected": "%1$s selectate",
		"other": "Alte %1$s",
		"search": "Caută o %1$s",
		"app": {
			"title": "Limba aplicației",
			"hint": "Folosită pentru butoane și etichete",
			"restart": "Repornește aplicația pentru schimbarea limbii."
		},
		"beta": {
			"title": "Traduceri incomplete (Beta)",
			"hint": "Trimite un e-mail la support@serviceplanner.me pentru ajutor"
		},
		"chinese": {
			"options": "Opţiuni chinezeşti",
			"characters": "Doar caractere",
			"pi": "Pinyin",
			"zhu": "Zhuyin",
			"lau": "Sidney Lau",
			"yale": "Yale",
			"twoline": "2-Linii %1$s",
			"oneline": "Doar %1$s"
		}
	},
	"websites": {
		"tasks": {
			"bookmark": "Adaugă ca marcaj",
			"video": "Adaugă video",
			"video_cat": "În ce categorie doreşti să adaugi acest video?",
			"briefcase": "Adaugă în mapă",
			"safari": "Deschide în Safari",
			"copy": "Copiere URL",
			"email": "E-mail vizualizare citire"
		},
		"bookmarks": {
			"none": "Nu există marcaje salvate",
			"first": "Apropo: Navighează la un site Web. Apoi, vei putea marca site-ul folosind butoanele barei de instrumente.",
			"added": "Marcaj adăugat"
		},
		"icon": {
			"add": "Adaugă pictograma",
			"title": "Poţi alege o pictogramă din biblioteca foto sau poţi insera o imagine pe care ai copiat-o în clipboard...",
			"zoom": "Afişează pictograma",
			"remove": "Elimină pictograma"
		},
		"browser": {
			"search": "Caută sau introdu URL-ul la site",
			"reader": "Afișare cititor disponibilă",
			"2line": "Romanizare disponibilă",
			"video": "Video detectat"
		},
		"form": {
			"new": "%1$s nou",
			"today": "Adaugă pe ecranul Astăzi",
			"remove": "Elimină de pe ecranul Astăzi",
			"header": "Detalii site",
			"footer": "Parametri locali ai adresei URL: %Y (Year), %m (month), %d (day)",
			"advanced": "Detalii complexe",
			"share_link": "Partajare link",
			"website": "Adresa site-ului",
			"website_url": "Adresa URL a site-ului",
			"online": "Resurse online",
			"title": "Titlu",
			"short_title": "Titlu scurt (recomandat)",
			"confirm_today_added": "Acest site web a fost adăugat pe ecranul Astăzi.",
			"confirm_today_removed": "Acest site web a fost eliminat de pe ecranul Astăzi.",
			"confirm_delete": "Eşti sigur că doreşti să ştergi %1$s \"%2$s\"?\n\nAcest lucru nu poate fi anulat.",
			"errors": {
				"url": "Se pare că adresa URL nu este validă. Încearcă din nou."
			}
		}
	},
	"activity": {
		"title": "Activitatea",
		"current": "Actual",
		"reports": "Rapoarte",
		"month": "Luna",
		"year": "Anul",
		"other": "Alte",
		"manual": "Manual",
		"auto": "Calculat",
		"planned": "Planificate",
		"scheduled": "Programate",
		"ministry": "Predicare",
		"theocratic": "Teocratic",
		"personal": "Personal",
		"actual": "Actual",
		"report": {
			"title": "Raport pentru %1$s",
			"send": "Trimite raportul",
			"hours": "Ore",
			"credits": "Credit",
			"minutes": "%1$s minute",
			"hours_ministry": "Ore în predicare",
			"hours_other": "%1$s ore",
			"hours_under_planned": "%1$s sub planificare",
			"hours_over_planned": "%1$s peste planificare",
			"hours_progress": "%1$s din %2$s ore",
			"hours_under": "%1$s sub",
			"hours_over": "%1$s peste",
			"hours_behind": "%1$s în urmă",
			"hours_ahead": "%1$s înainte",
			"hours_ok": "La zi",
			"hours_met": "Obiectiv atins",
			"hours_projected": "%1$s preconizate",
			"hours_projected_short": "%1$s P.",
			"hours_reported": "%1$s raportate",
			"hours_reported_short": "%1$s R",
			"hours_total": "%1$s total",
			"hours_total_short": "%1$s T",
			"hours_show": "Afișează orele în calendar",
			"hours_hide": "Ascunde orele în calendar",
			"placements": "Mat. distr.",
			"placements_show": "Afișează materiale, vizualizări, VU",
			"placements_hide": "Ascunde materiale, vizualizări, VU",
			"mileage": "Distanţa parcursă",
			"videos": "Mat. video",
			"visits": "Vizite ulter.",
			"visits_all": "Toate tipurile de vizite",
			"studies": "Studii biblice",
			"studies_unique": "Studii biblice diferite",
			"nothing": "Încă nu a fost raportat nimic",
			"remove": "Elimină din raport"
		},
		"hours": {
			"target": "Obiectiv lunar",
			"target_total": "Obiectiv total",
			"target_alert": "Stabileşte obiectivul pentru luna respectivă. Acest lucru va suprascrie Obiectivul lunar implicit stabilit în Configurări > Planificare.",
			"carried_title": "Minute reportate",
			"carried_label": "Din ultima lună",
			"planned": "Ore planificate",
			"planned_total": "Total planificat",
			"planned_ok": "= Obiectiv",
			"actual": "Ore efective",
			"progress": "Total până acum",
			"future": "Planificate pe viitor",
			"summary": "Rezumatul activităţii",
			"total": "Total ore",
			"calculated": "Calculate",
			"projected": "Ore preconizate",
			"reported": "Ore raportate",
			"credits": {
				"add": "Adaugă credit de ore",
				"delete": "Şterge credit de ore",
				"singular": "Credit de ore",
				"plural": "Credite de ore",
				"reason": "Motiv",
				"hint": "ex. Şcoala pentru pionieri",
				"hours": "Credit de ore",
				"confirmDelete": "Eşti sigur că doreşti să ştergi acest credit de ore?"
			},
			"footers": {
				"goals": "Poţi trece peste obiectivul lunar prestabilit",
				"planned": {
					"over": "%1$s peste obiectivul planificat",
					"under": "%1$s pentru aţi atinge obiectivul",
					"ok": "Orele planificate = obiectivul lunar"
				},
				"actual": {
					"ahead": "Până acum eşti cu %1$s înaintea planificării",
					"behind": "Până acum eşti cu %1$s în urma planificării",
					"ok": "Eşti la zi cu orele planificate"
				},
				"projected": {
					"over": "Vei fi cu %1$s peste obiectivul acestei luni",
					"under": "Vei fi cu %1$s sub obiectivul acestei luni",
					"ok": "Eşti la zi cu atingerea obiectivului acestei luni"
				},
				"projected_goal": {
					"over": "Eşti cu %1$s peste obiectivul lunar",
					"under": "Eşti cu %1$s sub obiectivul lunar",
					"ok": "Ai îndeplinit obiectivul lunar"
				},
				"projected_planned": {
					"over": "Vei fi cu %1$s peste orele planificate",
					"under": "Vei fi cu %1$s sub orele planificate",
					"ok": "Vei realiza orele planificate"
				}
			}
		},
		"notes": {
			"none": {
				"title": "Nicio notiță pentru afișare",
				"description": "Această listă va afișa toate notițele începând cu luna din calendar selectată în acest moment și mai departe."
			}
		},
		"service_year": {
			"summary": "Rezumatul anului de serviciu %1$s"
		},
		"send": {
			"greeting": "Salut %1$s,",
			"intro": "Iată raportul meu pentru %1$s:",
			"carried": "%1$s minute au fost reportate pe luna viitoare (km 9/88 3)",
			"credit_hours": {
				"included_hours": "Timpul raportat include %1$s ore credit pentru %2$s.",
				"comment_only": "Te rog, notează %1$s ore credit pentru %2$s."
			},
			"other_hours": {
				"included_hours": "Timpul raportat include %1$s %2$s.",
				"adjusted_hours": "Timpul raportat include unele credite de ore ce provin de la %1$s %2$s.",
				"comment_only": "Te rog, notează %1$s %2$s."
			}
		},
		"schedule": {
			"daily_apply": "Aplică planificarea zilnică",
			"daily_confirm": "Aceasta va fi trecută peste fiecare zi din %1$s şi va aplica obiectivele zilnice în coloana Orelor planificate.",
			"recalc_apply": "Recalculare Totaluri raport",
			"recalc_confirm": "Aceasta va fi trecută peste fiecare zi din %1$s şi va recalcula Totalurile raportului lunii."
		},
		"alerts": {
			"manual_ttl": "Mat. distr. manual",
			"manual_msg": "Aceste Mat. distr. manual nu au legătură cu vreun contact sau o vizită.",
			"videos_ttl": "Vizualizări",
			"videos_ttl_manual": "Vizualizări manuale",
			"videos_msg": "Aceste vizualizări nu au legătură cu vreun contact sau o vizită."
		}
	},
	"settings": {
		"title": "Configurări",
		"dropbox": {
			"title": "Sincronizare Dropbox",
			"connect": "Conectare la Dropbox",
			"connect_footer": "Conectează-te la Dropbox pentru a salva automat datele sau pentru a sincroniza între mai multe dispozitive.\nDacă nu aveţi un cont Dropbox, veţi putea crea gratuit unul.",
			"disconnect": "Deconectare de la Dropbox",
			"confirm_disconnect": "Sigur doreşti să te deconectezi de la Dropbox şi să opreşti sincronizarea datelor?",
			"last_sync": "Ultima sincronizare: %1$s",
			"sync_options": "Opţiuni de sincronizare",
			"auto_sync": "Auto-sincronizare",
			"wifi_only": "Limitaţi Auto-sincronizarea la Wi-fi",
			"sync_now": "Sincronizaţi toate fişierele acum",
			"sync_complete": "Sincronizare completă",
			"syncing": "Se sincronizează ...",
			"account": {
				"details": "Cont conectat",
				"name": "Nume",
				"email": "E-mail"
			}
		},
		"backup": {
			"title": "Backup manual",
			"button": "Backup de fişiere acum",
			"last": "Ultimul Backup: %1$s",
			"footer": "Trimite un backup de fişere a aplicaţiei",
			"confirm": {
				"title": "Generează un Backup",
				"progress": "Se generează Backup-ul ...",
				"message": "Aceasta va genera un fişier ZIP. Poţi alege unde/cum să salvezi fişierul.\n\nGenerarea fişierului de backup ar putea dura câteva secunde."
			},
			"reminder": {
				"enable": "Activare notificări Backup",
				"7day": "La fiecare 7 zile",
				"14day": "La fiecare 14 zile",
				"30day": "La fiecare 30 zile",
				"60day": "La fiecare 60 zile",
				"alert": {
					"title": "Notificare Backup",
					"message": "Este timpul pentru un backup de fişiere. Dorești să generezi backup-ul acum?\n\nPoţi configura aceste notificări despre backup în Configurări."
				}
			},
			"restore": {
				"title": "Restaurează un Backup",
				"progress": "Restaurare Backup ...",
				"restored": "Datele restaurate",
				"confirm": "Eşti sigur că doreşti să restaurezi datele din fișierul ZIP?\n\nAcest lucru va înlocui toate datele curente din această instalare a ServicePlanner.",
				"complete": "Fişierele au fost restaurate cu succes.\n\nAnumite tipuri de conţinut restaurat va fi afişat doar după ce restartezi ServicePlanner.",
				"blocked": "Ceva nu a mers cu fişierul ZIP.\n\nRestaurarea a fost blocată şi nu a fost modificat nimic în această instalare a ServicePlanner.",
				"cancelled": "Restaurarea a fost anulată şi nu a fost modificat nimic în această instalare a ServicePlanner."
			}
		},
		"appearance": {
			"title": "Aspect",
			"color": "Culoare temă"
		},
		"workflow": {
			"title": "Fluxuri de lucru",
			"next_visit": "Zile până la vizita urm.",
			"turn_orange": "Zile până la Orange",
			"turn_red": "Zile până la Roşu",
			"turn_blood": "Zile până la Roşu închis",
			"default_visit_type": "Implicit la Tipul vizitei",
			"visit_time": "Foloseşte timpul programat",
			"hints": {
				"overview": "Fluxurile de lucru au grijă de ceea ce se va întâmpla atunci când adaugi o vizită nouă la un contact.\n\nFiecare Tip de contact are propriile sale reguli ale fluxului de lucru. De exemplu, dacă adaugi o vizită nouă la un tip de Contact = \"Studiu  biblic\", atunci tu dorești ca Tipul vizitei să fie setat ca \"Vizită ulterioară\" la mod implicit. Și tu dorești ca vizita următoare să fie planificatâ în mod automat peste un număr de X zile în viitor.\n\nÎn mod normal ora vizitei următoare este setat la ora viztei pe care o adaugi la moment, presupunând logic că dacă ai reușit cu succes să contactezi persoana la această oră astăzi, atunci încearcă la aceeași oră din nou și la vizita următoare. În orice caz tu poți configura ca Fluxul de lucru să folosească în schimb \"Ora planificată\" a vizitei precedente - de ex. re-folosește ora vizitei planificate, nu ora la care vizita a început să fie înregistrată în notițe. Acest lucru este foarte la îndemână, de exemplu, pentru Studiile biblice ținute la aceeași oră în fiecare săptămână.\n\nIar opțiunile \"Zile până la...\" îți permit să controlezi numărul de zile înainte ca indicatorii de dată și etichete să-și schimbe culoarea.\n\nSimte-te liber să experimentezi și să personalizezi regulile pentru a se potrivi cât mai bine la Fluxul de lucru personal! Ai putea chiar să faci clic pe un anumit Tip de contact și îl poți redenumi.",
				"visit_time": "Implicit la ora actuală",
				"next_visit": "Acest număr va fi utilizat pentru a stabili automat Data vizitei următoare.",
				"change_color": "Numărul de zile este calculat de la Data ultimei vizite.",
				"default_visit_type": "Când se adaugă o Vizită nouă, aceasta va fi implicită pentru acest Tip de vizită.",
				"restart": "Modificarea acestei configurări nu va avea efect până la repornirea aplicaţiei."
			}
		},
		"partners": {
			"title": "Parteneri",
			"event": {
				"calendar": "Calendar implicit",
				"event": "Calendar eveniment",
				"event_footer": "Se aplică doar pentru primul partener",
				"auto_add": "Adaugă automat în Calendar",
				"tentative_title": "Titlul evenimentului - încercare",
				"tentative_event": "Predicare cu %n?",
				"confirmed_title": "Titlul evenimentului - confirmat",
				"confirmed_event": "Predicare cu %n",
				"footer": "%n = Numele partenerului"
			},
			"name": {
				"title": "Numele partenerului",
				"full": "Numele complet",
				"first": "Prenume"
			}
		},
		"schedule": {
			"title": "Planificare",
			"form": {
				"annual_goal": "Obiectiv anual",
				"monthly_goal": "Obiectiv lunar",
				"daily_goals": "Obiective zilnice",
				"daily_footer": "Resetaţi la necompletat (—) pentru a omite ziua când aplicaţi Planificarea la o lună din meniul \"...\" a ecranului Activitatea."
			}
		},
		"reporting": {
			"title": "Rapoarte",
			"overseer": {
				"send_to": "Trimite raportul la",
				"name": "Nume",
				"mobile": "Mobil",
				"email": "E-mail"
			},
			"apps": {
				"method": "Trimite raportul folosind",
				"not_installed": "%1$s nu pare să fie instalat pe acest dispozitiv. Alege altă metodă."
			},
			"calendar": {
				"title": "Calendarul săptămânii începe cu"
			},
			"hours": {
				"time": {
					"title": "Raportarea orelor",
					"tick": "A participat la predicare",
					"hours": "Ore întregi (implicit)",
					"minutes": "15 Minute treptat",
					"footer": "Doar ca măsură specială"
				},
				"other": {
					"title": "Alte ore",
					"enable": "Activează Alte ore",
					"label": "Ca etichetă",
					"one_word": "Menţine eticheta la un singur cuvânt.",
					"options": {
						"title": "Opțiuni - Alte ore",
						"include_hours": "Include în Orele de activitate",
						"include_report": "Include în Orele raportului",
						"include_comment": "Include în Nota raportului",
						"include_breakdown": "Include împărțirea orelor",
						"maximum_hours": "Maximum Alte ore",
						"footer": "Alte ore vor fi reduse dată totalul lunii va fi peste maximum."
					}
				},
				"alerts": {
					"format_prompt_title": "Alege formatul raportului",
					"format_prompt_message": "Ai dori să raportezi orele tale (dacă ești pionier) sau doar că ai participat la predicare?\n\nPoți schimba ca implicit la Configurări > Rapoarte în orice moment.\n\nPe fila Activitatea poți schimba formatul raportului pentru o anumită lună. De asemenea, poți alege că să afișezi ori să ascunzi orele tale din (vezi meniul de oțiuni din dreapta / sus).",
					"format_tick": "Rapotează participarea la predicare ✓",
					"format_hours": "Raportează toate orele",
					"month_switch_title": "Schimbă formatul raportului",
					"month_switch_hours": "Ai dori să schimbi la raportarea tuturor pentru această lună?\n\nNotă: Aceasta nu va afecta orele afișate în calendar care sunt controlate din meniul dreapta / sus.",
					"month_switch_tick": "Ai dori să schimbi doar la indicarea faptului că ai participat la predicare în această lună - de ex. nu transmite orele tale?\n\nNotă: Aceasta nu va afecta orele afișate în calendar care sunt controlate din meniul dreapta / sus."
				}
			},
			"mileage": {
				"title": "Înregistrare kilometri",
				"enable": "Activează Înregistrare kilometri",
				"units_fuel": "Unităţi - combustibil",
				"units_distance": "Unităţi - distanţă"
			},
			"options": {
				"title": "Opţiuni suplimentare",
				"notes": "Include Notiţe în raport",
				"zero": "Include valori zero",
				"footer": "Ascunde opţional liniile de rapoarte care sunt = 0. Orele sunt întotdeauna incluse."
			},
			"comment": {
				"title": "Comentariu la raport",
				"footer": "Folosit ca semnătură pentru raport"
			}
		},
		"ministry": {
			"title": "Predicare"
		},
		"social": {
			"website": "Site web",
			"facebook": "Facebook",
			"twitter": "Twitter"
		},
		"help": {
			"title": "Ajutor & Asistenţă"
		},
		"issues": {
			"title": "Detector de probleme"
		},
		"maps": {
			"title": "Adrese",
			"open_in": "Deschide locaţiile cu ...",
			"contacts": {
				"title": "Căutarea adresei de contact",
				"reformat": "Reformatează adresa",
				"locality": "Auto-completaţi localitatea",
				"footer": "Localitate = Suburbie sau cartier."
			},
			"address": {
				"title": "Formatul adresei",
				"street": "Adresa străzii",
				"no_city": "Adresa străzii, Suburbie",
				"no_country": "Adresa străzii, Suburbie, Oraş",
				"full": "Adresa străzii, Suburbie, Oraş, Ţară",
				"footer": "Adresa străzii include numărul. Oraşul include de obicei codul poştal."
			},
			"locality": {
				"title": "Formatul localităţii",
				"suburb": "Suburbie sau cartier",
				"postcode_city": "Cod poştal Oraş",
				"city_postcode": "Oraş Cod poştal",
				"footer": "Localitatea este utilizată pentru a grupa contactele împreună în funcţie de zonă."
			},
			"restrictions": {
				"title": "Geo-codul invers",
				"country": "Limitaţi rezultatele adresei la %1$s"
			}
		},
		"timer": {
			"title": "Cronometru",
			"enable": "Activare Cronometru",
			"rounding": {
				"title": "Intervale de 5 minute",
				"down": "Rotunjiţi întotdeauna",
				"nearest": "Rotunjiţi la cea mai apropiată",
				"footer": "Decide dacă 13 minute sunt înregistrate ca 10 sau ca 15 minute."
			},
			"seconds": {
				"title": "Secunde",
				"hide": "Ascunde mai sus 00:00:59",
				"always": "Afişează întotdeauna secundele",
				"footer": "Ascunderea secundelor reduce distragerea atenţiei."
			},
			"badge": {
				"label": "Utilizează insigna aplicaţiei",
				"footer": "Afişaţi \"1\" dacă Cronometru rulează"
			},
			"color": {
				"title": "Cronometru - culoarea rulării",
				"slate_gray": "Gri cenuşiu",
				"light_blue": "Albastru deschis",
				"dark_blue": "Albastru închis",
				"light_green": "Verde deschis",
				"dark_green": "Verde închis"
			},
			"logs": {
				"title": "Jurnal",
				"none": "Nu există înregistrări în Jurnalul cronometrului pe acest dispozitiv.",
				"alert": "Ştergerea unei înregistrări din Jurnalul cronometrului nu schimbă activitatea sau timpul raportat.",
				"footer": "Sunt păstrate doar 30 din cele mai recente înregistrări. Configurările cronometrului şi Înregistrările nu sunt sincronizate între dispozitive."
			}
		},
		"debug": {
			"title": "Instrumente de depanare",
			"device": "Informaţii despre dispozitiv",
			"memory": "Memorie disponibilă",
			"network": "Tipul reţelei",
			"email": {
				"title": "E-mail pentru depanarea datelor",
				"footer": "Nu fă acest lucru decât dacă voi solicita în mod expres aceste date pentru a te ajuta la depanarea unei probleme pe care o ai.",
				"message": "Nu încerca să utilizezi acest fişier pentru nimic - doar trimite un e-mail la %1$s.",
				"button": "Generare e-mail"
			}
		},
		"beta": {
			"title": "Testeri Beta",
			"gitlab": {
				"title": "Tracker Beta",
				"button": "Tracker de probleme pentru Testeri Beta",
				"footer": "Se utilizează pentru rapoartele specifice erorilor beta şi pentru feedback. Creează-ţi un cont GitLab gratuit şi trimite-mi numele de utilizator pentru a obţine acces."
			},
			"report": {
				"title": "Trimite o problemă nouă",
				"email": "Adresa ta e-mail GitLab (opţional)",
				"button": "Trimite Feedback",
				"footer": "Obţine adresa personalizată de e-mail din partea de jos a listei cu Probleme în Tracker-ul problemelor GitLab."
			}
		},
		"appstore": {
			"title": "App Store"
		},
		"tags": {
			"edit": "Schimbă numele etichetei",
			"delete": {
				"title": "Şterge eticheta",
				"warning": "Eticheta \"%1$s\" va fi eliminată din toate contactele.\n\nSigur doreşti să faci acest lucru?"
			}
		},
		"notifications": {
			"title": "Notificări",
			"sync": "Configurările notificărilor nu sunt sincronizate între dispozitive",
			"report": {
				"title": "Memento Raport",
				"last": "În ultima zi a lunii",
				"first": "În prima zi a lunii următoare",
				"notification": {
					"message": "Este timpul să trimiţi raportul de activitate?"
				}
			},
			"visits": {
				"title": "Memento vizite",
				"tomorrow": "Cu o noapte înainte",
				"today": "În dimineaţa zilei de",
				"notification": {
					"message": "Ai %1$s %2$s planificată(e) pentru %3$s."
				}
			},
			"partner": {
				"title": "Partener de predicare",
				"tomorrow": "Cu o noapte înainte",
				"today": "În dimineaţa zilei de",
				"notification": {
					"message": "Vei colabora cu %1$s %2$s.",
					"join_middle": ",",
					"join_last": "şi"
				}
			}
		},
		"gdpr": {
			"title": "Respectarea RGPD",
			"footer": "Dezactivează ecranele de Contacte şi date",
			"alert": "Acest mod impune respectarea RGPD pentru utilizatorii din Marea Britanie şi UE.\n\n1) Aceasta va dezactiva fila Vizite şi secţiunea Contacte de pe ecranul Astăzi.\n\n2) Orice vizite existente vor fi şterse definitiv.",
			"notice": "În anumite părţi ale lumii, utilizatorii trebuie să respecte Regulamentul general privind protecţia datelor (RGPD). Aceasta înseamnă că NU pot fi colectate datele de contact.\n\nDacă ţara voastră este afectată de RGPD, atunci vă rugăm să mergeţi la Configurări şi să activaţi modul \"Respectarea RGPD\".\n\nCu orice întrebări legate de acest subiect, vă rugăm adresaţi-vă bătânilor locali sau verificaţi site-ul web.",
			"important": "Notificare importantă",
			"understand": "Am înţeles"
		}
	}
}
