{
	"common": {
		"format": "Format",
		"notnow": "Nicht jetzt",
		"more": "Mehr",
		"outline": "Übersicht",
		"bible": "Bibel",
		"reset": "Zurücksetzen",
		"error": "Fehler",
		"new": "Neu",
		"verse": "Vers",
		"note": "Notiz",
		"annotate": "Anmerkung erstellen",
		"annotations": "Anmerkungen",
		"cancel": "Abbrechen",
		"ok": "OK",
		"yes": "Ja",
		"no": "Nein",
		"other": "Andere",
		"done": "Fertig",
		"top": "Nach oben",
		"edit": "Bearbeiten",
		"add": "Hinzufügen",
		"save": "Speichern",
		"delete": "Löschen",
		"remove": "Entfernen",
		"search": "Suchen",
		"options": "Optionen",
		"chapter": "Kapitel",
		"article": "Artikel",
		"title": "Titel",
		"image_viewer": "Bildbetrachter",
		"reference": "Referenz",
		"topic": "Thema",
		"heading": "Überschrift",
		"reloading": "Neu laden",
		"loading": "Lädt",
		"settings": "Einstellungen",
		"confirm": "Bitte bestätigen",
		"forums": "Foren anzeigen",
		"history": "Verlauf",
		"historyclear": "Verlauf löschen",
		"historyconfirm": "Alle Verlaufselemente werden gelöscht. Bist du dir sicher?",
		"subheadings": "Zwischenüberschriften",
		"copied": "In Zwischenablage kopiert",
		"page": "Seite",
		"pages": "Seiten",
		"paragraphs": "Abs.",
		"footnote": "Fußnote",
		"about": "Über",
		"news": "News",
		"general": "Allgemein",
		"word_search": "Wort suchen",
		"tip": "Tipp",
		"recent": "Verlauf",
		"recently_opened": "Zuletzt geöffnet",
		"frontcover": "Titelbild",
		"reorder": "Neu sortieren",
		"order": "Sortierung",
		"favourites": "Favoriten",
		"favouritesave": "Als Favorit speichern",
		"websites": "Webseiten",
		"contents": "Inhalt",
		"clearcache": "Cache löschen",
		"size": "Größe",
		"height": "Höhe",
		"width": "Breite",
		"small": "Klein",
		"default": "Voreinstellung",
		"medium": "Mittel",
		"large": "Groß",
		"larger": "Größer",
		"largest": "Sehr groß",
		"fullscreen": "Vollbild",
		"home": "Home",
		"back": "Zurück",
		"forward": "Vorwärts",
		"toggle2lines": "2-zeilig anzeigen",
		"list": "Liste",
		"grid": "Raster",
		"map": "Gebiet",
		"hybrid": "Hybrid",
		"choose": "Bitte wählen",
		"selectall": "Alles auswählen",
		"online": "Online",
		"file": "Datei",
		"layout": "Darstellung ändern",
		"never": "Niemals",
		"sync": "Synchronisieren",
		"syncing": "Synchronisiere",
		"current": "Aktuell",
		"saved": "Gespeichert",
		"active": "Aktiv",
		"alert": "Alarm",
		"warning": "Warnung",
		"important": "Wichtig",
		"acknowledge": "Verstanden",
		"any": "Alle",
		"none": "Keines",
		"enable": "Aktivieren",
		"enabled": "Aktiviert",
		"disable": "Deaktivieren",
		"disabled": "Deaktiviert",
		"update": "Update",
		"modify": "Verändern",
		"created": "Erstellt",
		"overdue": "Überfällig",
		"cannot": "Nicht möglich",
		"all": "Alle",
		"website": "Webseite",
		"epub": "EPUB",
		"pdf": "PDF",
		"open_prompt": "Öffne %1$s",
		"view_prompt": "Zeige %1$s",
		"download_prompt": "Download %1$s",
		"details": "Details",
		"stop": "Stopp",
		"start": "Start",
		"custom": "Benutzerdefiniert",
		"summary": "Zusammenfassung",
		"please_note": "Bitte beachte",
		"when": "Wann",
		"bookmarks": "Lesezeichen",
		"bookmark": "Lesezeichen",
		"territory": "Versammlungsgebiet",
		"territories": "Versammlungsgebiete",
		"congregation": "Versammlung",
		"show_prompt": "Zeige %1$s",
		"hide_prompt": "Verstecke %1$s",
		"delete_prompt": "Lösche %1$s",
		"remove_prompt": "Entferne %1$s",
		"open_in_prompt": "Öffne in %1$s",
		"open_item_in_prompt": "Öffne %1$s in %2$s",
		"edit_in_prompt": "Editiere in %1$s",
		"view_in_prompt": "Zeige in %1$s",
		"download_from_prompt": "Download von %1$s",
		"sync_prompt": "Synchronisiere mit %1$s",
		"syncing_prompt": "Synchronisierung mit %1$s",
		"notes": "Notizen",
		"read_only": "Nur Lesen",
		"editable": "Editierbar",
		"required": "Benötigt",
		"unknown": "Unbekannt",
		"confirmed": "Bestätigt",
		"calendar": "Kalender",
		"end": "Ende",
		"ahead": "Voraus",
		"behind": "Hinterher"
	},
	"time": {
		"tomorrow": "Morgen",
		"today": "Heute",
		"yesterday": "Gestern",
		"earlier_this_week": "Anfang dieser Woche",
		"next_week": "Next Week",
		"this_week": "Diese Woche",
		"last_week": "Letzte Woche",
		"next_month": "Next Month",
		"this_month": "Diesen Monat",
		"last_month": "Letzten Monat",
		"older": "Älter",
		"newer": "Neuer",
		"next_year": "Next Year",
		"this_year": "Dieses Jahr",
		"last_year": "Letztes Jahr",
		"on_or_before": "Am %1$s oder früher",
		"over_years_ago": "Over %1$s years ago",
		"over_year_ago": "Over 1 year ago",
		"over_months_ago": "Vor %1$s Monate",
		"over_month_ago": "Vor einem Monat",
		"over_weeks_ago": "Vor %1$s Wochen",
		"over_week_ago": "Vor einer Woche",
		"over_days_ago": "Vor %1$s Tagen",
		"within_days": "Innerhalb der letzten %1$s Tage",
		"within_next_days": "Within the next %1$s days",
		"over_days_away": "Over %1$s days away",
		"over_week_away": "Over 1 week away",
		"over_weeks_away": "Over %1$s weeks away",
		"over_month_away": "Over 1 month away",
		"over_months_away": "Over %1$s months away",
		"over_year_away": "Over 1 year away",
		"over_years_away": "Over %1$s years away",
		"future": "Future",
		"day": "Tag",
		"week": "Woche",
		"month": "Monat",
		"year": "Jahr",
		"hours": "Stunden",
		"hour": "Stunde",
		"minutes": "Minuten",
		"date": "Datum",
		"date_added": "Date Added",
		"date_created": "Date Created",
		"date_updated": "Date Updated",
		"date_picker": "Datum auswählen",
		"time": "Zeit",
		"time_picker": "Zeit auswählen",
		"format": {
			"time": {
				"standard": "G:i a",
				"full": "G:i:s a"
			},
			"date": {
				"day": "l",
				"year": "Y",
				"full": "d.m.Y",
				"full_short": "d.m.y",
				"day_date_suffix": "l d.m.",
				"day_date_month": "D d.m.",
				"day_month_date": "l, j. F",
				"day_month_date_year": "l, j. F Y",
				"month_year": "F Y",
				"date_month": "d.m.",
				"date_month_year": "j. F Y",
				"picker": "D, j. F"
			},
			"datetime": {
				"long": "d.m.Y G:i:s a",
				"full": "l, j. F Y, G:i a",
				"month": "l, j. F G:i a",
				"month_short": "l, j.m. G:i a",
				"day_date_month_time": "D d.m. G:i a"
			}
		},
		"abbreviations": {
			"hours_minutes": "HH:MM",
			"minutes_seconds": "MM:SS",
			"mins": "min",
			"am": "Uhr",
			"pm": "Uhr",
			"st": "st",
			"nd": "nd",
			"rd": "rd",
			"th": "th"
		},
		"days": {
			"long": {
				"sunday": "Sonntag",
				"monday": "Montag",
				"tuesday": "Dienstag",
				"wednesday": "Mittwoch",
				"thursday": "Donnerstag",
				"friday": "Freitag",
				"saturday": "Samstag"
			},
			"short": {
				"sun": "So",
				"mon": "Mo",
				"tue": "Di",
				"wed": "Mi",
				"thu": "Do",
				"fri": "Fr",
				"sat": "Sa"
			}
		},
		"months": {
			"long": {
				"january": "Januar",
				"february": "Februar",
				"march": "März",
				"april": "April",
				"may": "Mai",
				"june": "Juni",
				"july": "Juli",
				"august": "August",
				"september": "September",
				"october": "Oktober",
				"november": "November",
				"december": "Dezember"
			},
			"short": {
				"jan": "Jan",
				"feb": "Feb",
				"mar": "Mrz",
				"apr": "Apr",
				"may": "Mai",
				"jun": "Jun",
				"jul": "Jul",
				"aug": "Aug",
				"sep": "Sep",
				"oct": "Okt",
				"nov": "Nov",
				"dec": "Dez"
			}
		}
	},
	"measurement": {
		"long": {
			"km": "km",
			"mi": "Meilen",
			"gal": "Gallonen",
			"L": "Liter"
		}
	},
	"titles": {
		"mr": "Herr",
		"mrs": "Frau",
		"miss": "Frau",
		"ms": "Frau",
		"dr": "Doktor"
	},
	"email": {
		"feedback": "Feedback senden",
		"standard": "E-Mail Standard Format",
		"send": "E-Mail senden",
		"confirm": "Bitte überprüfe, ob deine Frage,\n Idee oder dein Problem nicht bereits\nim Support Forum vorhanden ist.\n\nAnsonsten, fühl dich frei, dich zu melden!",
		"english": "Der Support ist nur in Englisch, also habe bitte etwas Geduld mit mir.",
		"import": "In %1$s importieren",
		"footer": "Erstellt mit %1$s"
	},
	"forms": {
		"validation": {
			"alert_title": "Ungültig",
			"alert_message": "Bitte korrigiere folgendes...",
			"missing_value": "\"%1$s\" darf nicht leer sein",
			"url": "Bitte gib einem korrekten Link ein, der mit http:// or https:// beginnt"
		}
	},
	"search": {
		"placeholder": "Suche %1$s",
		"searching": "Suche",
		"nothing": "Keine Übereinstimmung gefunden"
	},
	"browser": {
		"reload": "Seite neu laden",
		"open": "Open Browser",
		"safari": "In Safari öffnen",
		"clipboard": "Kopiere Link in Zwischenablage",
		"email": "Versende einen Link dieser Seite per E-Mail"
	},
	"apps": {
		"email": "E-Mail",
		"sms": "SMS",
		"telegram": "Telegram",
		"whatsapp": "WhatsApp",
		"wechat": "WeChat",
		"viber": "Viber",
		"line": "LINE",
		"hourglass": "Hourglass",
		"nwpublisher": "NW Publisher",
		"dropbox": "Dropbox",
		"th": "Territory Helper",
		"tasks": {
			"alert": "%1$s Alarm",
			"error": "%1$s Fehler",
			"account": "%1$s Account",
			"connect": "Verbinde mit %1$s",
			"sign_in": "Anmelden",
			"sign_into": "Anmelden bei %1$s",
			"permissions": "Erneuere Erlaubnis",
			"register": "Bei %1$s registrieren",
			"registering": "Registrieren bei %1$s",
			"errors": {
				"duplicate": "Es läuft bereits eine %1$s Synchronisation. Bitte warte bis diese abgeschlossen ist und versuche es erneut.",
				"registering": "Registrierung bei %1$s fehlgeschlagen.\n\nBitte versuche es später noch einmal oder sende %2$s eine E-Mail, damit ich die %3$s API prüfen kann.\n\nBitte Entschuldige die Umstände.",
				"expired": "Deine Anmeldung bei %1$s ist abgelaufen. Bitte melde dich erneut an, um deine Erlaubnis zu erneuern.",
				"something": "Ups, da ist etwas schiefgegangen.\n\nVielleicht fehlt dir die Berechtigung, um den Vorgang durchzuführen. Vielleicht ist %1$s offline oder ist vorübergehend nicht erreichbar.\n\n´Bitte überprüfe deine Berechtigungen, probiere es später noch einmal oder melde diesen Fehler.",
				"disconnected": "Deine Verbindung zu %1$s wurde getrennt. Bitte melde dich erneut an."
			}
		}
	},
	"alerts": {
		"phone": {
			"title": "Telefon",
			"confirm": "Bist du dir sicher, dass du \n%1$s anrufen willst?"
		},
		"sms": {
			"title": "SMS",
			"confirm": "Bist du dir sicher, dass du %1$s eine SMS-Nachricht schicken willst?",
			"cannot": "Dieses Gerät kann keine SMS-Nachrichten versenden"
		},
		"ziperror": "Die Datei \"%1$s\" ist ungültig. Wahrscheinlich ist der Download fehlgeschlagen - bitte versuche es erneut.\n\nDie Datei wird jetzt gelöscht.",
		"import": {
			"failed": "Entschuldigung, beim importieren der Daten ist ein Fehler aufgetreten. Es wurde nichts importiert."
		},
		"noemail": "Das Versenden von E-Mails scheint von diesem Gerät nicht unterstützt zu werden. Sind die iOS E-Mail Einstellungen korrekt?",
		"restart": "Bitte starte %1$s neu, damit die Einstellungen übernommen werden.",
		"yousure": "Bist du dir sicher, dass du das tun möchtest?",
		"internet": {
			"cannot": "Keine Internet-Verbindung",
			"tryagain": "Bitte verbinde dich mit dem Internet und versuche es erneut.",
			"offline": "Du bist offline. Bitte verbinde dich mit dem Internet und versuche es erneut."
		},
		"permissions": {
			"calendar": "Gerätekalender nicht erreichbar. Bitte prüfe die Berechtigung unter Einstellungen > Datenschutz > Kalender."
		},
		"tables": {
			"pulldown": "Zum Aktualisieren herunterziehen...",
			"release": "Zum Aktualisieren loslassen...",
			"loading": "Lade Daten"
		}
	},
	"calls": {
		"title": "Kontakte",
		"today_none": "Keine Besuche für heute geplant",
		"date_none": "Keine Besuche für %1$s geplant",
		"today_hint": "Plane einen Rückbesuch, um ihn hier zu sehen",
		"actions": {
			"first": "Füge deinen ersten Kontakt hinzu",
			"another": "Füge einen neuen Kontakt hinzu",
			"new": "Neuer Kontakt",
			"verifying": "Kontakt überprüfen",
			"delete": "Kontakt löschen",
			"share": "Kontakt teilen"
		},
		"types": {
			"first_call": "Erstbesuch",
			"return_visit": "Rückbesuch",
			"magazine_route": "Zeitschriftenroute",
			"top_priority": "Hohe Priorität",
			"bible_study": "Bibelstudium",
			"custom": "Custom Type",
			"inactive": "Inaktiv"
		},
		"types_abbreviated": {
			"first_call": "E",
			"return_visit": "RB",
			"magazine_route": "ZR",
			"top_priority": "HP",
			"bible_study": "BS",
			"custom": "CT",
			"inactive": "I"
		}
	},
	"contacts": {
		"title": "Kontakte",
		"contact": "Kontakt",
		"selected": "%1$s ausgewählt",
		"name": "Name",
		"phone": "Telefon",
		"email": "E-Mail",
		"link": "Link",
		"actions": {
			"first": "Füge deinen ersten Kontakt hinzu",
			"another": "Füge einen neuen Kontakt hinzu",
			"first_hint": "Klicke oben rechts auf + ...",
			"add": "Kontakt hinzufügen",
			"new": "Neuer Kontakt",
			"import": "Aus Kontakten importieren",
			"verifying": "Kontakte überprüfen",
			"filter": "Kontakte filtern",
			"edit": "Kontakt bearbeiten",
			"delete": "Kontakt löschen",
			"deleted": "Gelöschter Kontakt",
			"message": "SMS-Nachricht senden",
			"share": "Kontakt teilen",
			"search": "Kontakte durchsuchen",
			"search_hint": "Suche nach Name oder Adresse"
		},
		"shared": {
			"subject": "Geteilter Kontakt von ServicePlanner",
			"intro": "Dieser Kontakt wurde mit <a href=\"https://serviceplanner.me\">ServicePlanner</a> mit dir geteilt. Wenn du ebenfalls ServicePlanner installiert hast, kannst du den Kontakt importieren, wenn du den Mailanhang öffnest",
			"email": "Zusammenfassung per E-Mail",
			"file": "Datei teilen",
			"choose": "Wie möchtest du den Kontakt gerne teilen?",
			"import": {
				"confirm": "Bist du dir sicher, dass du diesen Kontakt importieren möchtest?\n\nWenn der Kontakt bereits besteht, werden alle Details überschrieben. Die Übersicht deiner Aktivitäten oder deiner Berichte werden durch den Import nicht verändert."
			}
		},
		"headings": {
			"details": "Kontaktdaten",
			"profile": "Profil",
			"this_visit": "Dieser Besuch",
			"last_visit": "Letzter Besuch",
			"next_visit": "Nächster Besuch",
			"next_visit_day": "Tag des Besuchs",
			"next_visit_on": "Nächster Besuch bei %1$s"
		},
		"filters": {
			"save": "Als Schnellfilter speichern",
			"overwrite": "Overwrite Using Current Filter Settings",
			"header_include": "Anzeigen",
			"footer_include": "Kontakte, die in der Liste angezeigt werden sollen",
			"header_exclude": "Ausschließen",
			"footer_exclude": "Kontakte, die von der Liste ausgeschlossen werden sollen",
			"include_before": "Zeige bevor Datum",
			"types": "Art",
			"all": "Alle Kontakte",
			"default": {
				"bylocality": "Kontakte nach Ort sortiert",
				"bylocality_desc": "Nach Ort gruppiert und nach nächstem Besuchsdatum sortiert",
				"bytype": "Kontakte nach Typ sortiert",
				"bytype_desc": "Nach Typ sortiert und nach nächstem Besuchsdatum sortiert",
				"inactive": "Inaktive Kontakte",
				"inactive_desc": "Nach Datum des letzten Besuchs gruppiert und sortiert, älteste zuerst",
				"overdue": "Überfällige Kontakte",
				"overdue_desc": "Nach Datum des letzten Besuchs gruppiert und sortiert, älteste zuerst"
			},
			"sorting": {
				"sort_by": "Sortieren nach",
				"sort_field": "Feld",
				"sort_value": "Wert",
				"sort_group_by": "Sortiere innerhalb der Gruppierung",
				"primary": "Sortiere primär nach",
				"secondary": "Sortiere sekundär nach",
				"order": "Sortierreihenfolge",
				"ascending": "Aufsteigend",
				"descending": "Absteigend",
				"asc": "Auf",
				"desc": "Ab",
				"footer": "Sortiert die gelisteten Kontakte",
				"footer_grouped": "Sortiert die Kontakte innerhalb der Gruppierung",
				"last_visit": "Datum des letzten Besuchs",
				"next_visit": "Datum des nächsten Besuchs"
			},
			"saved": {
				"saved": "Gespeicherte Filter",
				"default": "Standard-Filter",
				"other": "Andere Filter",
				"name": "Name des Filters",
				"description": "Beschreibung",
				"delete": "Lösche Filter",
				"delete_confirm": "Bist du dir sicher, dass du diesen Filter löschen willst?",
				"reorder": "Filter neu ordnen",
				"reorder_save": "Reihenfolge speichern",
				"reset": "Filter zurücksetzen",
				"reset_confirm": "Hiermit löscht du alle benutzerdefinierten Filter und stellst die Standard-Filter wieder her.\n\nBist du dir sicher, dass du das tun willst?",
				"footer": "Wische, um einen Filter zu ändern oder zu löschen. Ändere die Reihenfolge mit Hilfe des Menüs in der Symbolleiste. Der oberste Filter ist immer der Standard-Filter."
			},
			"grouping": {
				"group_by": "Gruppiere nach",
				"turn_off": "Gruppierung deaktivieren",
				"disabled": "Gruppierung ist deaktiviert",
				"footer": "Gruppiert Kontakte"
			},
			"alerts": {
				"no_types": "Bitte wähle mindestens eine Kontakt Art",
				"no_matches": "Keine passenden Kontakte gefunden",
				"no_matches_hint": "Bitte ändere die Filtervorgaben",
				"apply_today_filter": "Filtern nach \"Alle Kontakte\" mit \"Datum des nächsten Besuchs\" am %1$s.",
				"apply_on_or_before_filter": "Filtern nach \"Alle Kontakte\" mit \"Datum des nächsten Besuchs\" am oder bevor dem %1$s."
			}
		},
		"type": "Art",
		"language": "Sprache",
		"tags": "Tags",
		"tag": "Tag",
		"placed": "Abgaben",
		"placed_qty": "Anzahl Abgaben",
		"no_placements": "Du hast noch nichts abgegeben",
		"no_videos": "Du hast noch keine Videos gezeigt",
		"shown": "Gezeigte Videos",
		"shown_qty": "Anzahl Videovorführungen",
		"videos": "Videos",
		"visits": {
			"title": "Besuche",
			"visit": "Besuch",
			"type": "Visit Type",
			"by_type": "Besuche nach Typ",
			"plans": "Rückbesuchsnotizen",
			"details": "Besuchsdetails",
			"next": "Nächster geplanter Besuch",
			"previous": "Letzter Besuch",
			"no_placements": "Keine Abgaben oder Videos gezeigt",
			"days_since": "Letzter Besuch:",
			"days_until": "Nächster Besuch:",
			"days_overdue": "Tage überfällig",
			"actions": {
				"first": "Füge deinen ersten Besuch hinzu",
				"first_hint": "Klicke links oben auf + ...",
				"new": "Neuer Besuch",
				"new_on": "Neuer Besuch am %1$s",
				"edit": "Besuch bearbeiten",
				"view": "Letzter Besuch",
				"remind": "Sende Erinnerung",
				"delete": "Besuch löschen",
				"confirmDelete": "Bist du dir sicher, dass du diesen Besuch löschen möchtest? Das wird auch den Rückbesuch und alle zugehörigen Abgaben von deinem Bericht entfernen",
				"manual": "Das fügt einen Besuch manuell hinzu. Besuche deiner gespeicherten Kontakte werden automatisch gezählt.",
				"plans": {
					"previous": "Letzte Notizen",
					"insert_this": "In Notizen dieses Besuchs einfügen",
					"insert_next": "In Rückbesuchsnotizen einfügen"
				}
			},
			"types": {
				"not_home": "Nicht zu Hause",
				"secular": "Secular"
			}
		},
		"alerts": {
			"calculated": "Dieser Wert wird automatisch durch deine Besuche hinzugefügt.",
			"inactive": "Setze auf inaktiv",
			"permanent": "Dauerhaft löschen",
			"confirmDelete": "Möchtest du den Kontakt %1$s auf \"Inaktiv\" setzen? Oder möchtest du ihn dauerhaft löschen?\n\nBeachte: Beim Löschen eines Kontaktes werden die durchgeführten Besuche und Abgaben nicht von deinem Bericht entfernt (Dies ist nur durch das Löschen der einzelnen Besuche möglich).",
			"confirmDeleteSelected": "Bist du dir sicher, dass du die %1$s ausgewählten Kontakte löschen willst?\n\nOder möchtest du sie stattdessen \"Inaktiv\" setzen?",
			"confirmDate": "Setze das Datum für den nächsten Besuch bei %1$s ausgewählten Kontakt(en) auf:"
		},
		"pickers": {
			"type": "Kontakt Art",
			"type_hint": "You can rename these types in Settings > Workflow",
			"tags": "Tags auswählen",
			"thisvisitdate": "Dieser Besuch",
			"nextvisitdate": "Nächster Besuch",
			"dateNextVisit": "Nächstes Besuchdatum",
			"next_week": "+ 1 Woche",
			"next_fortnight": "+ 2 Wochen",
			"next_month": "+ 4 Wochen",
			"location": {
				"title": "Lege Ort fest",
				"message": "Lege Ort nach folgenden GPS-Daten fest...",
				"my_location": "Mein aktueller Standort",
				"insert_location": "Füge aktuelle Position ein",
				"previous_address": "Füge letzte Adresse ein"
			}
		}
	},
	"partners": {
		"partner": "Partner",
		"start": "Dienstbeginn",
		"end": "Dienstende",
		"calendars": {
			"header": "Kalenderoptionen",
			"device": "Gerätekalender",
			"readonly": "Nur Lesen-Kalender werden nicht aufgeführt",
			"add": "Zu Kalender hinzufügen",
			"remove": "Von Kalender entfernen",
			"notes": "Ändere Ereignisdetails in ServicePlanner."
		}
	},
	"qrcode": {
		"show": "Show QR Code",
		"saved": "QR Code saved to your Photo Library.",
		"error": "Could not save the QR code to your Photo Library."
	},
	"maps": {
		"title": "Karte",
		"type": {
			"choose": "Wähle einen Kartentyp:",
			"normal": "Standard",
			"hybrid": "Hybrid",
			"satellite": "Satellit",
			"terrain": "Terrain"
		},
		"options": {
			"tracking_on": "Lokalisierung an",
			"tracking_off": "Lokalisierung aus",
			"traffic_on": "Verkehrsaufkommen an",
			"traffic_off": "Verkehrsaufkommen aus",
			"poi_on": "Points of Interest On",
			"poi_off": "Points of Interest Off"
		},
		"apps": {
			"applemaps": "Apple Maps",
			"googlemaps": "Google Maps",
			"waze": "Waze"
		},
		"ask": "Frage mich jedes Mal",
		"address": {
			"select": "Bitte wähle die korrekte Adresse:",
			"invalid": "Ungültige Adresse. Bitte versuche es erneut.",
			"askapp": "Öffne Adresse in ..."
		},
		"manual": {
			"confirm": "Bist du dir sicher, dass du den Standort für \"%1$s\" zu diesen neuen Koordinaten ändern willst?\n\nBeachte: Das wird nicht die Adresse in den Kontaktdetails verändern, sondern nur die Position des Markers auf der Karte."
		},
		"locator": {
			"message": "Was möchtest du mit dieser Adresse tun?",
			"what": "Was möchtest du anzeigen?",
			"current": "Mein aktueller Standort",
			"contact": "Füge neuen Kontakt hinzu",
			"move": "Bewege existierenden Kontakt"
		},
		"locations": {
			"message": "Was möchtest du tun?",
			"open_in": "Öffnen in %1$s",
			"drive": "Navigiere zu Ort",
			"star": "Wichtiger Ort",
			"flag": "Gebietskennzeichen",
			"car": "Autoposition",
			"hall": "Königreichssaal",
			"home": "Zuhause",
			"set": "Setze als %1$s",
			"remove": "Entferne Ort"
		}
	},
	"addresses": {
		"address": "Adresse",
		"geocode": "Geocode",
		"location": "Adresse",
		"locations": "Adressen",
		"locality": "Ort",
		"unit": "Einheit",
		"units": "Wohneinheiten",
		"floor": "Etage",
		"ground": "Erdgeschoss",
		"number": "Nummer",
		"street": "Straße",
		"city": "Stadt",
		"postcode": "Postleitzahl",
		"locale": "Gebietsschema",
		"components": "Addresskomponenten",
		"latitude": "Breitengrad",
		"longitude": "Längengrad",
		"suburb": "Vorort",
		"county": "Bezirk",
		"state": "Bundesland",
		"state_code": "Bundesland Kode",
		"country": "Land",
		"country_code": "Länderkode",
		"place_id": "Ort ID",
		"place_id_hint": "Google Place ID",
		"formatted": "Formattiert",
		"formatted_hint": "Volle Adresse",
		"actions": {
			"lookup": "Suche Adresse",
			"lookup_footer": "Das wird die eingegeben Adresse suchen und den Geocode sowie weitere Adresskomponenten automatisch ergänzen. Du kannst auch alle Adressdetails manuell bearbeiten.",
			"lookup_location": "Adresssuche",
			"lookup_location_footer": "Das wird deinen aktuellen Standort suchen und den Geocode sowie weitere Adresskomponenten automatisch ergänzen. Du kannst auch alle Adressdetails manuell bearbeiten.",
			"current_location": "Benutze aktuellen Standort",
			"current_location_footer": "Das wird die aktuellen Breiten- und LÄngengrade automatisch ermitteln."
		}
	},
	"territories": {
		"name": "Versammlungsname",
		"pick": "Welches Gebiet?",
		"none": "Du hast bisher keine Gebiete angelegt.",
		"map_number": "Gebiet Nr. %1$s",
		"map_number_type": "Gebiet Nr. %1$s (%2$s)",
		"add": {
			"new": "Füge neues Gebiet hinzu",
			"sorry": "Im Moment werden nur Gebiete, die von Territory Helper (territoryhelper.com) importiert wurden, unterstützt. In einem zukünftigen Update wird es möglich sein, eigene Gebiete manuell zu erstellen. Danke für deine Geduld.",
			"import": "Von Territory Helper importieren",
			"manual": "Erstelle manuell"
		},
		"search": {
			"congregation": "Suche in %1$s Gebiet",
			"map": "Suche in Gebiet %1$s (%2$s)"
		},
		"maps": {
			"none": "Es gibt bisher noch keine Karte für dieses Gebiet.",
			"types": "Kartentyp",
			"types_footer": "Ändere die Reihenfolge oder tippe, um die Farbe zu ändern",
			"type": "Gebietstyp",
			"details": "Gebietsdetails",
			"number": "Gebietsnummer",
			"label": "Beschriftung",
			"image": "Gebietskarte",
			"assigned": "Zugeteilt",
			"assigned_to": "Zugeteilt an %1$s",
			"unassigned": "Nicht zugeteilt"
		},
		"locations": {
			"details": "Adressen Details",
			"type": "Adressen Typ",
			"status": "Adressstatus",
			"language": "Sprache der Adresse",
			"first": "Füge deine erste Adresse hinzu",
			"add_to": "Zu Gebiet %1$s hinzufügen",
			"visibility": {
				"title": "Sichtbar",
				"approved": "Zur Darstellung geprüft",
				"unapproved": "Noch nicht geprüft"
			}
		},
		"units": {
			"floor_hint": "Etage 0 = Erdgeschoss",
			"details": "Wohneinheit Details",
			"type": "Wohneinheit Typ",
			"status": "Wohneinheit Status",
			"add": "Füge eine Wohneinheit hinzu"
		},
		"statistics": {
			"title": "Statistiken",
			"unique": "Einzelne"
		},
		"types": {
			"house": "Haus",
			"apartment": "Wohnung",
			"business": "Geschäft",
			"trainstation": "Bahnstation",
			"busstation": "Bushaltestelle",
			"school": "Schule",
			"store": "Laden",
			"language": "Sprache",
			"harbour": "Hafen",
			"airport": "Flughafen",
			"truckstop": "Rastplatz",
			"elderlyhome": "Seniorenheim",
			"park": "Park",
			"camp": "Campingplatz",
			"restaurant": "Restaurant",
			"hotel": "Hotel",
			"vacation": "Ferienwohnung"
		},
		"statuses": {
			"unknown": "Status unbekannt",
			"returnvisit": "Rückbesuch",
			"biblestudy": "Bibelstudium",
			"donotcall": "Nicht wieder vorsprechen",
			"eldersonly": "Nur Älteste",
			"locked": "Gesperrt",
			"lettersonly": "Nur brieflich",
			"vacant": "leer",
			"notrespassing": "Kein Zugang",
			"daysleeper": "Schläft am Tag",
			"witness": "Zeuge Jehovas",
			"phoneonly": "Nur telefonisch",
			"referral": "Weitergeleitet",
			"bewareofdog": "Warnung vor dem Hunde"
		},
		"visits": {
			"add": "Füge einen Besuch hinzu",
			"delete": "Lösche Besuch",
			"status": "Besuchsstatus",
			"visited": {
				"last": "Letzter Besuch",
				"never": "Noch nie besucht",
				"date": "Besuchsdatum"
			},
			"statuses": {
				"unvisited": "unbesucht",
				"visited": "besucht",
				"skipped": "übersprungen",
				"nothome1": "Nicht zu Hause 1",
				"nothome2": "Nicht zu Hause 2",
				"nothome3": "Nicht zu Hause 3"
			}
		},
		"languages": {
			"unknown": "Sprache unbekannt"
		},
		"filters": {
			"matches": "Keine Treffer für den akuellen Filter",
			"change": "Bitte ändere die Filtereinstellungen",
			"maps": {
				"title": "Gebietsfilter",
				"include": {
					"title": "Angezeigte Gebiete",
					"all": "Alle Gebiete",
					"assigned": "Aktuell zugeteilt",
					"mine": "Mir zugeteilt"
				},
				"group": {
					"title": "Gruppiere nach",
					"type": "Gebietstyp",
					"none": "Keine Gruppierung"
				},
				"sort": {
					"title": "Sortiere nach",
					"number": "Gebietsnummer",
					"oldest": "Älteste zuerst",
					"assigned": "Aktuell zugeteilt",
					"addresses": "Einzelne Adressen"
				}
			},
			"locations": {
				"title": "Adresse Filter",
				"types": "Adresse & Typ der Wohneinheiten",
				"statuses": "Adresse & Status der Wohneinheiten",
				"languages": "Adresse & Sprachen der Wohneinheiten",
				"apply_list": "Auf Liste anwednen",
				"apply_map": "Auf Gebiet anwenden"
			}
		},
		"th": {
			"form": {
				"import": "Importiere Gebiete",
				"nosync": "Territory Helper Account Details werden nicht zwischen verschiedenen Geräten synchronisiert. Bitte melde dich dafür auf jedem Gerät an.",
				"geocode": "Bitte drücke den Standort-Button neben dem Adressfeld um den Geocode der Adresse in Breiten-und Längengrad festzulegen.",
				"address": "Adressdetails können nur in Territory Helper geändert werden.",
				"online": "Du musst online sein, um Daten in Territory Helper zu ändern.",
				"details": "Diese Details stammen von Territory Helper.",
				"privacy": "Notizen werden in Territory Helper gespeichert. Bitte sorge dafür, dass die Notiz den lokalen Datenschutzgesetzen entspricht.",
				"list": "Diese Liste stammt von Territory Helper.",
				"remove": "Bist du dir sicher, dass du das Gebiet \"%1$s\" aus ServicePlanner entfernen willst?"
			},
			"setup": {
				"publisher": "Erhalte Verkündiger Details",
				"congregaton": "Erhalte Versammlungsdetails"
			},
			"sync": {
				"title": "Nutze den Aktualisieren-Button",
				"hint": "Nutze den Aktualisieren-Button oben rechts, um die neuesten Gebiete von Territory Helper zu laden.",
				"importing": "Importiere Gebietskarten ...",
				"wait": "Bitte warte während die Gebiete von Teritorry Helper importiert werden.",
				"map": "Aktualisiere Gebietsdaten",
				"location": "Aktualisiere Adressdaten",
				"sending": "Sende Änderungen an Territory Helper"
			},
			"assignments": {
				"status": "Zuteilungsstatus",
				"assigned": "Zugeteilt",
				"assigned_to": "Zugeteilt an %1$s",
				"assigned_me": "An mich zugeteilt",
				"assigned_date": "Zugeteilt %1$s (%2$s Tage)",
				"assigned_none": "Keine mir zugeteilten Gebiete",
				"not": "Nicht zugeteilt",
				"request": "Gebiet anfragen",
				"request_made": "Deine Gebietsanfrage wurde übermittelt. Bitte warte bis der Gebietsdiener deine Anfrage bearbeitet.",
				"return": "Bearbeitet zurück geben",
				"unworked": "Unbearbeitet zurück geben"
			},
			"roles": {
				"0": "Verkündiger",
				"10": "Erweitert",
				"30": "Ältester",
				"35": "Kreisaufseher",
				"40": "Assistent",
				"50": "Administrator",
				"60": "Übersetzer",
				"100": "Systemadministrator"
			},
			"permissions": {
				"reset": "Berechtigungen zurücksetzen",
				"low": "Tut mir leid, du hast nicht die dafür benötigten Berechtigungen auf Territory Helper.",
				"changed": "Wenn deine Berechtigungen auf Territory Helper mittlerweile geändert wurden dann gehe bitte zu den Gebietseinstellungen in ServicePlanner und drücke auf \"Reset Permissions\"."
			}
		}
	},
	"today": {
		"title": "Heute",
		"plugins": {
			"timer": "Timer",
			"media": "Videos",
			"bookshelf": "Literatur",
			"territories": "Gebiete",
			"contacts": "Geplante Besuche",
			"hours": "Stunden Gesamt",
			"activity": "Aktivität"
		},
		"settings": {
			"title": "Heute-Bildschirm Einstellungen",
			"plugins": "Plugins",
			"heading": "Überschrift",
			"activity": "Aktivität Plugins: Elemente",
			"hours": "Stunden Gesamt: Elemente"
		}
	},
	"timer": {
		"stop": "Stoppe Stoppuhr",
		"start": "Starte Stoppuhr",
		"pause": "Pausiere Stoppuhr",
		"resume": "Stoppuhr fortsetzen",
		"confirm": {
			"more": "Du benötigst mindestens 5 Minuten, um die Zeit zum Bericht hinzufügen zu können.",
			"message": "Möchtest du %1$s (%2$s) zu deinem Bericht hinzufügen?",
			"ministry": "Als Predigtdienst-Stunden speichern",
			"other": "Als %1$s Stunden speichern",
			"stop": "Beende Stoppuhr",
			"done_ministry": "%1$s (%2$s) wurden zu deinem Bericht für %3$s hinzugefügt.",
			"done_other": "%1$s (%2$s) wurden zu deinen %3$s Stunden für %4$s hinzugefügt."
		}
	},
	"library": {
		"title": "Bibliothek"
	},
	"clipboard": {
		"cover": {
			"add": "Cover hinzufügen",
			"title": "Du kannst ein Bild aus deiner Fotobibliothek wählen oder ein Foto, das du zuvor in die Zwischenablage kopiert hast...",
			"choose": "Foto wählen",
			"clipboard": "Benutze Bild aus der Zwischenablage",
			"zoom": "Zeige Cover",
			"remove": "Cover entfernen"
		},
		"paste": {
			"no_image_title": "Kein Bild gefunden",
			"no_image_message": "In deiner Zwischenablage befindet sich kein Bild.\n\nBitte wähle ein Bild in deinem Browser oder in einer App, die es erlaubt Bilder zu kopieren und drücke+halte auf das Bild, um es in die Zwischenablage zu \"Copy\""
		}
	},
	"bookshelf": {
		"title": "Bücherregal",
		"publications": "Literatur",
		"hints": {
			"first_item": "Drücke + in der Symbolleiste um deine erste %1$s hinzuzufügen",
			"add_item": "Drücke + in der Symbolleiste um eine %1$s hinzuzufügen",
			"no_recent": "Kürzlich genutzte Veröffentlichungen werden nach und nach hinzugefügt. Wähle \"All\" in der Symbolleiste um deine erste Veröffentlichung zu wählen."
		},
		"default": {
			"description": "You can use the \"+\" button in the top toolbar to add publications to this category.\n\nTo get you started, would you like to add some default publications? You can edit or delete them at any time.",
			"confirm": "Would you like to add some default publications to this category? It will try to skip duplicate entries based on the publication abbreviation.",
			"button": "Add Default %1$s"
		},
		"sections": {
			"magazines": "Zeitschriften",
			"awake": "Erwachet!",
			"watchtower": "Wachtturm",
			"books": "Bücher",
			"brochures": "Broschüren",
			"tracts": "Traktate",
			"invites": "Einladungen",
			"other": "Andere"
		},
		"singular": {
			"magazines": "Zeitschrift",
			"awake": "Erwachet!",
			"watchtower": "Wachtturm",
			"watchtower_public": "Wachtturm (Öffentlichkeit)",
			"watchtower_study": "Wachtturm (Studienausgabe)",
			"watchtower_simplified": "Wachtturm (vereinfacht)",
			"books": "Buch",
			"brochures": "Broschüre",
			"tracts": "Traktat",
			"invites": "Einladung",
			"other": "Veröffentlichung",
			"card": "Kontaktkarte",
			"letter": "Brief",
			"link": "Website-Link"
		},
		"form": {
			"new": "Neue %1$s",
			"today": "Zum Startbildschirm hinzufügen",
			"remove": "Vom Startbildschirm entfernen",
			"header": "Details",
			"advanced": "Erweitert",
			"abbr": "Abkürzung",
			"url": "Webseitenlink (www)",
			"issue": "Ausgabe",
			"issue_number": "Nr.",
			"title": "Titel",
			"locations": "Download",
			"pdf_url": "Download URL",
			"epub_url": "Download URL",
			"short_title": "Kurztitel (Empfohlen)",
			"published": "Veröffentlichungsjahr",
			"count": "Als Abgabe zählen",
			"confirmTodayAdded": "Diese Veröffentlichung wurde zu deinem Startbildschirm hinzugefügt.",
			"confirmTodayRemoved": "Diese Veröffentlichung wurde von deinem Startbildschirm entfernt.",
			"confirmDelete": "Bist du dir sicher, dass du %1$s \"%2$s\" löschen möchtest?\n\nDas kann nicht rückgängig gemacht werden.",
			"cannot_delete": "Diese Veröffentlichung wurde bereits abgegeben und kann deswegen nicht gelöscht werden.\n\nDu kannst die Filter nutzen, um den Kontakt zu identifizieren, bei dem diese Veröffentlichung abgegeben wurde und kannst diese dann dort zuerst löschen.",
			"tips": {
				"lookup": "Dieser Suchen-Button ist nur eine Hilfe. Er wird versuchen für dich Informationen zu der Veröffentlichung zu finden. Oftmals wird es aber vorkommen, dass keine oder unvollständige Daten gefunden werden. In diesem Fall musst du die fehlenden Informationen manuell eintragen.",
				"no_image": "Dieser Button wird in Zukunft nicht mehr das Cover für Literatur hinzufügen. Du kannst den \"Cover hinzufügen\"-Button nutzen, um das selber zu tun. Im Hilfebereich der Webseite findest du mehr Hinweise.",
				"abbr": {
					"books": "Abkürzung des Titels (bh, lv ...)",
					"brochures": "Abkürzung des Titels (fg, lc ...)",
					"tracts": "Abkürzung des Titels (T-36, T-37 ...)"
				}
			},
			"errors": {
				"abbreviation": "Es scheint in der ausgewählten Sprache keine Informationen zu dieser Abkürzung des Titels zu geben. Bitte versuche eine andere Abkürzung oder gebe die Informationen zu dieser Veröffentlichung manuell ein.",
				"imported": "Diese Publikation wurde importiert und ist mit keiner Publikation deiner ServicePlanner Bibliothek verknüpft."
			}
		}
	},
	"media": {
		"title": "Medien",
		"videos": "Videos",
		"video": "Video",
		"default": {
			"description": "You can use the \"+\" button in the top toolbar to add videos to this category.\n\nTo get you started, would you like to add some generic video placeholders? These can be used to report videos shown to householders without having to add every specific video available. You can edit or delete them at any time.",
			"confirm": "Would you like to add some generic videos to this category? It will try to skip duplicate entries.",
			"button": "Add Generic Videos",
			"section": "Section %1$s Video"
		},
		"sections": {
			"ministry": "Predigtdienst",
			"study": "Bible Study",
			"children": "Kinder",
			"whiteboard": "Whiteboard",
			"songs": "Lieder",
			"other": "Andere"
		},
		"singular": {
			"videos": "Video",
			"ministry": "Predigtdienst-Video",
			"study": "Study Video",
			"children": "Kinder-Video",
			"whiteboard": "Whiteboard-Video",
			"songs": "Lied",
			"other": "Video"
		},
		"plural": {
			"videos": "Videos",
			"ministry": "Predigtdienst-Videos",
			"study": "Study Videos",
			"children": "Kinder-Videos",
			"whiteboard": "Whiteboard-Videos",
			"songs": "Lieder",
			"other": "Videos"
		},
		"sizes": {
			"240": "240p",
			"360": "360p",
			"480": "480p",
			"720": "720p"
		},
		"form": {
			"new": "Neues %1$s",
			"today": "Zum Startbildschirm hinzufügen",
			"remove": "Vom Startbildschirm entfernen",
			"header": "Video Details",
			"downloaded_footer": "Heruntergeladene Videos werden nicht per Dropbox synchronisiert",
			"advanced": "Erweiterte Details",
			"duration": "Länge",
			"locations": "Video-Links",
			"website": "Webseiten-Adresse",
			"website_url": "Webseiten-Link",
			"broadcast_url": "Video-Link",
			"no_broadcast_url": "Bitte gib eine gültige Internetadresse ein. Gehe zu tv.jw.org, finde das Video, das du möchtest und kopiere den Link von der Adressleiste in dieses Feld.",
			"online": "Bitte einen Link eingeben",
			"download_url": "Download-Link",
			"download": "Download Video",
			"downloaded": "Heruntergeladenes %1$s",
			"title": "Titel",
			"short_title": "Kurztitel (Empfohlen)",
			"play": "Spiele %1$s",
			"stream": "Streame %1$s",
			"confirm_today_added": "Dieses Video wurde zu deinem Startbildschirm hinzugefügt.",
			"confirm_today_removed": "Dieses Video wurde von deinem Startbildschirm entfernt.",
			"confirm_delete": "Bist du dir sicher, dass du das %1$s \"%2$s\" löschen willst?\n\nDas kann nicht rückgängig gemacht werden.",
			"cannot_delete": "Dieses Video wurde bereits gezeigt ud kann deswegen nicht gelöscht werden.\n\nDu kannst die Filter nutzen, um den Kontakt zu identifizieren, dem dieses Video gezeigt wurde und kannst dieses dort zuerst löschen.",
			"no_videos": "Du hast noch keine Adresse für dieses Video eingegeben.",
			"tips": {
				"lookup": "Dieser Suchen-Button ist nur eine Hilfe. Er wird versuchen für dich Informationen zu diesem Video zu finden. Oftmals wird es aber vorkommen, dass keine oder unvollständige Daten gefunden werden. In diesem Fall musst du die fehlenden Informationen manuell eintragen.",
				"no_image": "Dieser Button wird in Zukunft nicht mehr das Cover für Videos hinzufügen. Du kannst den \"Cover hinzufügen\"-Button nutzen, um das selber zu tun. Im Hilfebereich der Webseite findest du mehr Hinweise."
			},
			"errors": {
				"url": "Das scheint kein gültiger Link zu einem Video in der ausgewählten Sprache zu sein. Bitte gebe eine korrekte Internetadresse an oder wähle eine andere Sprache und versuche es erneut. Du kannst die fehlenden Informationen auch manuell eintragen.",
				"imported": "Dieses Video wurde importiert und ist mit keinem der in deiner Bibliothek in ServicePlanner hinterlegten Videos verknüpft.\n\nDu kannst die Videos in deinen Besuchen neu hinzufügen, in dem du die Liste aktualisierst."
			}
		}
	},
	"languages": {
		"single": "Sprache",
		"multiple": "Sprachen",
		"available": "Verfügbare %1$s",
		"selected": "Ausgewählte %1$s",
		"other": "Sonstige %1$s",
		"search": "%1$s suchen",
		"app": {
			"title": "App-Sprache",
			"hint": "Wird für Beschriftungen und Erklärungen verwendet",
			"restart": "Bitte starten Sie die App neu, um die Sprache zu ändern."
		},
		"beta": {
			"title": "Unvollständig Übersetzungen (Beta)",
			"hint": "Wenn du helfen möchtest: support@serviceplanner.me"
		},
		"chinese": {
			"options": "Optionen Chinesisch",
			"characters": "Nur Zeichen",
			"pi": "Pinyin",
			"zhu": "Zhuyin",
			"lau": "Sidney Lau",
			"yale": "Yale",
			"twoline": "%1$s 2-zeilig",
			"oneline": "Nur %1$s"
		}
	},
	"websites": {
		"tasks": {
			"bookmark": "Als Lesezeichen speichern",
			"video": "Video speichern",
			"video_cat": "In welcher Kategorie soll das Video gespeichert werden?",
			"briefcase": "Zu Aktentasche hinzufügen",
			"safari": "In Safari öffnen",
			"copy": "URL kopieren",
			"email": "Email Reader-Ansicht"
		},
		"bookmarks": {
			"none": "Keine Lesezeichen",
			"first": "Tipp: Öffne eine Webseite. Danach kannst du sie mit dem Button links oben als Lesezeichen speichern.",
			"added": "Lesezeichen gespeichert"
		},
		"icon": {
			"add": "Foto wählen",
			"title": "Du kannst ein Bild aus deiner Fotobibliothek oder eines aus der Zwischenablage einfügen, das du vorher kopiert hast...",
			"zoom": "Zeige Foto",
			"remove": "Foto entfernen"
		},
		"browser": {
			"search": "Suche oder Webseite",
			"reader": "Reader-Ansicht verfügbar",
			"2line": "Romanisierung verfügbar",
			"video": "Video erkannt"
		},
		"form": {
			"new": "Neues %1$s",
			"today": "Zum Startbildschirm hinzufügen",
			"remove": "Vom Startbildschirm entfernen",
			"header": "Webseite Details",
			"footer": "URL Platzhalter: %Y (Jahr), %m (Monat), %d (Tag)",
			"advanced": "Erweitert",
			"share_link": "Share Link",
			"website": "Webseitenadresse",
			"website_url": "Webseite URL",
			"online": "Online Resourcen",
			"title": "Titel",
			"short_title": "Kurztitel (empfohlen)",
			"confirm_today_added": "Diese Webseite wurde zu deinem Startbildschirm hinzugefügt.",
			"confirm_today_removed": "Diese Webseite wurde von deinem Startbildschirm entfernt.",
			"confirm_delete": "Bist du dir sicher, dass du das %1$s \"%2$s\" löschen möchtest?\n\nDas kann nicht rückgängig gemacht werden.",
			"errors": {
				"url": "Das scheint keine gültige Adresse sein. Bitte versuche es erneut."
			}
		}
	},
	"activity": {
		"title": "Aktivität",
		"current": "Aktuell",
		"reports": "Berichte",
		"month": "Monat",
		"year": "Jahr",
		"other": "Andere",
		"manual": "Manuell",
		"auto": "Berechnet",
		"planned": "Geplant",
		"scheduled": "Planmäßig",
		"ministry": "Predigtdienst",
		"theocratic": "Theokratisch",
		"personal": "Persönlich",
		"actual": "Aktuell",
		"report": {
			"title": "Bericht für %1$s",
			"send": "Bericht senden",
			"hours": "Stunden",
			"credits": "Stundengutschriften",
			"minutes": "%1$s Minuten",
			"hours_ministry": "Predigtdienst Stunden",
			"hours_other": "%1$s Stunden",
			"hours_under_planned": "%1$s fehlen zum Ziel",
			"hours_over_planned": "%1$s über dem Ziel",
			"hours_progress": "%1$s von %2$s Stunden",
			"hours_under": "%1$s weniger",
			"hours_over": "%1$s über",
			"hours_behind": "%1$s zurück",
			"hours_ahead": "%1$s vorraus",
			"hours_ok": "im Plan",
			"hours_met": "Ziel erreicht",
			"hours_projected": "Voraussichtlich %1$s",
			"hours_projected_short": "vsl. %1$s",
			"hours_reported": "%1$s berichtet",
			"hours_reported_short": "%1$s ber.",
			"hours_total": "%1$s total",
			"hours_total_short": "%1$s T",
			"hours_show": "Stunden im Kalender anzeigen",
			"hours_hide": "Stunden im Kalender ausblenden",
			"placements": "Abgaben",
			"placements_show": "Abgaben, Videos anzeigen ...",
			"placements_hide": "Abgaben, Videos ausblenden ...",
			"mileage": "Kilometerstand",
			"videos": "Videos",
			"visits": "Rückbesuche",
			"visits_all": "Alle Besuchstypen",
			"studies": "Bibelstudien",
			"studies_unique": "Einzelne Bibelstudien",
			"nothing": "Noch nichts berichtet",
			"remove": "Vom Bericht entfernen"
		},
		"hours": {
			"target": "Monatsziel",
			"target_total": "Gesamtziel",
			"target_alert": "Setze dein Monatsziel für diesen Monat. Das wird dein voreingestelltes Monatsziel überschreiben, das du in den Einstellungen vorgegeben hast",
			"carried_title": "Übertrag Minuten",
			"carried_label": "Von letztem Monat",
			"planned": "Geplante Stunden",
			"planned_total": "Insgesamt geplant",
			"planned_ok": "= Ziel erreicht",
			"actual": "Aktuelle Stunden",
			"progress": "Aktueller Stand",
			"future": "Zukünftig geplant",
			"summary": "Aktivitätszusammenfassung",
			"total": "Gesamtstunden",
			"calculated": "berechnet",
			"projected": "Voraussichtliche Zeit",
			"reported": "Berichtete Stunden",
			"credits": {
				"add": "Füge Stundengutschrift hinzu",
				"delete": "Lösche Stundengutschrift",
				"singular": "Stundengutschrift",
				"plural": "Stundengutschriften",
				"reason": "Grund",
				"hint": "zb. Pionierdienstschule",
				"hours": "Stundengutschrift",
				"confirmDelete": "Bist du dir sicher, dass du die Stundengutschrift löschen möchtest?"
			},
			"footers": {
				"goals": "Du kannst dein voreingestelltes Monatsziel überschreiben",
				"planned": {
					"over": "%1$s über deinem Ziel geplant",
					"under": "Noch %1$s, um dein Ziel zu erreichen",
					"ok": "Geplante Stunden entsprechen deinem Monatsziel"
				},
				"actual": {
					"ahead": "Aktuell bist du %1$s über deinem Plan",
					"behind": "Aktuell bist du %1$s hinter deinem Plan",
					"ok": "Du bist im Soll mit deinen geplanten Stunden"
				},
				"projected": {
					"over": "Du wirst %1$s über deinem Monatsziel sein",
					"under": "Du wirst %1$s unter deinem Monatsziel sein",
					"ok": "Du bist im Plan, um dein Monatsziel zu erreichen"
				},
				"projected_goal": {
					"over": "Du bist %1$s über deinem Monatsziel",
					"under": "Du bist %1$s unter deinem Monatsziel",
					"ok": "Du hast dein Monatsziel erreicht"
				},
				"projected_planned": {
					"over": "Du wirst %1$s über deinen geplanten Stunden sein",
					"under": "Du wirst %1$s unter deinen geplanten Stunden sein",
					"ok": "Du wirst die Anzahl deiner geplanten Stunden erreichen"
				}
			}
		},
		"notes": {
			"none": {
				"title": "No notes to show",
				"description": "This list will show all notes from the currently selected calendar month and forward."
			}
		},
		"service_year": {
			"summary": "%1$s Dienstjahr Zusammenfassung"
		},
		"send": {
			"greeting": "Hallo %1$s,",
			"intro": "Hier ist mein Bericht für %1$s:",
			"carried": "%1$s Minuten wurden zum nächsten Monat übertragen (km 9/88 3)",
			"credit_hours": {
				"included_hours": "Die berichtete Zeit enthält eine %1$s Stundengutschrift für %2$s.",
				"comment_only": "Bitte notiere eine %1$s Stundengutschrift für %2$s."
			},
			"other_hours": {
				"included_hours": "Die berichtete Zeit enthält %1$s %2$s.",
				"adjusted_hours": "Die berichtete Zeit enthält einige von %1$s %2$s.",
				"comment_only": "Bitte notiere %1$s %2$s."
			}
		},
		"schedule": {
			"daily_apply": "Setze Tagesziele",
			"daily_confirm": "Deine in den Einstellungen gesetzten Tagesziele für jeden Wochentag werden damit im %1$s übernommen und in die Spalte als geplante Stunden eingetragen.",
			"recalc_apply": "Bericht neu berechnen",
			"recalc_confirm": "Dies wird den Bericht für %1$s neu berechnen."
		},
		"alerts": {
			"manual_ttl": "Manuell hinzugefügte Abgaben",
			"manual_msg": "Diese manuell hinzugefügten Abgaben sind nicht mit einem Kontakt oder Rückbesuch verknüpft.",
			"videos_ttl": "Videovorführungen",
			"videos_ttl_manual": "Manuelle Videovorführungen",
			"videos_msg": "Diese Videovorführungen sind nicht mit einem Kontakt oder Rückbesuch verknüpft."
		}
	},
	"settings": {
		"title": "Einstellungen",
		"dropbox": {
			"title": "Dropbox Sync",
			"connect": "Verbinde mit Dropbox",
			"connect_footer": "Verbinde dich mit Dropbox um deine Daten automatisch zu sichern oder sie zwischen verschiedenen Geräten zu synchronisieren.\nWenn du noch keinen Dropbox-Account hast, kannst du kostenlos einen erstellen.",
			"disconnect": "Dropbox-Verbindung trennen",
			"confirm_disconnect": "Bist du dir sicher, dass du die Verbindung zu Dropbox trennen und die Synchronisation deiner Daten beenden willst?",
			"last_sync": "Letzte Synchronisation: %1$s",
			"sync_options": "Synchronisations-Optionen",
			"auto_sync": "Automatische Synchronisation",
			"wifi_only": "Sync nur im WLAN",
			"sync_now": "Synchronisiere jetzt alle Daten",
			"sync_complete": "Synchronisation abgeschlossen",
			"syncing": "Synchronisiere ...",
			"account": {
				"details": "Verbundener Account",
				"name": "Name",
				"email": "E-Mail"
			}
		},
		"backup": {
			"title": "Manuelle Sicherung",
			"button": "Jetzt Sicherungsdateien erstellen",
			"last": "Letzte Sicherung: %1$s",
			"footer": "Versende eine Sicherung deiner App Dateien per Mail",
			"confirm": {
				"title": "Erstelle Sicherung",
				"progress": "Erstelle Sicherung ...",
				"message": "Hiermit wird eine ZIP Datei erstellt. Du kannst wählen wo und wie die Datei gespeichert wird.\n\nEs dauert einige Sekunden die Sicherungsdatei zu erstellen."
			},
			"reminder": {
				"enable": "Enable Backup Reminders",
				"7day": "Every 7 days",
				"14day": "Every 14 days",
				"30day": "Every 30 days",
				"60day": "Every 60 days",
				"alert": {
					"title": "Backup Reminder",
					"message": "It is time to backup your files. Would you like to generate the backup now?\n\nYou can configure these backup reminders in Settings."
				}
			},
			"restore": {
				"title": "Restore Backup",
				"progress": "Restoring Backup ...",
				"restored": "Data Restored",
				"confirm": "Are you sure you want to restore the data in the ZIP file?\n\nThis will replace all current data in this install of ServicePlanner.",
				"complete": "Your files were successfully restored.\n\nSome restored content may only show after ServicePlanner is restarted.",
				"blocked": "Something was wrong with the ZIP file.\n\nThe restore was blocked and nothing was changed in this install of ServicePlanner.",
				"cancelled": "The restore was cancelled and nothing was changed in this install of ServicePlanner."
			}
		},
		"appearance": {
			"title": "Erscheinungsbild",
			"color": "Farbschema"
		},
		"workflow": {
			"title": "Automatisierung",
			"next_visit": "Tage bis Rückbesuch",
			"turn_orange": "Tage bis Orange",
			"turn_red": "Tage bis Rot",
			"turn_blood": "Tage bis Dunkelrot",
			"default_visit_type": "Standard-Besuchstyp",
			"visit_time": "Nutze geplante Zeit",
			"hints": {
				"overview": "Workflow controls what happens when you add a new visit to a contact.\n\nEach Contact Type has it's own workflow rules. For example, if you add a new visit to a Contact Type = \"Bible Study\", then you want the Visit Type to be set to \"Return Visit\" by default. And you want the next visit to be automatically scheduled for X days into the future.\n\nNormally the time of the next visit is set to the time of the visit you are currently adding, logically assuming that if you successfully contacted the person at this time today, then try the same time again next visit. However you can tell the workflow to use the \"Scheduled Time\" of the previous visit instead - i.e. re-use the planned visit time, not the time that the visit is being recorded. This is handy for Bible Studies held at the same time each week for example.\n\nThe \"Days until ...\" options let you control the number of days before the date indicators and labels change colour.\n\nFeel free to experiment and customize the rules to match your personal workflow! You can now even click on a Contact Type and rename it.",
				"visit_time": "Standard ist die aktuelle Zeit",
				"next_visit": "Diese Zahl wird genutzt, um den nächsten Besuch automatisch zu planen.",
				"change_color": "Die Zahl der Tage wird vom letzten Besuch an gezählt.",
				"default_visit_type": "Wenn ein neuer Besuch hinzugefügt wird, wird dieser Besuchstyp vorgegeben.",
				"restart": "Diese Einstellung wird erst nach einem Neustart der App geändert."
			}
		},
		"partners": {
			"title": "Dienstpartner",
			"event": {
				"calendar": "Standardkalender",
				"event": "Kalenderereignis",
				"event_footer": "Nur für den ersten Dienstpartner",
				"auto_add": "Automatisch zu Kalender hinzufügen",
				"tentative_title": "Ereignistitel - Vorläufig",
				"tentative_event": "Predigtdienst mit %n?",
				"confirmed_title": "Ereignistitel - Bestätigt",
				"confirmed_event": "Predigtdienst mit %n",
				"footer": "%n = Predigtdienstpartner"
			},
			"name": {
				"title": "Dienstpartner Name",
				"full": "Vollständiger Name",
				"first": "Vorname"
			}
		},
		"schedule": {
			"title": "Zeitplan",
			"form": {
				"annual_goal": "Jahresziel",
				"monthly_goal": "Monatsziel",
				"daily_goals": "Tägliches Ziel",
				"daily_footer": "Um beim Zeitplan für den Monat (über \"...\" im Aktivitäten-Bildschirm zu erreichen) einen Tag zu überspringen setze ihn auf leer (—)."
			}
		},
		"reporting": {
			"title": "Bericht",
			"overseer": {
				"send_to": "Sende den Bericht an",
				"name": "Name",
				"mobile": "Handynummer",
				"email": "E-Mail"
			},
			"apps": {
				"method": "Sende den Bericht per",
				"not_installed": "%1$s scheint nicht installiert zu sein. Bitte wähle eine andere Methode."
			},
			"calendar": {
				"title": "Starte Kalenderwoche am"
			},
			"hours": {
				"time": {
					"title": "Berichte Zeit in",
					"tick": "Geteilt im Ministerium",
					"hours": "Volle Stunden (Standard)",
					"minutes": "15 Minuten Einheiten",
					"footer": "Nur nach Sondervereinbarung"
				},
				"other": {
					"title": "Andere Stunden",
					"enable": "Aktiviere andere Stunden",
					"label": "Beschrifte als",
					"one_word": "Bitte beschrifte mit nur einem einzelnen Wort.",
					"options": {
						"title": "Andere Stunden Optionen",
						"include_hours": "In den monatskalender aufnehmen",
						"include_report": "In den Bericht einschließen",
						"include_comment": "Als Notiz auf dem Bericht",
						"include_breakdown": "Stundenaufschlüsselung anzeigen",
						"maximum_hours": "Maximale andere Stunden",
						"footer": "Andere Stunden werden reduziert, wenn die monatliche Summe das Maximum überschreitet."
					}
				},
				"alerts": {
					"format_prompt_title": "Wählen Sie Berichtsformat",
					"format_prompt_message": "Möchten Sie Ihre Stunden (wenn Sie Pionier sind) oder nur die Stunden, die Sie im Predigtdienst geleistet haben, melden?\n\nSie können die Standardeinstellung jederzeit unter Einstellungen > Berichterstellung ändern.\n\nAuf dem Aktivitätsbildschirm können Sie das Berichtsformat für einen bestimmten Monat ändern. Sie können Ihre Stunden auch im Kalender ein- oder ausblenden (siehe Menüoptionen oben/rechts).",
					"format_tick": "Bericht im Ministerium geteilt ✓",
					"format_hours": "Volle Stunden melden",
					"month_switch_title": "Berichtsformat wechseln",
					"month_switch_hours": "Möchten Sie für diesen Monat zur Meldung ganzer Stunden wechseln?\n\nHinweis: Dies wirkt sich nicht auf die Stundenanzeige im Kalender aus, der über das Menü oben/rechts gesteuert wird.",
					"month_switch_tick": "Möchten Sie dazu übergehen, nur anzugeben, dass Sie diesen Monat am Dienst teilgenommen haben, d. h. Ihre Stunden nicht mitzuteilen?\n\nHinweis: Dies wirkt sich nicht auf die Stundenanzeige im Kalender aus, der über das Menü oben/rechts gesteuert wird."
				}
			},
			"mileage": {
				"title": "Kilometerstand protokollieren",
				"enable": "Aktiviere Kilometerstands-Protokoll",
				"units_fuel": "Einheiten - Benzin",
				"units_distance": "Einheiten - Strecke"
			},
			"options": {
				"title": "Zusätzliche Optionen",
				"notes": "Füge Notizen zum Bericht hinzu",
				"zero": "Leere Berichtszeilen hinzufügen",
				"footer": "Versteckt optional Berichtszeilen, die im Bericht mit 0 erscheinen würden. Stunden werden immer aufgeführt."
			},
			"comment": {
				"title": "Notiz für den Bericht",
				"footer": "Wird am Ende des Berichts gezeigt"
			}
		},
		"ministry": {
			"title": "Predigtdienst"
		},
		"social": {
			"website": "Webseite",
			"facebook": "Facebook",
			"twitter": "Twitter"
		},
		"help": {
			"title": "Hilfe & Support"
		},
		"issues": {
			"title": "Problem melden"
		},
		"maps": {
			"title": "Adressen",
			"open_in": "Öffne Orte in ...",
			"contacts": {
				"title": "Adressensuche",
				"reformat": "Adresse formatieren",
				"locality": "Autovervollständige den Ort",
				"footer": "Stadtteil = Vorort oder Stadtteil."
			},
			"address": {
				"title": "Adressen-Format",
				"street": "Straße",
				"no_city": "Straße, Stadtteil",
				"no_country": "Straße, Stadtteil, Stadt",
				"full": "Straße, Stadtteil, Stadt, Land",
				"footer": "Straße beinhaltet die Hausnummer. Stadt enthält meist auch die Postleitzahl."
			},
			"locality": {
				"title": "Format des Stadtteils",
				"suburb": "Vorort oder Stadtteil",
				"postcode_city": "Postleitzahl Stadt",
				"city_postcode": "Stadt Postleitzahl",
				"footer": "Stadtteil wird genutzt um Kontakte in einem Umfeld zu gruppieren."
			},
			"restrictions": {
				"title": "Umgekehrte Geosuche",
				"country": "Begrenze Suche auf %1$s"
			}
		},
		"timer": {
			"title": "Stoppuhr",
			"enable": "Aktiviere Stoppuhr",
			"rounding": {
				"title": "5 Minuten Intervalle",
				"down": "Runde immer ab",
				"nearest": "Runde zum Näheren",
				"footer": "Gibt an, ob 13 Minuten als 10 oder 15 Minuten gezählt werden."
			},
			"seconds": {
				"title": "Sekunden",
				"hide": "Verstecke, wenn über 00:00:59",
				"always": "Zeige Sekunden immer an",
				"footer": "Eine Anzeige ohne Sekunden lenkt weniger ab."
			},
			"badge": {
				"label": "Zeige App Badge",
				"footer": "Zeigt \"1\" wenn die Stoppuhr läuft"
			},
			"color": {
				"title": "Farbe, wenn Stoppuhr läuft",
				"slate_gray": "Schiefergrau",
				"light_blue": "Hellblau",
				"dark_blue": "Dunkelblau",
				"light_green": "Hellgrün",
				"dark_green": "Dunkelgrün"
			},
			"logs": {
				"title": "Aufzeichnungen",
				"none": "Noch keine Stoppuhr-Aufzeichnungen",
				"alert": "Beim Löschen einer Stoppuhr-Aufzeichnung ändert sich deine berichtete Predigtdienstzeit nicht.",
				"footer": "Nur die 30 neuesten Einträge werden behalten. Einstellungen und Aufzeichnungen der Stoppuhr werden nicht zwischen den Geräten synchronisiert."
			}
		},
		"debug": {
			"title": "Debug Hilfen",
			"device": "Geräteinformationen",
			"memory": "Verfügbarer Speicher",
			"network": "Netzwerktyp",
			"email": {
				"title": "Debug Datei versenden",
				"footer": "Verwende diese Funktion bitte nur auf spezielle Anfrage des Entwicklers, um dir damit bei der Lösung eines Problems zu helfen.",
				"message": "Verwende diese Datei nicht - Sende sie nur per E-Mail an %1$s.",
				"button": "Erstelle E-Mail"
			}
		},
		"beta": {
			"title": "Beta Testers",
			"gitlab": {
				"title": "Beta Tracker",
				"button": "Issue Tracker for Beta Testers",
				"footer": "Used for beta specific bug reports and feedback. Create a free GitLab account and send me your username to get access."
			},
			"report": {
				"title": "Submit New Issue",
				"email": "Your GitLab Email Address (Optional)",
				"button": "Send Feedback",
				"footer": "Get your personalised email address from the bottom of the list of Issues on the GitLab Issue Tracker."
			}
		},
		"appstore": {
			"title": "App Store"
		},
		"tags": {
			"edit": "Tag umbenennen",
			"delete": {
				"title": "Tag löschen",
				"warning": "Der Tag \"%1$s\" wird von all deinen Kontakten entfernt.\n\nBist du dir sicher, dass du das willst?"
			}
		},
		"notifications": {
			"title": "Benachrichtigungen",
			"sync": "Benachrichtigungseinstellungen werden nicht zwischen den Geräten synchronisiert",
			"report": {
				"title": "Berichts-Erinnerung",
				"last": "Am letzten Tag des Monats",
				"first": "Am ersten Tag des Folgemonats",
				"notification": {
					"message": "Es ist Zeit deinen Predigtdienst-Bericht abzuschicken."
				}
			},
			"visits": {
				"title": "Rückbesuchs-Erinnerung",
				"tomorrow": "Am Abend zuvor",
				"today": "Am Morgen",
				"notification": {
					"message": "Du hast %1$s %2$s für %3$s geplant."
				}
			},
			"partner": {
				"title": "Predigtdienstpartner",
				"tomorrow": "Am Abend zuvor",
				"today": "Am Morgen",
				"notification": {
					"message": "Du bist %2$s mit %1$s verabredet.",
					"join_middle": ",",
					"join_last": "und"
				}
			}
		},
		"gdpr": {
			"title": "DSVGO konform",
			"footer": "Deaktiviert den Bereich Kontakte und Kontaktdaten.",
			"alert": "Dieser Modus sorgt dafür, dass die App für Verkündiger in Großbritannien und der EU Datenschutzkonform ist.\n\n1) Er deaktiviert den Bereich Kontakte und das Kontakte-Addon im Heute-Startbildschirm.\n\n2) Alle existierenden Rückbesuche werden dauerhaft gelöscht.",
			"notice": "In manchen Teilen der Welt müssen Verkündiger sichergehen, dass ihre Tätigkeit der Datenschutzgrundverordnung (DSVGO) entspricht. Das bedeutet, dass keinerlei persönliche Daten gesammelt werden dürfen.\n\nWenn die DSVGO in deinem Land gilt, gehe bitte in die App-Einstellungen und aktiviere den \"GDPR Compliance\" Modus.\n\nBei Fragen dazu wende dich bitte an einen Ältesten deiner Versammlung oder schaue auf die Webseite.",
			"important": "Wichtige Information",
			"understand": "Ich verstehe"
		}
	}
}
