{
	"common": {
		"format": "Formato",
		"notnow": "Agora Não",
		"more": "Mais",
		"outline": "Esboço",
		"bible": "Bíblia",
		"reset": "Restablecer",
		"error": "Erro",
		"new": "Novo",
		"verse": "Versículo",
		"note": "Nota",
		"annotate": "Anotar",
		"annotations": "Anotações",
		"cancel": "Cancelar",
		"ok": "OK",
		"yes": "Yes",
		"no": "No",
		"other": "Outro",
		"done": "Fechar",
		"top": "Topo",
		"edit": "Editar",
		"add": "Adicionar",
		"save": "Guardar",
		"delete": "Apagar",
		"remove": "Remover",
		"search": "Procurar",
		"options": "Opções",
		"chapter": "Capítulo",
		"article": "Artigo",
		"title": "Título",
		"image_viewer": "Visualizador de Imagens",
		"reference": "Referência",
		"topic": "Tópico",
		"heading": "Cabeçalho",
		"reloading": "Recarregar",
		"loading": "A Carregar",
		"settings": "Definições",
		"confirm": "Confirme por favor",
		"forums": "Mostrar Fóruns",
		"history": "Histórico",
		"historyclear": "Apagar Histórico",
		"historyconfirm": "Irá apagar todo o Histórico. Tem a certeza que deseja continuar?",
		"subheadings": "Subtítulos",
		"copied": "Copiado para a Área de Transferência",
		"page": "Página",
		"pages": "Páginas",
		"paragraphs": "Parágrafos",
		"footnote": "Nota de rodapé",
		"about": "Sobre",
		"news": "Notícias",
		"general": "Geral",
		"word_search": "Procurar por uma palavra",
		"tip": "Dica",
		"recent": "Recente",
		"recently_opened": "Aberto Recentemente",
		"frontcover": "Capa",
		"reorder": "Reordenar",
		"order": "Ordenar",
		"favourites": "Favoritos",
		"favouritesave": "Guardar como Favorito",
		"websites": "Websites",
		"contents": "Conteúdos",
		"clearcache": "Apagar Cache",
		"size": "Tamanho",
		"height": "Altura",
		"width": "Largura",
		"small": "Mínimo",
		"default": "Por Defeito",
		"medium": "Pequeno",
		"large": "Médio",
		"larger": "Maior",
		"largest": "Máximo",
		"fullscreen": "Ecrã completo",
		"home": "Início",
		"back": "Anterior",
		"forward": "Próximo",
		"toggle2lines": "Modo 2 linhas",
		"list": "Lista",
		"grid": "Grelha",
		"map": "Mapa",
		"hybrid": "Hibrido",
		"choose": "Escolha",
		"selectall": "Selecionar Tudo",
		"online": "Online",
		"file": "Ficheiro",
		"layout": "Mudar Aspeto",
		"never": "Nunca",
		"sync": "Sincronizar",
		"syncing": "A sincronizar",
		"current": "Atual",
		"saved": "Guardado",
		"active": "Ativo",
		"alert": "Alerta",
		"warning": "Aviso",
		"important": "Importante",
		"acknowledge": "Confirmar",
		"any": "Qualquer",
		"none": "Nenhum",
		"enable": "Ativar",
		"enabled": "Ativado",
		"disable": "Desativar",
		"disabled": "Desativado",
		"update": "Atualizar",
		"modify": "Modificar",
		"created": "Criado",
		"overdue": "Em atraso",
		"cannot": "Não pode continuar",
		"all": "Todos",
		"website": "Website",
		"epub": "EPUB",
		"pdf": "PDF",
		"open_prompt": "Abrir %1$s",
		"view_prompt": "Visualizar %1$s",
		"download_prompt": "Download %1$s",
		"details": "Detalhes",
		"stop": "Parar",
		"start": "Começar",
		"custom": "Personalizar",
		"summary": "Sumário",
		"please_note": "Note Por Favor",
		"when": "Quando",
		"bookmarks": "Favoritos",
		"bookmark": "Favorito",
		"territory": "Território",
		"territories": "Territórios",
		"congregation": "Congregação",
		"show_prompt": "Mostrar %1$s",
		"hide_prompt": "Ocultar %1$s",
		"delete_prompt": "Apagar %1$s",
		"remove_prompt": "Remove %1$s",
		"open_in_prompt": "Abrir em %1$s",
		"open_item_in_prompt": "Abrir %1$s em %2$s",
		"edit_in_prompt": "Editar em %1$s",
		"view_in_prompt": "Visualizar em %1$s",
		"download_from_prompt": "Download de %1$s",
		"sync_prompt": "Sincronizar com %1$s",
		"syncing_prompt": "A sincronizar com %1$s",
		"notes": "Notas",
		"read_only": "Somente leitura",
		"editable": "Editável",
		"required": "Obrigatório",
		"unknown": "Desconhecido",
		"confirmed": "Confirmado",
		"calendar": "Calendário",
		"end": "Fim",
		"ahead": "À frente",
		"behind": "Atrás"
	},
	"time": {
		"tomorrow": "Amanhã",
		"today": "Hoje",
		"yesterday": "Ontem",
		"earlier_this_week": "Anteriormente Nesta Semana",
		"next_week": "Next Week",
		"this_week": "Esta Semana",
		"last_week": "Semana Passada",
		"next_month": "Next Month",
		"this_month": "Este Mês",
		"last_month": "Mês Passado",
		"older": "Antigo",
		"newer": "Novo",
		"next_year": "Next Year",
		"this_year": "Este Ano",
		"last_year": "Ano Passado",
		"on_or_before": "Em ou antes de %1$s",
		"over_years_ago": "Over %1$s years ago",
		"over_year_ago": "Over 1 year ago",
		"over_months_ago": "Há mais de %1$s meses",
		"over_month_ago": "Há 1 mês atrás",
		"over_weeks_ago": "Há mais de %1$s semanas",
		"over_week_ago": "Há 1 semana atrás",
		"over_days_ago": "Há mais de %1$s dias",
		"within_days": "Nos últimos %1$s dias",
		"within_next_days": "Within the next %1$s days",
		"over_days_away": "Over %1$s days away",
		"over_week_away": "Over 1 week away",
		"over_weeks_away": "Over %1$s weeks away",
		"over_month_away": "Over 1 month away",
		"over_months_away": "Over %1$s months away",
		"over_year_away": "Over 1 year away",
		"over_years_away": "Over %1$s years away",
		"future": "Future",
		"day": "Dia",
		"week": "semana",
		"month": "mês",
		"year": "ano",
		"hours": "horas",
		"hour": "hora",
		"minutes": "minutos",
		"date": "Data",
		"date_added": "Date Added",
		"date_created": "Date Created",
		"date_updated": "Date Updated",
		"date_picker": "Escolher Data",
		"time": "Time",
		"time_picker": "Escolher Hora",
		"format": {
			"time": {
				"standard": "g:i a",
				"full": "g:i:s a"
			},
			"date": {
				"day": "l",
				"year": "Y",
				"full": "d/m/Y",
				"full_short": "d/m/y",
				"day_date_suffix": "l jS",
				"day_date_month": "D d/m",
				"day_month_date": "l, F j",
				"day_month_date_year": "l, F j Y",
				"month_year": "F Y",
				"date_month": "d/m",
				"date_month_year": "j F Y",
				"picker": "D j M"
			},
			"datetime": {
				"long": "d/m/Y g:i:s a",
				"full": "l, F j Y, g:i a",
				"month": "F j, l g:i a",
				"month_short": "F d/m g:i a",
				"day_date_month_time": "D d/m \\a\\t g:i a"
			}
		},
		"abbreviations": {
			"hours_minutes": "HH:MM",
			"minutes_seconds": "MM:SS",
			"mins": "mins",
			"am": "am",
			"pm": "pm",
			"st": "1º",
			"nd": "2º",
			"rd": "3º",
			"th": "4º"
		},
		"days": {
			"long": {
				"sunday": "Domingo",
				"monday": "Segunda-feira",
				"tuesday": "Terça-feira",
				"wednesday": "Quarta-feira",
				"thursday": "Quinta-feira",
				"friday": "Sexta-feira",
				"saturday": "Sábado"
			},
			"short": {
				"sun": "Dom",
				"mon": "2ª",
				"tue": "3ª",
				"wed": "4ª",
				"thu": "5ª",
				"fri": "6ª",
				"sat": "Sáb"
			}
		},
		"months": {
			"long": {
				"january": "Janeiro",
				"february": "Fevereiro",
				"march": "Março",
				"april": "Abril",
				"may": "Maio",
				"june": "Junho",
				"july": "Julho",
				"august": "Agosto",
				"september": "Setembro",
				"october": "Outubro",
				"november": "Novembro",
				"december": "Dezembro"
			},
			"short": {
				"jan": "Jan",
				"feb": "Fev",
				"mar": "Mar",
				"apr": "Abr",
				"may": "Mai",
				"jun": "Jun",
				"jul": "Jul",
				"aug": "Ago",
				"sep": "Set",
				"oct": "Out",
				"nov": "Nov",
				"dec": "Dez"
			}
		}
	},
	"measurement": {
		"long": {
			"km": "KM",
			"mi": "Milhas",
			"gal": "Galão",
			"L": "Litro"
		}
	},
	"titles": {
		"mr": "Sr",
		"mrs": "Sra.",
		"miss": "Menina",
		"ms": "Senhora",
		"dr": "Dr"
	},
	"email": {
		"feedback": "Enviar Comentários",
		"standard": "Enviar Formato Padrão",
		"send": "Enviar E-mail",
		"confirm": "Por favor confirme se a sua dúvida,\nproblema ou sugestão já se\nencontra no Fórum de Suporte.\n\nCaso contrário, sinta-se à vontade\npara nos contatar!",
		"english": "Todo o apoio dado é em Inglês. Por favor, seja paciente comigo.",
		"import": "Importar para o %1$s",
		"footer": "Email criado por %1$s"
	},
	"forms": {
		"validation": {
			"alert_title": "Inválido",
			"alert_message": "Por favor corrija o seguinte...",
			"missing_value": "\"%1$s\" necessita estar preenchido",
			"url": "Por favor insira um endereço URL válido a começar com http:// ou https://"
		}
	},
	"search": {
		"placeholder": "Procurar %1$s",
		"searching": "A procurar",
		"nothing": "Nenhuma equivalência encontrada"
	},
	"browser": {
		"reload": "Recarregar Página",
		"open": "Open Browser",
		"safari": "Abrir no Safari",
		"clipboard": "Copiar Link para Área de Transferência",
		"email": "Enviar por email link para esta página"
	},
	"apps": {
		"email": "Email",
		"sms": "Mensagem de Texto",
		"telegram": "Telegram",
		"whatsapp": "WhatsApp",
		"wechat": "WeChat",
		"viber": "Viber",
		"line": "LINE",
		"hourglass": "Hourglass",
		"nwpublisher": "NW Publisher",
		"dropbox": "Dropbox",
		"th": "Territory Helper",
		"tasks": {
			"alert": "Alerta %1$s",
			"error": "Erro %1$s",
			"account": "Conta %1$s",
			"connect": "Conectar a %1$s",
			"sign_in": "Entrar",
			"sign_into": "Entre na %1$s",
			"permissions": "Atualizar Permissões",
			"register": "Registre-se com %1$s",
			"registering": "A registrar com %1$s",
			"errors": {
				"duplicate": "Uma sincronização %1$s já está a ser realizada. Aguarde a conclusão e tente novamente.",
				"registering": "Não é possível registrar com %1$s.\n\nPor favor tente mais tarde ou envie email para %2$s para podermos verificar se a API %3$s está a funcionar.\n\nDesculpe pelo inconveniente.",
				"expired": "Seu login para %1$s expirou. Por favor faça login novamente para atualizar as suas permissões.",
				"something": "Oops, deu erro em algum lado.\n\nTalvez não tenha o nível de acesso correto para realizar a tarefa. Possivelmente %1$s está offline ou a experenciar problemas neste momento.\n\nPor favor, verifique o que conseguir e tente novamente mais tarde ou reporte este problema.",
				"disconnected": "Foi desconectado do %1$s. Faça login novamente."
			}
		}
	},
	"alerts": {
		"phone": {
			"title": "Chamada Telefónica",
			"confirm": "Tem a certeza que quer telefonar para\n%1$s?"
		},
		"sms": {
			"title": "Mensagem",
			"confirm": "Tem a certeza que quer enviar mensagem para %1$s?",
			"cannot": "Este equipamento não pode enviar mensagens SMS."
		},
		"ziperror": "O ficheiro \"%1$s\" não é válido. De certo existiu algum erro quando realizou o download do ficheiro - tente realizar novamente o download do ficheiro.\n\nO ficheiro será apagado agora.",
		"import": {
			"failed": "Desculpe, houve um erro ao tentar importar os dados. Nada foi importado."
		},
		"noemail": "Email não parece ser suportado neste equipamento. Configurou Email nas definições do Mail do iOS?",
		"restart": "Por favor reinicie %1$s para que as configurações entrem em vigor.",
		"yousure": "Tem certeza de que quer fazer isso?",
		"internet": {
			"cannot": "Não consegue ligar-se à Internet",
			"tryagain": "Ligue e tente novamente",
			"offline": "Não está online atualmente. Conecte-se à Internet e tente novamente."
		},
		"permissions": {
			"calendar": "Não consigo aceder aos calendários do seu dispositivo. Por favor, verifique as permissões em Configurações> Privacidade> Calendários."
		},
		"tables": {
			"pulldown": "Puxe para baixo para atualizar...",
			"release": "Solte para atualizar...",
			"loading": "A carregar dados..."
		}
	},
	"calls": {
		"title": "Visitas",
		"today_none": "Sem visitas agendadas para hoje",
		"date_none": "Sem visitas agendadas para %1$s",
		"today_hint": "Para ver a visita aqui coloque a data no campo \"Próxima Visita\" nas definições da visita.",
		"actions": {
			"first": "Adicionar a sua Primeira Visita",
			"another": "Adicionar uma Visita",
			"new": "Nova Visita",
			"verifying": "A verificar visitas",
			"delete": "Apagar Visita",
			"share": "Partilhar Visita"
		},
		"types": {
			"first_call": "Contacto Inicial",
			"return_visit": "Revisita",
			"magazine_route": "Itenerário",
			"top_priority": "Alta Prioridade",
			"bible_study": "Estudo Biblico",
			"custom": "Custom Type",
			"inactive": "Inativo"
		},
		"types_abbreviated": {
			"first_call": "CI",
			"return_visit": "RV",
			"magazine_route": "IT",
			"top_priority": "AP",
			"bible_study": "EB",
			"custom": "CT",
			"inactive": "I"
		}
	},
	"contacts": {
		"title": "Contatos",
		"contact": "Contato",
		"selected": "%1$s Selecionado",
		"name": "Nome",
		"phone": "Telefone",
		"email": "Email",
		"link": "Link",
		"actions": {
			"first": "Adicione o seu primeiro contato",
			"another": "Adicione um novo contato",
			"first_hint": "Click no botão + no topo/direito...",
			"add": "Adicionar Contato",
			"new": "Novo Contato",
			"import": "Importar Contactos do Equipamento",
			"verifying": "A verificar Contatos",
			"filter": "Filtrar Contatos",
			"edit": "Editar Contato",
			"delete": "Apagar Contato",
			"deleted": "Contato Apagado",
			"message": "Enviar Mensagem",
			"share": "Partilhar Contato",
			"search": "Procurar Contatos",
			"search_hint": "Procurar Nome ou Endereço"
		},
		"shared": {
			"subject": "Contacto de ServicePlanner partilhado",
			"intro": "Este contacto foi partilhado consigo a partir de <a href=\"https://serviceplanner.me\">ServicePlanner</a>. Se também usa o ServicePlanner, pode importar este contacto por abrir o anexo do e-mail.",
			"email": "Email Resumido",
			"file": "Partilhar Ficheiro",
			"choose": "Qual o método que gostaria de usar para partilhar este contato?",
			"import": {
				"confirm": "Tem a certeza que quer importar este contato?\n\nSe o contato já existir, os seus detalhes serão substituídos. Nenhuma alteração será feita na Atividade ou Relatórios, como resultado desta importação."
			}
		},
		"headings": {
			"details": "Detalhes de Contato",
			"profile": "Perfil",
			"this_visit": "Esta Visita",
			"last_visit": "Última Visita",
			"next_visit": "Próxima Visita",
			"next_visit_day": "Dia da Visita",
			"next_visit_on": "Próxima Visita a %1$s"
		},
		"filters": {
			"save": "Guardar configurações atuais do filtro",
			"overwrite": "Overwrite Using Current Filter Settings",
			"header_include": "Incluir",
			"footer_include": "Os contatos para incluir na lista",
			"header_exclude": "Excluir",
			"footer_exclude": "Os contatos para excluir da lista",
			"include_before": "Incluir datas anteriores",
			"types": "Tipos",
			"all": "Todos os Contatos",
			"default": {
				"bylocality": "Contatos por Localidade",
				"bylocality_desc": "Agrupados por Localidade e ordenados pela Próxima Data de Visita",
				"bytype": "Contatos por tipo",
				"bytype_desc": "Agrupados por Tipo e ordenados pela Próxima Data de Visita",
				"inactive": "Contatos Inativos",
				"inactive_desc": "Agrupados e ordenados pela data da última visita, o mais antigo primeiro",
				"overdue": "Contatos atrasados",
				"overdue_desc": "Agrupados e ordenados pela data da última visita, o mais antigo primeiro"
			},
			"sorting": {
				"sort_by": "Ordenar por",
				"sort_field": "Campo",
				"sort_value": "Valor",
				"sort_group_by": "Ordenar dentro do grupo por",
				"primary": "Seleção primária",
				"secondary": "Seleção Secundária",
				"order": "  Ordem de Classificação",
				"ascending": "Ascendente",
				"descending": "Descendente",
				"asc": "ASC",
				"desc": "DESC",
				"footer": "Ordene os contatos listados",
				"footer_grouped": "Ordene os contatos dentro do grupo",
				"last_visit": "Data da Última Visita",
				"next_visit": "Data da Próxima Visita"
			},
			"saved": {
				"saved": "Filtro Guardado",
				"default": "Filtro por Defeito",
				"other": "Outros Filtros",
				"name": "Nome Filtro",
				"description": "Descrição do Filtro",
				"delete": "Apagar Filtro",
				"delete_confirm": "Tem a certeza que quer apagar este filtro?",
				"reorder": "Reordenar filtros",
				"reorder_save": "Guardar ordem dos filtros",
				"reset": "Redefenir Filtros",
				"reset_confirm": "Isto eliminará os seus filtros personalizados e serão redefinido para os filtros padrão do sistema.\n\nTem a certeza que pretende realizar esta ação?",
				"footer": "Deslize para editar ou excluir um filtro. Use o menu da barra de ferramentas para alterar a ordem. O filtro superior é sempre o filtro padrão."
			},
			"grouping": {
				"group_by": "Agrupar por",
				"turn_off": "Desligar agrupamento",
				"disabled": "O agrupamento está desativado",
				"footer": "Grupos de contatos no cabeçalho da secção"
			},
			"alerts": {
				"no_types": "Selecione pelo menos um Tipo de Contato",
				"no_matches": "Nenhum contato correspondente",
				"no_matches_hint": "Por favor altere as configurações do filtro",
				"apply_today_filter": "Isto mudará o filtro atual para mostrar \"Todos os Contatos\" com a \"Data Próxima Visita\" definida como %1$s.",
				"apply_on_or_before_filter": "Isto mudará o filtro atual para mostrar \"Todos os Contatos\" com a \"Data Próxima Visita\" em ou antes de %1$s."
			}
		},
		"type": "Tipo",
		"language": "Língua",
		"tags": "Etiqueta",
		"tag": "Nome da Etiqueta",
		"placed": "Colocado",
		"placed_qty": "Quantidade Colocada",
		"no_placements": "Ainda não colocou nada",
		"no_videos": "Ainda não mostrou nenhum vídeo",
		"shown": "Vídeos Mostrados",
		"shown_qty": "Visualizações Totais",
		"videos": "Vídeos",
		"visits": {
			"title": "Visitas",
			"visit": "Visita",
			"type": "Visit Type",
			"by_type": "Visitas por tipo",
			"plans": "Planeados",
			"details": "Detalhes da visita",
			"next": "Próxima visita agendada",
			"previous": "Visitas anteriores",
			"no_placements": "Sem publicações ou vídeos exibidos",
			"days_since": "Dias desde a última visita",
			"days_until": "Dias até a próxima visita",
			"days_overdue": "Dias atrasados",
			"actions": {
				"first": "Adicionar a primeira visita",
				"first_hint": "Clique no botão + no topo/esquerdo...",
				"new": "Nova Visita",
				"new_on": "Nova visita em %1$s",
				"edit": "Editar visita",
				"view": "Visita anterior",
				"remind": "Enviar lembrete",
				"delete": "Eliminar Visita",
				"confirmDelete": "Tem certeza de que deseja eliminar esta visita? Isso também eliminará a visita e quaisquer publicações dos relatórios.",
				"manual": "Apenas coloque um valor aqui para inserir dados históricos no relatório. Caso contrário, registre suas visitas em cada contato.",
				"plans": {
					"previous": "Planos prévios",
					"insert_this": "Inserir nas notas desta visita",
					"insert_next": "Inserir nos próximos planos de Visitas"
				}
			},
			"types": {
				"not_home": "Ninguém em casa",
				"secular": "Secular"
			}
		},
		"alerts": {
			"calculated": "Este valor é calculado automaticamente a partir das visitas que faz.",
			"inactive": "Alterar para Inativo",
			"permanent": "Apagar permanentemente",
			"confirmDelete": "Gostaria de alterar o Tipo de Contato de %1$s para \"Inactive\"? Ou prefere apagá-los definitivamente?\n\nNota: Apagar um contato não remove as visitas ou publicações do mesmo no relatório (pode fazer isso por apagar cada visita individualmente primeiro).",
			"confirmDeleteSelected": "Tem a certea que pretende apagar o contacto %1$s selecionado?\n\nOu prefere alterar o tipo de contacto para \"Inactive\" ao invés?",
			"confirmDate": "Defina a próxima data de contato dos %1$s contatos selecionados para:"
		},
		"pickers": {
			"type": "Tipo de Contato",
			"type_hint": "You can rename these types in Settings > Workflow",
			"tags": "Selecione as Etiquetas",
			"thisvisitdate": "Esta Visita",
			"nextvisitdate": "Próxima Visita",
			"dateNextVisit": "Próxima data de Visita",
			"next_week": "+ 1 semana",
			"next_fortnight": "+ 2 semanas",
			"next_month": "+ 4 semanas",
			"location": {
				"title": "Forçar Localização",
				"message": "Força o endereço para usar as coordenadas GPS de ...",
				"my_location": "Minha localização atual",
				"insert_location": "Inserir localização atual",
				"previous_address": "Inserir endereço anterior"
			}
		}
	},
	"partners": {
		"partner": "Companheiro/a",
		"start": "Hora de início",
		"end": "Hora de término",
		"calendars": {
			"header": "Opções de calendário no dispositivo",
			"device": "Calendários do dispositivo",
			"readonly": "Os calendários apenas de leitura não estão listados",
			"add": "Adicionar ao calendário",
			"remove": "Remover do calendário",
			"notes": "Alterar detalhes dos eventos no ServicePlanner."
		}
	},
	"qrcode": {
		"show": "Show QR Code",
		"saved": "QR Code saved to your Photo Library.",
		"error": "Could not save the QR code to your Photo Library."
	},
	"maps": {
		"title": "Mapas",
		"type": {
			"choose": "Escolha um tipo de mapa",
			"normal": "Normal",
			"hybrid": "Hibrido",
			"satellite": "Satélite",
			"terrain": "Terreno"
		},
		"options": {
			"tracking_on": "Ligar a minha localização",
			"tracking_off": "Desligar a minha localização",
			"traffic_on": "Tráfego ligado",
			"traffic_off": "Tráfego desligado",
			"poi_on": "Points of Interest On",
			"poi_off": "Points of Interest Off"
		},
		"apps": {
			"applemaps": "Apple Maps",
			"googlemaps": "Google Maps",
			"waze": "Waze"
		},
		"ask": "Pergunte cada vez",
		"address": {
			"select": "Por favor selecione o endereço correto:",
			"invalid": "Não é um endereço válido. Por favor, tente novamente.",
			"askapp": "Abrir Endereço em ..."
		},
		"manual": {
			"confirm": "Tem certeza de que deseja alterar a localização de \"%1$s\" para estas novas coordenadas?"
		},
		"locator": {
			"message": "O que gostaria de fazer com este endereço?",
			"what": "O que gostaria de vêr?",
			"current": "Minha localização atual",
			"contact": "Criar novo contato",
			"move": "Mover o contato existente"
		},
		"locations": {
			"message": "O que gostaria de fazer?",
			"open_in": "Aberto em %1$s",
			"drive": "Conduza para a localização",
			"star": "Local com estrela",
			"flag": "Bandeira do território",
			"car": "Localização do Carro",
			"hall": "Salão do Reino",
			"home": "Casa",
			"set": "Configurar %1$s",
			"remove": "Remover marcador de localização"
		}
	},
	"addresses": {
		"address": "Endereço",
		"geocode": "Geocódigo",
		"location": "Localização",
		"locations": "Localizações",
		"locality": "Localidade",
		"unit": "Unidade",
		"units": "Unidades",
		"floor": "Piso",
		"ground": "Piso Térreo",
		"number": "Número",
		"street": "Rua",
		"city": "Cidade",
		"postcode": "Código Postal",
		"locale": "Local",
		"components": "Address Components",
		"latitude": "Latitude",
		"longitude": "Longitude",
		"suburb": "Subúrbio",
		"county": "Município",
		"state": "Estado",
		"state_code": "Código Postal",
		"country": "País",
		"country_code": "Código do País",
		"place_id": "ID do Lugar",
		"place_id_hint": "ID de local do Google",
		"formatted": "Formatado",
		"formatted_hint": "Endereço completo",
		"actions": {
			"lookup": "Pesquisa de Endereço",
			"lookup_footer": "Isto irá pesquisar o endereço digitado e auto-completar a geocodificação e o endereço. Ou poderá editar manualmente todos os detalhes do endereço abaixo.",
			"lookup_location": "Pesquisa de Localização",
			"lookup_location_footer": "Isto irá procurar a sua localização actual e irá auto-completar o endereço, os componentes do endereço e a geocodificação.Ou poderá editar manualmente todos os detalhes abaixo.",
			"current_location": "Usar localização atual",
			"current_location_footer": "Isto irá detectar automaticamente a sua latitude e longitude atuais."
		}
	},
	"territories": {
		"name": "Nome congregação",
		"pick": "Qual território?",
		"none": "Ainda não criou nenhum Território.",
		"map_number": "Mapa %1$s",
		"map_number_type": "Mapa %1$s (%2$s)",
		"add": {
			"new": "Adicionar novo território",
			"sorry": "De momento, apenas Territórios importados de Territory Helper (territoryhelper.com) são suportados. Numa atualização futura, poderá criar o seu próprio Território manualmente. Obrigado pela sua paciência.",
			"import": "Importar de Territory Helper",
			"manual": "Criar Manualmente"
		},
		"search": {
			"congregation": "Pesquisar %1$s Mapas",
			"map": "Procurar Mapas %1$s (%2$s)"
		},
		"maps": {
			"none": "Ainda não existem mapas para este território.",
			"types": "Tipos de Mapas",
			"types_footer": "Reordenar ou clique para mudar de cor",
			"type": "Tipo de mapa",
			"details": "Detalhes do mapa",
			"number": "Número do mapa",
			"label": "Etiqueta do mapa",
			"image": "Imagem do mapa",
			"assigned": "Atribuído",
			"assigned_to": "Atribuído a %1$s",
			"unassigned": "Não atribuído"
		},
		"locations": {
			"details": "Detalhes da Localização",
			"type": "Tipo de Localização",
			"status": "Estado da Localização",
			"language": "Idioma da Localização",
			"first": "Adicione a sua primeira localização",
			"add_to": "Adicionar ao mapa %1$s",
			"visibility": {
				"title": "Visibilidade",
				"approved": "Aprovado para exibição",
				"unapproved": "Não aprovado ainda"
			}
		},
		"units": {
			"floor_hint": "Piso 0 = Piso Térreo",
			"details": "Detalhes da Unidade",
			"type": "Tipo de Unidade",
			"status": "Estado da Unidade",
			"add": "Adicionar uma unidade"
		},
		"statistics": {
			"title": "Estatisticas",
			"unique": "Único"
		},
		"types": {
			"house": "Casa",
			"apartment": "Apartamento",
			"business": "Empresa",
			"trainstation": "Estação de Comboios",
			"busstation": "Estação de Autocarros",
			"school": "Escola",
			"store": "Loja",
			"language": "Idioma",
			"harbour": "Porto",
			"airport": "Aeroporto",
			"truckstop": "Paragem de Camiões",
			"elderlyhome": "Lar terceira idade",
			"park": "Parque",
			"camp": "Campismo",
			"restaurant": "Restaurante",
			"hotel": "Hotel",
			"vacation": "Férias"
		},
		"statuses": {
			"unknown": "Estado Desconhecido",
			"returnvisit": "Revisita",
			"biblestudy": "Estudo Bíblico",
			"donotcall": "Não tocar",
			"eldersonly": "Apenas Anciãos",
			"locked": "Fechado",
			"lettersonly": "Apenas por Carta",
			"vacant": "Vazio",
			"notrespassing": "Não passar",
			"daysleeper": "Dorme de Dia",
			"witness": "Testemunha",
			"phoneonly": "Apenas por telefone",
			"referral": "Referência",
			"bewareofdog": "Cuidado com o cão"
		},
		"visits": {
			"add": "Adicionar Visita",
			"delete": "Apagar Visita",
			"status": "Estado da Visita",
			"visited": {
				"last": "Última visita",
				"never": "Nunca Visitado",
				"date": "Data da Visita"
			},
			"statuses": {
				"unvisited": "Não Visitado",
				"visited": "Visitado",
				"skipped": "Ignorado",
				"nothome1": "Não em Casa 1",
				"nothome2": "Não em Casa 2",
				"nothome3": "Não em Casa 3"
			}
		},
		"languages": {
			"unknown": "Idioma Desconhecido"
		},
		"filters": {
			"matches": "Sem resultados para o filtro atual",
			"change": "Por favor, altere as configurações do filtro",
			"maps": {
				"title": "Filtros de Território",
				"include": {
					"title": "Territórios a Incluir",
					"all": "Todos os Territórios",
					"assigned": "Atualmente atribuído",
					"mine": "Atribuído a mim"
				},
				"group": {
					"title": "Agrupar por",
					"type": "Tipo de Território",
					"none": "Nenhum Agrupamento"
				},
				"sort": {
					"title": "Ordenar por",
					"number": "Número de Território",
					"oldest": "Mais antigo primeiro",
					"assigned": "Recentemente atribuído",
					"addresses": "Endereços Exclusivos"
				}
			},
			"locations": {
				"title": "Filtros de localização",
				"types": "Localização e Tipos de Casa",
				"statuses": "Localização e Estado da Casa",
				"languages": "Localização e Lingua da Casa",
				"apply_list": "Aplicar à lista",
				"apply_map": "Aplicar ao território"
			}
		},
		"th": {
			"form": {
				"import": "Importar territórios",
				"nosync": "Os detalhes da conta do Territory Helper não estão sincronizados entre os dispositivos. Por favor, faça o login em cada dispositivo.",
				"geocode": "Por favor, pressione o botão localizar à direita do campo de endereço para geocodificar o endereço com as coordenadas de latitude e longitude.",
				"address": "Os detalhes do endereço só podem ser alterados no Territory Helper.",
				"online": "Tem de estar on-line para alterar dados no Territory Helper.",
				"details": "Estes detalhes vêm de Helper Territory.",
				"privacy": "As notas são armazenadas no Territory Helper. Certifique-se de que as suas notas estejam em conformidade com as leis locais de privacidade de dados.",
				"list": "Esta lista vem do Territory Helper.",
				"remove": "Tem a certeza que pretende remover o Território \"%1$s\" do ServicePlanner?"
			},
			"setup": {
				"publisher": "A obter dados do publicador",
				"congregaton": "A obter dados da Congregação"
			},
			"sync": {
				"title": "Use o botão Atualizar",
				"hint": "Use o botão Atualizar no canto superior/direito para obter os territórios mais recentes do Territory Helper.",
				"importing": "A importar os mapas de território ...",
				"wait": "Aguarde enquanto os mapas são importados do Territory Helper.",
				"map": "Atualizar dados do mapa",
				"location": "Atualizar dados de localização",
				"sending": "A enviar alterações para o Territory Helper"
			},
			"assignments": {
				"status": "Estado da Atribuição",
				"assigned": "Atribuído",
				"assigned_to": "Atribuído a %1$s",
				"assigned_me": "Atribuído a mim",
				"assigned_date": "Atribuído %1$s (%2$s dias)",
				"assigned_none": "Sem territórios atribuídos a mim",
				"not": "Atualmente não atribuído",
				"request": "Solicitar território",
				"request_made": "O seu pedido de território foi submetido. Por favor, aguarde que o Servo de Territórios processe o seu pedido.",
				"return": "Devolver como trabalhado",
				"unworked": "Devolver como não trabalhado"
			},
			"roles": {
				"0": "Publicador",
				"10": "Avançado",
				"30": "Ancião",
				"35": "S.Circuito",
				"40": "Assistente",
				"50": "Administrador",
				"60": "Tradutor",
				"100": "Administrador de sistema"
			},
			"permissions": {
				"reset": "Redefinir Permissões",
				"low": "Desculpe, não tem permissão para executar esta tarefa no Territory Helper.",
				"changed": "Se as suas permissões foram atualizadas recentemente no Territory Helper, por favor, vá às configurações de território no ServicePlanner e \"Redefinir Permissões\"."
			}
		}
	},
	"today": {
		"title": "Hoje",
		"plugins": {
			"timer": "Cronômetro",
			"media": "Vídeos",
			"bookshelf": "Publicações",
			"territories": "Territórios",
			"contacts": "Contatos a visitar",
			"hours": "Resumo de Horas",
			"activity": "Atividade"
		},
		"settings": {
			"title": "Configurações de Hoje",
			"plugins": "Plugins",
			"heading": "Título",
			"activity": "Plugin dos Itens de Atividade",
			"hours": "Itens de Resumo de Horas"
		}
	},
	"timer": {
		"stop": "Parar Temprizador",
		"start": "Iniciar Temporizador",
		"pause": "Pausar Temporizador",
		"resume": "Resumir Temporizador",
		"confirm": {
			"more": "Precisa de pelo menos 5 minutos para relatar.",
			"message": "Gostava de adicionar %1$s (%2$s) à sua atividade para %3$s?",
			"ministry": "Adicionar às Horas do Ministério",
			"other": "Adicionar a %1$s Horas",
			"stop": "Parar o Temporizador",
			"done_ministry": "%1$s (%2$s) foi adicionado ao seu Ministério para %3$s.",
			"done_other": "%1$s (%2$s) foi adicionado ao seu %3$s Horas para %4$s."
		}
	},
	"library": {
		"title": "Biblioteca"
	},
	"clipboard": {
		"cover": {
			"add": "Adicionar Capa",
			"title": "Pode escolher uma capa da sua biblioteca de fotos ou inserir uma imagem que copiou para a área de transferência...",
			"choose": "Escolher Foto",
			"clipboard": "Usar a imagem da àrea de transferência",
			"zoom": "Mostrar Capa",
			"remove": "Apagar Capa"
		},
		"paste": {
			"no_image_title": "Nenhuma imagem encontrada",
			"no_image_message": "A sua área de transferência não possui atualmente nenhuma imagem.\n\nPor favor localize uma imagem no seu navegador ou numa aplicação que permita que as imagens sejam copiadas e toque+segure para \"Copy\" a imagem para a sua àrea de transferência."
		}
	},
	"bookshelf": {
		"title": "Estante de Livros",
		"publications": "Publicações",
		"hints": {
			"first_item": "Pressione + na barra de ferramentas para adicionar o(a) seu(sua) primeiro(a) %1$s",
			"add_item": "Pressione + na barra de ferramentas para adicionar um(a) %1$s",
			"no_recent": "Os itens recentes são adicionados ao longo do tempo. Escolha \"All\" na barra de ferramentas para selecionar seu primeiro item."
		},
		"default": {
			"description": "You can use the \"+\" button in the top toolbar to add publications to this category.\n\nTo get you started, would you like to add some default publications? You can edit or delete them at any time.",
			"confirm": "Would you like to add some default publications to this category? It will try to skip duplicate entries based on the publication abbreviation.",
			"button": "Add Default %1$s"
		},
		"sections": {
			"magazines": "Revistas",
			"awake": "Despertais!",
			"watchtower": "Sentinelas",
			"books": "Livros",
			"brochures": "Brochuras",
			"tracts": "Tratados",
			"invites": "Convites",
			"other": "Outros"
		},
		"singular": {
			"magazines": "Revista",
			"awake": "Despertai!",
			"watchtower": "Sentinela",
			"watchtower_public": "Sentinela (Publico)",
			"watchtower_study": "Sentinela (Estudo)",
			"watchtower_simplified": "Sentinela (Simplificada)",
			"books": "Livro",
			"brochures": "Brochura",
			"tracts": "Tratado",
			"invites": "Convite",
			"other": "Publicação",
			"card": "Cartão de contato",
			"letter": "Carta",
			"link": "Link do site"
		},
		"form": {
			"new": "Novo(a) %1$s",
			"today": "Adicionar ao Ecrã Hoje",
			"remove": "Remover do Ecrã Hoje",
			"header": "Detalhes da Publicação",
			"advanced": "Detalhes avançados",
			"abbr": "Abreviação",
			"url": "Endereço de Site URL (www)",
			"issue": "Edição",
			"issue_number": "N.",
			"title": "Titulo",
			"locations": "Localização do Download",
			"pdf_url": "Endereço de Download",
			"epub_url": "Endereço de Download",
			"short_title": "Titulo Abreviado (Recomendado)",
			"published": "Ano da Publicação",
			"count": "Contar como publicação",
			"confirmTodayAdded": "Esta publicação foi adicionada ao Ecrã Hoje.",
			"confirmTodayRemoved": "Esta publicação foi removida do Ecrã Hoje.",
			"confirmDelete": "Tem a certeza que quer apagar %1$s \"%2$s\"?\n\nIsto não pode ser desfeito.",
			"cannot_delete": "Esta publicação foi colocada e, portanto, não pode ser apagada.\n\nPode usar os Filtros para localizar os Contatos que tenham esta publicação na sua Biblioteca e remova manualmente as publicações primeiro.",
			"tips": {
				"lookup": "Este botão de pesquisa é apenas um ajudante. Ele vai tentar ajudar a preencher os detalhes da publicação. No entanto, muitas vezes dará resultados incompletos ou vazios. Nesse caso, vai precisar de inserir manualmente os detalhes da publicação em falta.",
				"no_image": "Este botão não insere mais a imagem de capa das publicações. Pode usar o botão \"Adicionar Capa\" para fazer isso diretamente. Veja a secção de ajuda do website para mais informações sobre este assunto.",
				"abbr": {
					"books": "Abreviatura (bh, lv ...)",
					"brochures": "Abreviatura (fg, lc ...)",
					"tracts": "Abreviatura (T-36, T-37 ...)"
				}
			},
			"errors": {
				"abbreviation": "Não parece existir detalhes para esta abreviatura de publicação no idioma selecionado. Experimente uma abreviatura diferente ou insira os detalhes da publicação manualmente.",
				"imported": "Esta publicação foi importada e não está vinculada a nenhuma publicação na sua biblioteca do ServicePlanner."
			}
		}
	},
	"media": {
		"title": "Multimédia",
		"videos": "Vídeos",
		"video": "Vídeo",
		"default": {
			"description": "You can use the \"+\" button in the top toolbar to add videos to this category.\n\nTo get you started, would you like to add some generic video placeholders? These can be used to report videos shown to householders without having to add every specific video available. You can edit or delete them at any time.",
			"confirm": "Would you like to add some generic videos to this category? It will try to skip duplicate entries.",
			"button": "Add Generic Videos",
			"section": "Section %1$s Video"
		},
		"sections": {
			"ministry": "Ministério",
			"study": "Bible Study",
			"children": "Crianças",
			"whiteboard": "Quadro Branco",
			"songs": "Músicas",
			"other": "Outro"
		},
		"singular": {
			"videos": "Vídeo",
			"ministry": "Vídeo para o Ministério",
			"study": "Study Video",
			"children": "Vídeo para as Crianças",
			"whiteboard": "Animação no Quadro Branco",
			"songs": "Música",
			"other": "Vídeo"
		},
		"plural": {
			"videos": "Vídeos",
			"ministry": "Vídeos para o Ministério",
			"study": "Study Videos",
			"children": "Vídeos para as Crianças",
			"whiteboard": "Animações no Quadro Branco",
			"songs": "Músicas",
			"other": "Vídeos"
		},
		"sizes": {
			"240": "240p",
			"360": "360p",
			"480": "480p",
			"720": "720p"
		},
		"form": {
			"new": "Novo %1$s",
			"today": "Adicione ao Separador Hoje",
			"remove": "Remover do Separador Hoje",
			"header": "Detalhes do Vídeo",
			"downloaded_footer": "O Download dos vídeos não será sincronizado com o Dropbox",
			"advanced": "Detalhes Avançados",
			"duration": "Duração",
			"locations": "Localizações do Vídeo",
			"website": "Site",
			"website_url": "Endereço Site URL",
			"broadcast_url": "Endereço Transmissão URL",
			"no_broadcast_url": "Digite um URL de transmissão válido. Vá a tv.jw.org, encontre o vídeo que deseja adicionar, copie o URL da barra de endereços para este campo.",
			"online": "Recursos on-line",
			"download_url": "Endereço do Download",
			"download": "Download Vídeo",
			"downloaded": "Feito o Download de %1$s",
			"title": "Título",
			"short_title": "Título Curto (Recomendado)",
			"play": "Play %1$s",
			"stream": "Stream %1$s",
			"confirm_today_added": "Este vídeo foi adicionado ao Ecrã Hoje.",
			"confirm_today_removed": "Este vídeo foi removido do Ecrã Hoje.",
			"confirm_delete": "Tem a certeza que quer apagar %1$s \"%2$s\"?\n\nIsto não pode ser desfeito.",
			"cannot_delete": "Este vídeo foi mostrado e, portanto, não pode ser apagado.\n\nPode usar os Filtros para localizar os Contatos que tenham visualizado este vídeo e remova manualmente este vídeo primeiro.",
			"no_videos": "Não definiu nenhum local para este vídeo.",
			"tips": {
				"lookup": "Este botão de pesquisa é apenas um ajudante. Ele vai tentar ajudar a preencher os detalhes do vídeo. No entanto, muitas vezes dará resultados incompletos ou vazios. Nesse caso, vai precisar de inserir manualmente os detalhes em falta do vídeo.",
				"no_image": "Este botão não insere mais a imagem de capa dos filmes. Pode usar o botão \"Adicionar Capa\" para fazer isso diretamente. Veja a secção de ajuda do website para mais informações sobre este assunto."
			},
			"errors": {
				"url": "Não parece existir detalhes para a transmissão no idioma selecionado. Por favor coloque um endereço de transmissão válido ou então selecione uma língua diferente e experimente novamente. Em ultimo caso coloque os detalhes do video manualmente.",
				"imported": "Este vídeo foi importado e não está ligado a nenhum vídeo na sua Biblioteca do ServicePlanner.\n\nPode adicionar novamente os vídeos nas suas visitas se quiser atualizar essa lista."
			}
		}
	},
	"languages": {
		"single": "Idioma",
		"multiple": "Idiomas",
		"available": "%1$s disponíveis",
		"selected": "%1$s selecionados",
		"other": "Outros %1$s",
		"search": "Procurar por um %1$s",
		"app": {
			"title": "App Idioma",
			"hint": "Usado para botões e rótulos",
			"restart": "Por favor, reinicie o aplicativo para alterar o idioma."
		},
		"beta": {
			"title": "Traduções Incompletas (Beta)",
			"hint": "Envie um email para support@serviceplanner.me para obter ajuda"
		},
		"chinese": {
			"options": "Opções para Chines",
			"characters": "Apenas Carateres",
			"pi": "Pinyin",
			"zhu": "Zhuyin",
			"lau": "Sidney Lau",
			"yale": "Yale",
			"twoline": "%1$s 2-Linhas",
			"oneline": "%1$s Apenas"
		}
	},
	"websites": {
		"tasks": {
			"bookmark": "Adicionar Favorito",
			"video": "Adicionar Video",
			"video_cat": "A que categoria pretende adicionar este video?",
			"briefcase": "Adicionar à Pasta",
			"safari": "Abrir em Safari",
			"copy": "Copiar URL",
			"email": "Email Modo Leitura"
		},
		"bookmarks": {
			"none": "Não tem favoritos guardados",
			"first": "Dica: navegue até um site. Será capaz de marcar o site usando os botões da barra de ferramentas.",
			"added": "Favorito Adicionado"
		},
		"icon": {
			"add": "Adicionar ícone",
			"title": "Pode escolher um ícone da sua biblioteca de fotos ou inserir uma imagem que copiou para a área de transferência...",
			"zoom": "Mostrar Ícone",
			"remove": "Apagar Ícone"
		},
		"browser": {
			"search": "Procura ou endereço url",
			"reader": "Modo de Leitura Disponivel",
			"2line": "Romanização Disponivel",
			"video": "Video Detetado"
		},
		"form": {
			"new": "Novo %1$s",
			"today": "Adicionar ao Separador Hoje",
			"remove": "Remover do Separador Hoje",
			"header": "Detalhes do Website",
			"footer": "Espaço para URL: %Y (Ano), %m (mês), %d (dia)",
			"advanced": "Detalhes avançados",
			"share_link": "Share Link",
			"website": "Endereço do Site",
			"website_url": "URL do Site",
			"online": "Recursos Online",
			"title": "Título",
			"short_title": "Título Abreviado (Recomendado)",
			"confirm_today_added": "Este site foi adicionado ao separador Hoje.",
			"confirm_today_removed": "Este site foi removido do separador Hoje.",
			"confirm_delete": "Tem a certeza que pretende remover o %1$s \"%2$s\"?\n\nEsta ação não pode ser refeita.",
			"errors": {
				"url": "Não parece ser um endereço URL válido. Por favor tente novamente."
			}
		}
	},
	"activity": {
		"title": "Atividade",
		"current": "Atual",
		"reports": "Relatórios",
		"month": "Mês",
		"year": "Ano",
		"other": "Outras",
		"manual": "Manual",
		"auto": "Calculado",
		"planned": "Planeado",
		"scheduled": "Agendado",
		"ministry": "Ministério",
		"theocratic": "Teocrático",
		"personal": "Pessoal",
		"actual": "Atual",
		"report": {
			"title": "Relatório para %1$s",
			"send": "Send Report",
			"hours": "Horas",
			"credits": "Credits",
			"minutes": "%1$s minutos",
			"hours_ministry": "Horas Ministério",
			"hours_other": "%1$s Horas",
			"hours_under_planned": "%1$s faltam para o planeado",
			"hours_over_planned": "%1$s além do objetivo",
			"hours_progress": "%1$s of %2$s hours",
			"hours_under": "%1$s em falta",
			"hours_over": "%1$s além",
			"hours_behind": "%1$s atrás",
			"hours_ahead": "%1$s à frente",
			"hours_ok": "No caminho certo",
			"hours_met": "Objetivo Alcançado",
			"hours_projected": "%1$s projetado",
			"hours_projected_short": "%1$s P",
			"hours_reported": "%1$s relatado",
			"hours_reported_short": "%1$s R",
			"hours_total": "%1$s total",
			"hours_total_short": "%1$s T",
			"hours_show": "Show Hours on Calendar",
			"hours_hide": "Hide Hours on Calendar",
			"placements": "Publicações",
			"placements_show": "Show Placements, Videos, RVs",
			"placements_hide": "Hide Placements, Videos, RVs",
			"mileage": "Quilometragem",
			"videos": "Vídeos",
			"visits": "Revisitas",
			"visits_all": "Todos os tipos de visitas",
			"studies": "Estudos Bíblicos",
			"studies_unique": "Estudos Bíblicos Únicos",
			"nothing": "Nada foi relatado ainda",
			"remove": "Remover do relatório"
		},
		"hours": {
			"target": "Objetivo Mensal",
			"target_total": "Objetivo Total",
			"target_alert": "Defina a meta para este mês específico. Isso substituirá o objetivo mensal padrão definido nas Configurações > Horário.",
			"carried_title": "Minutos Realizados",
			"carried_label": "Do último mês",
			"planned": "Horas Planeadas",
			"planned_total": "Total planeado",
			"planned_ok": "= Objetivo",
			"actual": "Horas Atuais",
			"progress": "Total à data",
			"future": "Planeamento Futuro",
			"summary": "Resumo da atividade",
			"total": "Total de Horas",
			"calculated": "Calculado",
			"projected": "Horas projetadas",
			"reported": "Horas Relatadas",
			"credits": {
				"add": "Adicionar Crédito de Horas",
				"delete": "Apagar Crédito de Horas",
				"singular": "Crédito de Horas",
				"plural": "Crédito de Hora",
				"reason": "Motivo",
				"hint": "ex. Escola de Pioneiros",
				"hours": "Crédito de Horas",
				"confirmDelete": "Tem a certeza que pretende apagar este crédito de horas?"
			},
			"footers": {
				"goals": "Pode substituir seu objetivo mensal por defeito",
				"planned": {
					"over": "%1$s planeado a mais que o seu objetivo",
					"under": "%1$s planeado abaixo do seu objetivo",
					"ok": "Horas Planeadas = seu objetivo mensal"
				},
				"actual": {
					"ahead": "Até agora está %1$s além do planeado",
					"behind": "Até agora está %1$s aquém do planeado",
					"ok": "Está em linha para cumprir com o seu objetivo de horas planeadas."
				},
				"projected": {
					"over": "Estará %1$s além do objetivo para este mês",
					"under": "Estará %1$s aquém do objetivo para este mês",
					"ok": "Está em linha para cumprir o objetivo deste mês"
				},
				"projected_goal": {
					"over": "Está %1$s além do objetivo mensal",
					"under": "Está %1$s aquém do objetivo mensal",
					"ok": "Atingiu o objetivo mensal"
				},
				"projected_planned": {
					"over": "Estará %1$s além das horas planeadas",
					"under": "Estará %1$s aquém das horas planeadas",
					"ok": "Alcançará o objetivo das horas planeadas"
				}
			}
		},
		"notes": {
			"none": {
				"title": "No notes to show",
				"description": "This list will show all notes from the currently selected calendar month and forward."
			}
		},
		"service_year": {
			"summary": "%1$s Resumo do Ano de Serviço"
		},
		"send": {
			"greeting": "Olá %1$s,",
			"intro": "Aqui está o meu relatório para %1$s:",
			"carried": "%1$s minutos foram transferidos para o próximo mês (km 9/88 3)",
			"credit_hours": {
				"included_hours": "O tempo reportado inclui %1$s horas de crédito para %2$s.",
				"comment_only": "Por favor note que tem um crédito de %1$s horas para %2$s."
			},
			"other_hours": {
				"included_hours": "O tempo reportado inclui %1$s %2$s.",
				"adjusted_hours": "The reported time includes some credit hours contributed from %1$s %2$s.",
				"comment_only": "Por favor note %1$s %2$s."
			}
		},
		"schedule": {
			"daily_apply": "Aplicar ao Horário Diário",
			"daily_confirm": "Em cada dia em %1$s irá aplicar seus objetivos diários à coluna Horário Planeado.",
			"recalc_apply": "Recalcular Totais do Relatório",
			"recalc_confirm": "Em cada dia em %1$s irão ser recalculados os totais para o mês."
		},
		"alerts": {
			"manual_ttl": "Inserir publicações manualmente",
			"manual_msg": "Estas publicações manuais não estão ligadas com os Contatos ou Visitas.",
			"videos_ttl": "Vídeos Mostrados",
			"videos_ttl_manual": "Inserir manualmente Vídeos mostrados",
			"videos_msg": "Estes videos mostrados não estão ligados com Contatos ou Visitas."
		}
	},
	"settings": {
		"title": "Definições",
		"dropbox": {
			"title": "Sincronização Dropbox",
			"connect": "Ligar a Dropbox",
			"connect_footer": "Ligar a Dropbox para criar automáticamente backups dos seus dados ou para sincronizar com outros equipamentos.\nSe não tem conta Dropbox pode criar uma gratuitamente.",
			"disconnect": "Desconectar do Dropbox",
			"confirm_disconnect": "Tem a certeza que pretende desconectar-se do Dropbox e parar a sincronização dos seus dados?",
			"last_sync": "Ultima Sincronização: %1$s",
			"sync_options": "Opções de Sincronização",
			"auto_sync": "Sincronização Automática",
			"wifi_only": "Limitar a Sincronização Automática por Wifi.",
			"sync_now": "Sincronizar todos os ficheiros agora",
			"sync_complete": "Sincronização Concluida",
			"syncing": "A sincronizar ...",
			"account": {
				"details": "Conta Conectada",
				"name": "Nome",
				"email": "Email"
			}
		},
		"backup": {
			"title": "Cópia de Segurança Manual",
			"button": "Realizar Cópia de Segurança Agora",
			"last": "Última Cópia de Segurança: %1$s",
			"footer": "Enviar por Email os ficheiros com a Cópia de Segurança",
			"confirm": {
				"title": "Gerar Cópia de Segurança",
				"progress": "A gerar Cópia de Segurança ...",
				"message": "Isto vai criar um ficheiro ZIP. Pode escolher onde/como salvar o ficheiro.\n\nPode demorar uns segundos a gerar o ficheiro com a Cópia de Segurança."
			},
			"reminder": {
				"enable": "Ativar lembretes para a Cópia de Segurança",
				"7day": "A cada 7 dias",
				"14day": "A cada 14 dias",
				"30day": "A cada 30 dias",
				"60day": "A cada 60 dias",
				"alert": {
					"title": "Lembrete de Cópia de Segurança",
					"message": "Está na hora de fazer uma cópia de segurnaça dos seus arquivos. Gostaria de criar a cópia de segurança agora?\n\nPode configurar os lembretes da cópia de segurança nas configurações."
				}
			},
			"restore": {
				"title": "Restaurar Cópia de Segurança",
				"progress": "A restaurar Cópia de Segurança ...",
				"restored": "Dados Restaurados",
				"confirm": "Tem certeza de que deseja restaurar os dados do ficheiro ZIP?\n\nIsso irá substituir todos os dados atuais nesta instalação do ServicePlanner.",
				"complete": "Os seus arquivos foram restaurados com sucesso.\n\nAlgum conteúdo restaurado só pode ser mostrado após reiniciar o ServicePlanner.",
				"blocked": "Algo estava errado com o ficheiro ZIP.\n\nO restauro foi bloqueado e nada foi alterado nesta instalação do ServicePlanner.",
				"cancelled": "O restauro foi cancelado e nada foi alterado nesta instalação do ServicePlanner."
			}
		},
		"appearance": {
			"title": "Aparência",
			"color": "Côr do Tema"
		},
		"workflow": {
			"title": "Fluxo de Trabalho",
			"next_visit": "Dias para a próxima visita",
			"turn_orange": "Dias até Laranja",
			"turn_red": "Dias até Vermelho",
			"turn_blood": "Dias até Vermelho Forte",
			"default_visit_type": "Tipo de Visita Padrão",
			"visit_time": "Usar Tempo Agendado",
			"hints": {
				"overview": "Workflow controls what happens when you add a new visit to a contact.\n\nEach Contact Type has it's own workflow rules. For example, if you add a new visit to a Contact Type = \"Bible Study\", then you want the Visit Type to be set to \"Return Visit\" by default. And you want the next visit to be automatically scheduled for X days into the future.\n\nNormally the time of the next visit is set to the time of the visit you are currently adding, logically assuming that if you successfully contacted the person at this time today, then try the same time again next visit. However you can tell the workflow to use the \"Scheduled Time\" of the previous visit instead - i.e. re-use the planned visit time, not the time that the visit is being recorded. This is handy for Bible Studies held at the same time each week for example.\n\nThe \"Days until ...\" options let you control the number of days before the date indicators and labels change colour.\n\nFeel free to experiment and customize the rules to match your personal workflow! You can now even click on a Contact Type and rename it.",
				"visit_time": "Por Defeito usa o Tempo Atual",
				"next_visit": "Este número será usado para autodefinir a Próxima Data de Visita.",
				"change_color": "O número de dias é contado a partir da data da última visita.",
				"default_visit_type": "Quando uma nova Visita for adicionada, será usado este Tipo de Visita como padrão.",
				"restart": "Alterar esta configuração pode não surtir efeito até que reinicie a aplicação."
			}
		},
		"partners": {
			"title": "Parceiros",
			"event": {
				"calendar": "Calendário por defeito",
				"event": "Calendário de Eventos",
				"event_footer": "Aplica-se apenas ao 1º parceiro",
				"auto_add": "Adicionar automaticamente ao calendário",
				"tentative_title": "Título do Evento - Tentativa",
				"tentative_event": "A Testemunhar com %n?",
				"confirmed_title": "Título do Evento - Confirmado",
				"confirmed_event": "A Testemunhar com %n",
				"footer": "%n = Nome do parceiro"
			},
			"name": {
				"title": "Nome dos parceiros",
				"full": "Nome completo",
				"first": "Primeiro Nome"
			}
		},
		"schedule": {
			"title": "Cronograma",
			"form": {
				"annual_goal": "Objetivo Anual",
				"monthly_goal": "Objetivo Mensal",
				"daily_goals": "Objetivo Diário",
				"daily_footer": "Redefinir para em branco (—) para ignorar o dia ao aplicar o horário para um mês no menu \"...\" no ecrã Atividade."
			}
		},
		"reporting": {
			"title": "Relatórios",
			"overseer": {
				"send_to": "Enviar Relatório para",
				"name": "Nome",
				"mobile": "Telemóvel",
				"email": "Email"
			},
			"apps": {
				"method": "Enviar Relatório por",
				"not_installed": "%1$s não parece estar instalado neste equipamento. Por favor escolha um método diferente."
			},
			"calendar": {
				"title": "Iniciar a Semana de Calendário em "
			},
			"hours": {
				"time": {
					"title": "Relatório de Tempo em",
					"tick": "Shared in Ministry",
					"hours": "Horas Completas (Defeito)",
					"minutes": "Incremento de 15 minutos",
					"footer": "Apenas por Arranjo Especial"
				},
				"other": {
					"title": "Outras Horas",
					"enable": "Ativar Outras Horas",
					"label": "Etiquetar Como",
					"one_word": "Por favor mantenha a etiqueta apenas com uma unica palavra.",
					"options": {
						"title": "Other Hours Options",
						"include_hours": "Incluir nas Horas de Atividade",
						"include_report": "Incluir nas Horas do Relatório",
						"include_comment": "Incluir no Comentário do Relatório",
						"include_breakdown": "Mostrar detalhamento",
						"maximum_hours": "Maximum Other Hours",
						"footer": "Other Hours will be reduced if monthly total exceeds maximum."
					}
				},
				"alerts": {
					"format_prompt_title": "Choose Report Format",
					"format_prompt_message": "Would you like to report your hours (if you are a pioneer) or just that you shared in the ministry?\n\nYou can change the default in Settings > Reporting at any time.\n\nOn the Activity screen you can change the report format for a specific month. You can also choose to show or hide your hours on the calendar (see the top / right menu options).",
					"format_tick": "Report Shared in Ministry ✓",
					"format_hours": "Report Full Hours",
					"month_switch_title": "Switch Report Format",
					"month_switch_hours": "Would you like to switch to reporting full hours for this month?\n\nNote: This does not affect hours displaying on the calendar which is controlled from the top / right menu.",
					"month_switch_tick": "Would you like to switch to just indicating that you shared in the ministry this month - i.e. do not share your hours?\n\nNote: This does not affect hours displaying on the calendar which is controlled from the top / right menu."
				}
			},
			"mileage": {
				"title": "  Registo de Kilometros",
				"enable": "Ativar Registo de Kilometros",
				"units_fuel": "Unidades - Combustível",
				"units_distance": "Unidades - Distância"
			},
			"options": {
				"title": "Opções adicionais",
				"notes": "Incluir Notas no Relatório",
				"zero": "Incluir Valores a Zero",
				"footer": "Opcionalmente pode esconder linhas do relatório = 0. As horas são sempre incluidas."
			},
			"comment": {
				"title": "Comentário do Relatório",
				"footer": "Mostrado na parte inferior do relatório"
			}
		},
		"ministry": {
			"title": "Ministério"
		},
		"social": {
			"website": "Website",
			"facebook": "Facebook",
			"twitter": "Twitter"
		},
		"help": {
			"title": "Ajuda & Suporte"
		},
		"issues": {
			"title": "Issue Tracker - Rastreador de Problemas"
		},
		"maps": {
			"title": "Endereços",
			"open_in": "Abrir localização em  ...",
			"contacts": {
				"title": "Pesquisa de Endereço de Contato",
				"reformat": "Reformatar o Endereço",
				"locality": "Completar Automáticamente a localidade",
				"footer": "Localidade = Subúrbio ou bairro."
			},
			"address": {
				"title": "Formato de Endereço",
				"street": "Nome da Rua",
				"no_city": "Nome de Rua, Localidade",
				"no_country": "Nome de Rua, Localidade, Cidade",
				"full": "Nome de Rua, Localidade, Cidade, País",
				"footer": "Nome da Rua inclui numero da casa. Cidade normalmente inclui Código Postal."
			},
			"locality": {
				"title": "Formato da Localidade",
				"suburb": "Subúrbio ou Bairro",
				"postcode_city": "Cidade, Código Postal",
				"city_postcode": "Código Postal, Cidade",
				"footer": "Localidade é usado para agrupar os conactos por área."
			},
			"restrictions": {
				"title": "Geocodificação reversa",
				"country": "Limitar os resultados do endereço a %1$s"
			}
		},
		"timer": {
			"title": "Temporizador",
			"enable": "Ativar temporizador",
			"rounding": {
				"title": "Intervalos de 5 minutos",
				"down": "Arredondar sempre para baixo",
				"nearest": "Arredondar para o mais próximo",
				"footer": "Decide se 13 minutos são registrados como 10 ou 15 minutos."
			},
			"seconds": {
				"title": "Segundos",
				"hide": "Ocultar acima de 00:00:59",
				"always": "Mostrar Sempre Segundos",
				"footer": "Ocultar segundos minimiza a distração."
			},
			"badge": {
				"label": "Usar emblema no Icon da Aplicação",
				"footer": "Mostrar \"1\" se o temporizador estiver a contar"
			},
			"color": {
				"title": "Cores do Temporizador",
				"slate_gray": "Cinzento",
				"light_blue": "Azul Claro",
				"dark_blue": "Azul Escuro",
				"light_green": "Verde Claro",
				"dark_green": "Verde Escuro"
			},
			"logs": {
				"title": "Registos",
				"none": "Nenhuma entrada de registo de temporizador neste dispositivo.",
				"alert": "A exclusão de uma entrada de registo do temporizador não altera sua atividade ou o tempo reportado.",
				"footer": "Apenas as 30 entradas mais recentes são mantidas. As configurações e registos do temporizador não são sincronizados entre dispositivos."
			}
		},
		"debug": {
			"title": "Ferramentas de Depuração",
			"device": "Informação de Dispositivo",
			"memory": "Memória Disponivel",
			"network": "Tipo de Rede",
			"email": {
				"title": "Enviar por Email os dados de depuração",
				"footer": "Não faça isto, a menos que eu solicite especificamente esses dados para ajudar a solucionar um problema que está a ter.",
				"message": "Não tente usar este ficheiro para qualquer coisa - apenas envie-o para %1$s.",
				"button": "Gerar Email"
			}
		},
		"beta": {
			"title": "Usuários de Versões Beta",
			"gitlab": {
				"title": "Rastreador",
				"button": "Rastreador de Problemas para Usuários Beta",
				"footer": "Usado para relatórios e comentários de erros específicos para beta. Crie uma conta gratuita do GitLab e envie-me seu nome de usuário para obter acesso."
			},
			"report": {
				"title": "Enviar novo problema",
				"email": "Seu endereço de email GitLab (Opcional)",
				"button": "Enviar Comentários",
				"footer": "Obtenha seu endereço de e-mail personalizado na parte inferior da lista de Problemas no GitLab Issue Tracker."
			}
		},
		"appstore": {
			"title": "App Store"
		},
		"tags": {
			"edit": "Alterar nome de Etiqueta",
			"delete": {
				"title": "Apagar Etiqueta",
				"warning": "A Etiqueta \"%1$s\" será removida de todos os contatos.\n\nTem a certeza que pretende realizar esta ação?"
			}
		},
		"notifications": {
			"title": "Notificações",
			"sync": "As configurações de notificação não são sincronizadas entre dispositivos",
			"report": {
				"title": "Lembrete de Relatório",
				"last": "No Ultimo dia do Mês",
				"first": "No Primeiro dia do mês seguinte",
				"notification": {
					"message": "Hora de enviar o seu relatório de serviço de campo?"
				}
			},
			"visits": {
				"title": "Lembrete de Visitas",
				"tomorrow": "Na noite antes",
				"today": "Na manhã de",
				"notification": {
					"message": "Tem %1$s %2$s agendada para %3$s."
				}
			},
			"partner": {
				"title": "Companheiro/a de Testemunho",
				"tomorrow": "Na noite antes",
				"today": "Na manhã de",
				"notification": {
					"message": "Vai trabalhar com %1$s %2$s.",
					"join_middle": ",",
					"join_last": "e"
				}
			}
		},
		"gdpr": {
			"title": "GDPR Compliance",
			"footer": "Disable contact screens and data",
			"alert": "This mode enforces compliance with the GDPR for users in the UK and EU.\n\n1) It will disable the Calls tab and the Contacts section on the Today screen.\n\n2) Any existing calls will be permanently deleted.",
			"notice": "In some parts of the world users need to comply with the General Data Protection Regulation (GDPR). This means that NO contact data can be collected.\n\nIf you are affected by the GDPR in your country then please go into Settings and enable the \"GDPR Compliance\" mode.\n\nAny questions about this please ask your local elders or check the website.",
			"important": "Important Notice",
			"understand": "I Understand"
		}
	}
}
