{
	"common": {
		"format": "Format",
		"notnow": "Ikke nå",
		"more": "Mer",
		"outline": "Omriss",
		"bible": "Bibel",
		"reset": "Tilbakestille",
		"error": "Feil",
		"new": "Ny",
		"verse": "Vers",
		"note": "Anmerkning",
		"annotate": "Kommenter",
		"annotations": "Kommentarer",
		"cancel": "Avbryt",
		"ok": "OK",
		"yes": "Yes",
		"no": "No",
		"other": "Annet",
		"done": "Ferdig",
		"top": "Topp",
		"edit": "Rediger",
		"add": "Legg til",
		"save": "Lagre",
		"delete": "Slett",
		"remove": "Fjerne",
		"search": "Søk",
		"options": "Valg",
		"chapter": "Kapittel",
		"article": "Artikel",
		"title": "Tittel",
		"image_viewer": "Bildeviser",
		"reference": "Referanse",
		"topic": "Tema",
		"heading": "Overskrift",
		"reloading": "Laster på ny",
		"loading": "Laster",
		"settings": "Innstillinger",
		"confirm": "Bekreft",
		"forums": "Forum",
		"history": "Historikk",
		"historyclear": "Slett Historikk",
		"historyconfirm": "Dette vil slette all data i Historikk. Er du sikker på at du ønsker det?",
		"subheadings": "Underoverskrift",
		"copied": "Kopiert",
		"page": "Side",
		"pages": "Sider",
		"paragraphs": "Par.",
		"footnote": "Fotnote",
		"about": "Om",
		"news": "Nyheter",
		"general": "Generelt",
		"word_search": "Søk etter ord",
		"tip": "Tips",
		"recent": "Nylig",
		"recently_opened": "Nettopp åpnet",
		"frontcover": "Forside",
		"reorder": "Bestill på ny",
		"order": "Bestill",
		"favourites": "Favoritter",
		"favouritesave": "Lagre som Favoritt",
		"websites": "Nettsted",
		"contents": "Innhold",
		"clearcache": "Slett Informasjonskaplser",
		"size": "Størrelse",
		"height": "Høyde",
		"width": "Bredde",
		"small": "Liten",
		"default": "Orginal",
		"medium": "Medium",
		"large": "Stor",
		"larger": "Større",
		"largest": "Størst",
		"fullscreen": "Full Skjerm",
		"home": "Hjem",
		"back": "Tilbake",
		"forward": "Fram",
		"toggle2lines": "Bytt 2 Rader",
		"list": "Liste",
		"grid": "Rutenett",
		"map": "Kart",
		"hybrid": "Hybrid",
		"choose": "Velg",
		"selectall": "Velg alt",
		"online": "Online",
		"file": "Fil",
		"layout": "Endre Oppsett",
		"never": "Aldri",
		"sync": "Synkroniser",
		"syncing": "Synkroniserer",
		"current": "Nåværende",
		"saved": "Lagret",
		"active": "Aktive",
		"alert": "Alarm",
		"warning": "Advarsel",
		"important": "Viktig",
		"acknowledge": "Godkjenn",
		"any": "Alle",
		"none": "Ingen",
		"enable": "Aktiver",
		"enabled": "Aktivert",
		"disable": "Deaktiver",
		"disabled": "Deaktivert",
		"update": "Oppdater",
		"modify": "Endre",
		"created": "Laget",
		"overdue": "Lenge siden",
		"cannot": "Kan ikke fortsette",
		"all": "Alle",
		"website": "Nettsted",
		"epub": "EPUB",
		"pdf": "PDF",
		"open_prompt": "Åpne %1$s",
		"view_prompt": "Se %1$s",
		"download_prompt": "Last ned %1$s",
		"details": "Detaljer",
		"stop": "Stopp",
		"start": "Start",
		"custom": "Tilpasset",
		"summary": "Sammendrag",
		"please_note": "Legg merke til",
		"when": "Når",
		"bookmarks": "Bokmerker",
		"bookmark": "Bokmerke",
		"territory": "Distrikt",
		"territories": "Distrikter",
		"congregation": "Menighet",
		"show_prompt": "Se %1$s",
		"hide_prompt": "Skjul %1$s",
		"delete_prompt": "Slett %1$s",
		"remove_prompt": "Fjern %1$s",
		"open_in_prompt": "Åpne i %1$s",
		"open_item_in_prompt": "Åpne %1$s i %2$s",
		"edit_in_prompt": "Rediger i %1$s",
		"view_in_prompt": "Vis i %1$s",
		"download_from_prompt": "Nedlastet fra %1$s",
		"sync_prompt": "Synkronisert med %1$s",
		"syncing_prompt": "Synkroniserer med %1$s",
		"notes": "Notater",
		"read_only": "Skrivebeskyttet",
		"editable": "Redigerbart",
		"required": "Krevet",
		"unknown": "Ukjent",
		"confirmed": "Bekreftet",
		"calendar": "Kalender",
		"end": "Slutt",
		"ahead": "Foran",
		"behind": "Mangler"
	},
	"time": {
		"tomorrow": "I morgen",
		"today": "Idag",
		"yesterday": "I går",
		"earlier_this_week": "Tidligere denne uken",
		"next_week": "Next Week",
		"this_week": "Denne Uken",
		"last_week": "Sist Uke",
		"next_month": "Next Month",
		"this_month": "Denne Måneden",
		"last_month": "Sist Måned",
		"older": "Eldre",
		"newer": "Nyere",
		"next_year": "Next Year",
		"this_year": "Dette Året",
		"last_year": "Sist år",
		"on_or_before": "På eller før %1$s",
		"over_years_ago": "Over %1$s years ago",
		"over_year_ago": "Over 1 year ago",
		"over_months_ago": "Over %1$s måneder siden",
		"over_month_ago": "Over 1 måned siden",
		"over_weeks_ago": "Over %1$s uker siden",
		"over_week_ago": "Over 1 uke siden",
		"over_days_ago": "Over %1$s dager siden",
		"within_days": "Innen de siste %1$s dager",
		"within_next_days": "Within the next %1$s days",
		"over_days_away": "Over %1$s days away",
		"over_week_away": "Over 1 week away",
		"over_weeks_away": "Over %1$s weeks away",
		"over_month_away": "Over 1 month away",
		"over_months_away": "Over %1$s months away",
		"over_year_away": "Over 1 year away",
		"over_years_away": "Over %1$s years away",
		"future": "Future",
		"day": "Dag",
		"week": "Uke",
		"month": "Måned",
		"year": "År",
		"hours": "timer",
		"hour": "time",
		"minutes": "minutter",
		"date": "Dato",
		"date_added": "Date Added",
		"date_created": "Date Created",
		"date_updated": "Date Updated",
		"date_picker": "Velg dato",
		"time": "Tid",
		"time_picker": "Velg time",
		"format": {
			"time": {
				"standard": "H:i",
				"full": "H:i:s"
			},
			"date": {
				"day": "l",
				"year": "Y",
				"full": "d/F/Y",
				"full_short": "d/m/y",
				"day_date_suffix": "l jS",
				"day_date_month": "D d/m",
				"day_month_date": "l, j F",
				"day_month_date_year": "l, j F Y",
				"month_year": "F Y",
				"date_month": "d/m",
				"date_month_year": "j F Y",
				"picker": "D j M"
			},
			"datetime": {
				"long": "d/m/Y H:i:s",
				"full": "l, j F Y, H:i",
				"month": "j F, l H:i",
				"month_short": "F d/m H:i",
				"day_date_month_time": "D d/m \\a\\t H:i"
			}
		},
		"abbreviations": {
			"hours_minutes": "TT:MM",
			"minutes_seconds": "MM:SS",
			"mins": "min",
			"am": "am",
			"pm": "pm",
			"st": "e",
			"nd": "er",
			"rd": "dje",
			"th": "de"
		},
		"days": {
			"long": {
				"sunday": "Søndag",
				"monday": "Mandag",
				"tuesday": "Tirsdag",
				"wednesday": "Onsdag",
				"thursday": "Torsdag",
				"friday": "Fredag",
				"saturday": "Lørdag"
			},
			"short": {
				"sun": "Søn",
				"mon": "Man",
				"tue": "Tir",
				"wed": "Ons",
				"thu": "Tor",
				"fri": "Fre",
				"sat": "Lør"
			}
		},
		"months": {
			"long": {
				"january": "Januar",
				"february": "Februar",
				"march": "Mars",
				"april": "April",
				"may": "Mai",
				"june": "Juni",
				"july": "Juli",
				"august": "August",
				"september": "September",
				"october": "Oktober",
				"november": "November",
				"december": "Desember"
			},
			"short": {
				"jan": "Jan",
				"feb": "Feb",
				"mar": "Mar",
				"apr": "Apr",
				"may": "Mai",
				"jun": "Jun",
				"jul": "Jul",
				"aug": "Aug",
				"sep": "Sep",
				"oct": "Okt",
				"nov": "Nov",
				"dec": "Des"
			}
		}
	},
	"measurement": {
		"long": {
			"km": "KM",
			"mi": "Engelsk Mil",
			"gal": "Gallon",
			"L": "Litr"
		}
	},
	"titles": {
		"mr": "Herr",
		"mrs": "Fru",
		"miss": "Frøken",
		"ms": "Ms",
		"dr": "Doktor"
	},
	"email": {
		"feedback": "Send Tilbakemelding",
		"standard": "Epost Standard Format",
		"send": "Send Epost",
		"confirm": "Vær snill å sjekk om spørsmålet ditt, problemet eller ideen ikke allerede er dekket i Nyheter eller Bruker Forumet.",
		"english": "All hjelp foregår på Engelsk, håper du kan forstå.",
		"import": "Importer til %1$s",
		"footer": "Epost generert av %1$s"
	},
	"forms": {
		"validation": {
			"alert_title": "Ugyldig",
			"alert_message": "Fiks følgende...",
			"missing_value": "\"%1$s\" trenger å inneholde en verdi",
			"url": "Legge inn en gyldig URL som starter med http:// eller https://"
		}
	},
	"search": {
		"placeholder": "Søk %1$s",
		"searching": "Søker",
		"nothing": "Oj! Fant ingen ting"
	},
	"browser": {
		"reload": "Last side på nytt",
		"open": "Open Browser",
		"safari": "Åpne i Safari",
		"clipboard": "Kopier Link til Utklippstavlen",
		"email": "Send Link til denne siden på Epost"
	},
	"apps": {
		"email": "Epost",
		"sms": "Tekstmelding",
		"telegram": "Telegram",
		"whatsapp": "WhatsApp",
		"wechat": "WeChat",
		"viber": "Viber",
		"line": "LINE",
		"hourglass": "Hourglass",
		"nwpublisher": "NW Publisher",
		"dropbox": "Dropbox",
		"th": "Territory Helper",
		"tasks": {
			"alert": "%1$s Advarsel",
			"error": "%1$s Feil",
			"account": "%1$s Bruker",
			"connect": "Koble til %1$s",
			"sign_in": "Logg inn",
			"sign_into": "Logg inn på %1$s",
			"permissions": "Oppdater Tillatelser",
			"register": "Registrer med %1$s",
			"registering": "Registrerer med %1$s",
			"errors": {
				"duplicate": "En %1$s synkronisering er allerede på gang. Vennligst vent og prøv igjen.",
				"registering": "Kan ikke registrere med %1$s.\n\nPrøv igjen senere eller send epost til %2$s slik at jeg kan sjekke at %3$s API fungerer som den skal.\n\nBeklager ulempene dette medfører.",
				"expired": "Din login for %1$s har utgått. Logg inn på ny for å oppdatere dine tillatelser.",
				"something": "Oj! Noe gikk galt.\n\nKanskje du ikke hadde rette sikkerhetstilgang til dette. Kanskje %1$s er offline eller opplever problemer akkurat nå.\n\nSjekk igjen eller prøv senere. Du kan også rapportere problemet.",
				"disconnected": "Du har blitt frakoblet fra %1$s. Endre instillingene og koble til på ny."
			}
		}
	},
	"alerts": {
		"phone": {
			"title": "Ring",
			"confirm": "Er du sikker på at du vil ringe\n%1$s?"
		},
		"sms": {
			"title": "Melding",
			"confirm": "Er du sikker på at du vil sende melding til %1$s?",
			"cannot": "Denne enheten kan ikke sende SMS meldinger."
		},
		"ziperror": "Filen \"%1$s\" er ikke gyldig. Mulig noe gikk galt under nedlastingen av filen - prøv å laste den ned på ny.\n\nDenne filen blir nå slettet.",
		"import": {
			"failed": "Beklager, noe gikk galt. Ingenting ble importert."
		},
		"noemail": "Det ser ikke ut til at Epost støttes på denne enheten. Har du satt opp iOS Epost kontoen din i innstillinger?",
		"restart": "Start %1$s på ny før innstillingene tas i bruk.",
		"yousure": "Er du sikker på at du ønsker å gjøre dette?",
		"internet": {
			"cannot": "Kan ikke Koble til Internett",
			"tryagain": "Koble til og prøv på nytt.",
			"offline": "Du er for øyeblikket ikke tilkoblet nettet. Koble til Internett og prøv igjen."
		},
		"permissions": {
			"calendar": "Får ikke tilgang til enhetens kalendere. Sjekk tillatelser i Innstillinger > Personvern > Kalendere."
		},
		"tables": {
			"pulldown": "Dra ned for å laste på ny...",
			"release": "Slipp for å laste på ny...",
			"loading": "Laster inn"
		}
	},
	"calls": {
		"title": "Besøk",
		"today_none": "Ingen besøk planlagt idag",
		"date_none": "Ingen besøk planlagt for %1$s",
		"today_hint": "Endre et besøks Neste Besøks Dato for å se det her.",
		"actions": {
			"first": "Legg til ditt første Besøk",
			"another": "Legg til nytt Besøk",
			"new": "Nytt Besøk",
			"verifying": "Verifiserer Besøk",
			"delete": "Slett Besøk",
			"share": "Del Besøk"
		},
		"types": {
			"first_call": "Første Besøk",
			"return_visit": "Gjenbesøk",
			"magazine_route": "Bladrute",
			"top_priority": "Viktigste",
			"bible_study": "Bibelstudie",
			"custom": "Custom Type",
			"inactive": "Inaktiv"
		},
		"types_abbreviated": {
			"first_call": "FB",
			"return_visit": "GJ",
			"magazine_route": "BR",
			"top_priority": "V",
			"bible_study": "BS",
			"custom": "CT",
			"inactive": "I"
		}
	},
	"contacts": {
		"title": "Kontakter",
		"contact": "Kontakt",
		"selected": "%1$s Valgt",
		"name": "Navn",
		"phone": "Telefon",
		"email": "Epost",
		"link": "Link",
		"actions": {
			"first": "Legg til din første Kontakt",
			"another": "Legg til ny Kontakt",
			"first_hint": "Klikk på + knappen oppe til høyre...",
			"add": "Legg til Kontakt",
			"new": "Ny Kontakt",
			"import": "Importer fra Enhetens Kontakter",
			"verifying": "Sjekker Kontakter",
			"filter": "Filtrer Kontakter",
			"edit": "Rediger Kontakt",
			"delete": "Slett Kontakt",
			"deleted": "Slettet Kontakt",
			"message": "Send Melding",
			"share": "Del Kontakt",
			"search": "Søk Kontakter",
			"search_hint": "Søk etter Navn eller Adresse"
		},
		"shared": {
			"subject": "Delt Kontakt fra ServicePlanner",
			"intro": "Denne Kontakten har blitt delt med deg fra <a href=\"https://serviceplanner.me\">ServicePlanner</a>. Hvis du også bruker ServicePlanner, kan du importere denne Kontakten ved å åpne vedlegget i eposten.",
			"email": "Sammendrag Epost",
			"file": "Delt Fil",
			"choose": "Hvordan vil du dele denne Kontakten?",
			"import": {
				"confirm": "Er du sikker på at du vil importere denne Kontakten?\n\nHvis Kontakten allerede eksisterer, vil tidligere detaljer erstattes. Ingen endring vil bli gjort på Aktivitet eller Rapporter."
			}
		},
		"headings": {
			"details": "Kontakt Detaljer",
			"profile": "Profil",
			"this_visit": "Dette Besøket",
			"last_visit": "Sist Besøk",
			"next_visit": "Neste Besøk",
			"next_visit_day": "Besøksdag",
			"next_visit_on": "Neste Besøk på %1$s"
		},
		"filters": {
			"save": "Lagre dette Filteret",
			"overwrite": "Overwrite Using Current Filter Settings",
			"header_include": "Ta med",
			"footer_include": "Kontakter som skal tas med i listen",
			"header_exclude": "Ikke ta med",
			"footer_exclude": "Kontakter som ikke skal tas med i listen.",
			"include_before": "Ta med Datoer før",
			"types": "Typer",
			"all": "Alle Kontakter",
			"default": {
				"bylocality": "Kontakter etter område",
				"bylocality_desc": "Gruppert etter område og sortert etter Neste Besøksdato",
				"bytype": "Kontakter etter Type",
				"bytype_desc": "Gruppert etter Type og sortert etter Neste Besøksdato",
				"inactive": "Inaktive Kontakter",
				"inactive_desc": "Gruppert og sortert etter Siste Besøksdato, eldst først",
				"overdue": "Oversette Kontakter",
				"overdue_desc": "Gruppert etter Siste Besøksdato, eldst først"
			},
			"sorting": {
				"sort_by": "Sorter etter",
				"sort_field": "Felt",
				"sort_value": "Verdi",
				"sort_group_by": "Sorter innenfor Gruppe etter",
				"primary": "Primær Sortering",
				"secondary": "Sekundær Sortering",
				"order": "Rekkefølge",
				"ascending": "Stigende",
				"descending": "Synkende",
				"asc": "OPP",
				"desc": "NED",
				"footer": "Ordne de listede Kontaktene",
				"footer_grouped": "Ordne Kontakter innenfor Gruppen",
				"last_visit": "Siste Besøksdato",
				"next_visit": "Neste Besøksdato"
			},
			"saved": {
				"saved": "Lagret Filter",
				"default": "Standard Filter",
				"other": "Andre Filter",
				"name": "Filter Navn",
				"description": "Filterbeskrivning",
				"delete": "Slette Filter",
				"delete_confirm": "Er du sikker på at du vil slette dette filteret?",
				"reorder": "Endre rekkefølge",
				"reorder_save": "Lagre rekkefølge",
				"reset": "Tilbakestille Filter",
				"reset_confirm": "Dette vil slette dine tilpassede filter og tilbakestille til standard filtrering.\n\nEr du sikker?",
				"footer": "Dra for å endre eller slette et filter. Bruk verktøy menyen for å endre rekkefølge. Det øverste filteret er alltid et standard filter."
			},
			"grouping": {
				"group_by": "Grupper etter",
				"turn_off": "Slå av Gruppering",
				"disabled": "Gruppering er avslått",
				"footer": "Grupperer Kontakter under seksjonsoverskrifter"
			},
			"alerts": {
				"no_types": "Velg minst en Kontaktype",
				"no_matches": "Ingen matchende Kontakter",
				"no_matches_hint": "Du må endre Filter innstillinger",
				"apply_today_filter": "Dette vil endre nåværende filter til å vise \"All Contacts\" with the \"Next Visit Date\" sett til %1$s.",
				"apply_on_or_before_filter": "Dette vil endre nåværende filter til å vise \"All Contacts\" with the \"Next Visit Date\" på eller før %1$s."
			}
		},
		"type": "Type",
		"language": "Språk",
		"tags": "Tagger",
		"tag": "Taggnavn",
		"placed": "Levert",
		"placed_qty": "Antall Levert",
		"no_placements": "Du har ikke levert noe enda",
		"no_videos": "Du har ikke vist noen videoer enda",
		"shown": "Viste Videoer",
		"shown_qty": "Totalt antall visninger",
		"videos": "Videoer",
		"visits": {
			"title": "Besøk",
			"visit": "Besøk",
			"type": "Visit Type",
			"by_type": "Besøk etter Type",
			"plans": "Planer",
			"details": "Besøksdetaljer",
			"next": "Neste Planlagte Besøk",
			"previous": "Sist gang",
			"no_placements": "Ingen leveringer eller videoer",
			"days_since": "Dager siden siste besøk",
			"days_until": "Dager til neste besøk",
			"days_overdue": "Dager for sent",
			"actions": {
				"first": "Legg til ditt første besøk",
				"first_hint": "Klikk på + knappen oppe til høyre...",
				"new": "Nytt Besøk",
				"new_on": "Nytt Besøk den %1$s",
				"edit": "Rediger Besøk",
				"view": "Sist Besøk",
				"remind": "Send en Påminnelse",
				"delete": "Slett Besøk",
				"confirmDelete": "Er du sikker på at du vil slette dette besøket? Dette vil også slette leveringer fra rapportene.",
				"manual": "Legg til en verdi her for å legge til historisk rapportdata. Eller loggfør sine Besøk mot Kontaktene dine.",
				"plans": {
					"previous": "Tidligere Planer",
					"insert_this": "Legg til i Besøkets Notater",
					"insert_next": "Legg til Neste Besøksplan"
				}
			},
			"types": {
				"not_home": "Ikke Hjemme",
				"secular": "Secular"
			}
		},
		"alerts": {
			"calculated": "Denne verdien blir hentet automatisk fra tidligere Besøk du har gjort.",
			"inactive": "Endre til Inaktiv",
			"permanent": "Slett helt",
			"confirmDelete": "Vil du endre Kontakt Type for %1$s til \"Inactive\"? Eller vil du slette dem helt?\n\nNB!: Å slette en kontakt fjerner ikke besøk eller leveringer fra rapportene (dette kan gjøres ved å slette besøk enkeltvis først).",
			"confirmDeleteSelected": "Ønsker du å slette de %1$s valgte kontaktene?\n\nEller vil du endre typen til \"Inactive\" isteden?",
			"confirmDate": "Sett neste Besøksdato for %1$s valgte kontakter til:"
		},
		"pickers": {
			"type": "Kontakt Type",
			"type_hint": "You can rename these types in Settings > Workflow",
			"tags": "Velg Tagger",
			"thisvisitdate": "Dette Besøket",
			"nextvisitdate": "Neste Besøk",
			"dateNextVisit": "Neste Besøksdato",
			"next_week": "+ 1 uke",
			"next_fortnight": "+ 2 uker",
			"next_month": "+ 4 uker",
			"location": {
				"title": "Tving Posisjon",
				"message": "Tving adressen til å bruke GPS kordinater fra...",
				"my_location": "Min Posisjon",
				"insert_location": "Sett inn Min Posisjon",
				"previous_address": "Sett inn tidligere Adresse"
			}
		}
	},
	"partners": {
		"partner": "Feltavtale",
		"start": "Avtale fra",
		"end": "Avtale til",
		"calendars": {
			"header": "Enhetens Kalenderinnstilling",
			"device": "Enhetens Kalendere",
			"readonly": "Skrivebeskyttet kalendere vises ikke",
			"add": "Legg til Kalender",
			"remove": "Slett fra Kalender",
			"notes": "Endre avtale detaljer i ServicePlanner."
		}
	},
	"qrcode": {
		"show": "Show QR Code",
		"saved": "QR Code saved to your Photo Library.",
		"error": "Could not save the QR code to your Photo Library."
	},
	"maps": {
		"title": "Kart",
		"type": {
			"choose": "Velg Karttype:",
			"normal": "Standard",
			"hybrid": "Hybrid",
			"satellite": "Satelitt",
			"terrain": "Terreng"
		},
		"options": {
			"tracking_on": "Min Posisjon På",
			"tracking_off": "Min Posisjon Av",
			"traffic_on": "Traffikk På",
			"traffic_off": "Traffikk Av",
			"poi_on": "Points of Interest On",
			"poi_off": "Points of Interest Off"
		},
		"apps": {
			"applemaps": "Apple Maps",
			"googlemaps": "Google Maps",
			"waze": "Waze"
		},
		"ask": "Spør hver gang",
		"address": {
			"select": "Vennligst velg riktig adresse:",
			"invalid": "Ugyldig adresse. Prøv igjen.",
			"askapp": "Åpne adresse med ..."
		},
		"manual": {
			"confirm": "Vil du endre posisjonen for \"%1$s\" til de nye kordinatene?\n\nNB!: Dette vil ikke oppdatere adressen til kontakten, bare posisjonen til markøren på kartet."
		},
		"locator": {
			"message": "Hva vil du gjøre med denne adressen?",
			"what": "Hva vil du vise?",
			"current": "Min Posisjon",
			"contact": "Opprett ny Kontakt",
			"move": "Flytt Eksisterende Kontakt"
		},
		"locations": {
			"message": "Hva vil du gjøre?",
			"open_in": "Åpne i %1$s",
			"drive": "Kjør til Stedet",
			"star": "Favoritt Sted",
			"flag": "Distriktflagg",
			"car": "Bilens Posisjon",
			"hall": "Rikets sal",
			"home": "Hjem",
			"set": "Angi %1$s",
			"remove": "Ta bort Stedsnål"
		}
	},
	"addresses": {
		"address": "Addresse",
		"geocode": "Geokode",
		"location": "Posisjon",
		"locations": "Posisjoner",
		"locality": "Område",
		"unit": "Enhet",
		"units": "Enheter",
		"floor": "Etasje",
		"ground": "Bakkeplan",
		"number": "Nummer",
		"street": "Gate",
		"city": "By",
		"postcode": "Postkode",
		"locale": "Sted",
		"components": "Addressekomponenter",
		"latitude": "Breddegrad",
		"longitude": "Lengdegrad",
		"suburb": "Bydel",
		"county": "Fylke",
		"state": "Kommune",
		"state_code": "Kommunenummer",
		"country": "Land",
		"country_code": "Landskode",
		"place_id": "Place ID",
		"place_id_hint": "Google Place ID",
		"formatted": "Formatert",
		"formatted_hint": "Full Addresse",
		"actions": {
			"lookup": "Skan Adresse",
			"lookup_footer": "Ved hjelp av adressen, legges geokode og adressekomponenter automatisk til. Du kan også endre manuelt nedenfor.",
			"lookup_location": "Finn Adresse",
			"lookup_location_footer": "Ved hjelp av posisjonen din, legges adresse, geokode og adressekomponenter automatisk til. Du kan også søke ved hjelp av adresse.",
			"current_location": "Bruk Min Posisjon",
			"current_location_footer": "Din Posisjon brukes for å finne Bredde- og Lengdegrad."
		}
	},
	"territories": {
		"name": "Menighetens Navn",
		"pick": "Hvilket Distrikt?",
		"none": "Du har ikke lagt til noen Kart enda.",
		"map_number": "Kart %1$s",
		"map_number_type": "Kart %1$s (%2$s)",
		"add": {
			"new": "Legg til nytt Distrikt",
			"sorry": "For øyeblikket støttes bare Distrikter fra Territory Helper (territoryhelper.com). Det vil i fremtiden bli mulig å lage dine egne manuelt.",
			"import": "Importer fra Territory Helper",
			"manual": "Lag Manuelt"
		},
		"search": {
			"congregation": "Søk %1$s Kart",
			"map": "Søk Kart %1$s (%2$s)"
		},
		"maps": {
			"none": "Det er ingen Kart for dette Territoriet enda.",
			"types": "Karttyper",
			"types_footer": "Endre rekkefølge eller klikk for å endre farge.",
			"type": "Karttype",
			"details": "Kartdetaljer",
			"number": "Kartnummer",
			"label": "Kartmerke",
			"image": "Kartbilde",
			"assigned": "Utlevert",
			"assigned_to": "Utlevert til %1$s",
			"unassigned": "Tilgjengelig"
		},
		"locations": {
			"details": "Område Detaljer",
			"type": "Område Type",
			"status": "Område Status",
			"language": "Område Språk",
			"first": "Legg til ditt første område",
			"add_to": "Legg til Kart %1$s",
			"visibility": {
				"title": "Synlighet",
				"approved": "Godkjent å Vise",
				"unapproved": "Ikke godkjent å Vise"
			}
		},
		"units": {
			"floor_hint": "Etasje 0 = Bakkenivå",
			"details": "Bodetaljer",
			"type": "Botype",
			"status": "Bostatus",
			"add": "Legg til en Bolig"
		},
		"statistics": {
			"title": "Statestikk",
			"unique": "Unik"
		},
		"types": {
			"house": "Hus",
			"apartment": "Leilighet",
			"business": "Forretning",
			"trainstation": "Togstasjon",
			"busstation": "Busstasjon",
			"school": "Skole",
			"store": "Butikk",
			"language": "Språk",
			"harbour": "Havn",
			"airport": "Flyplass",
			"truckstop": "Holdeplass",
			"elderlyhome": "Eldrehjem",
			"park": "Park",
			"camp": "Campingplass",
			"restaurant": "Restaurant",
			"hotel": "Hotell",
			"vacation": "Sommerhus"
		},
		"statuses": {
			"unknown": "Ukjent status",
			"returnvisit": "Gjenbesøk",
			"biblestudy": "Bibelstudie",
			"donotcall": "Ikke Besøk!",
			"eldersonly": "For de eldste",
			"locked": "Låst",
			"lettersonly": "Bare brev",
			"vacant": "Tomt",
			"notrespassing": "Privat eiendom",
			"daysleeper": "Sover på dagene",
			"witness": "Vitne",
			"phoneonly": "Bare Telefon",
			"referral": "Henvisning",
			"bewareofdog": "Pass Hunden!"
		},
		"visits": {
			"add": "Legg til Besøk",
			"delete": "Slett Besøk",
			"status": "Besøkstatus",
			"visited": {
				"last": "Sist Besøkt",
				"never": "Aldri Besøkt",
				"date": "Dato Besøkt"
			},
			"statuses": {
				"unvisited": "Ubesøkt",
				"visited": "Besøkt",
				"skipped": "Hoppet over",
				"nothome1": "Ikke Hjemme 1",
				"nothome2": "Ikke Hjemme 2",
				"nothome3": "Ikke Hjemme 3"
			}
		},
		"languages": {
			"unknown": "Ukjent Språk"
		},
		"filters": {
			"matches": "Finner ingen lignende filer",
			"change": "Endre filteret",
			"maps": {
				"title": "Kart Filtere",
				"include": {
					"title": "Kart å ta med",
					"all": "Alle Kart",
					"assigned": "Utlevert",
					"mine": "Utlevert til meg"
				},
				"group": {
					"title": "Grupper etter",
					"type": "Karttype",
					"none": "Ingen Gruppering"
				},
				"sort": {
					"title": "Sorter etter",
					"number": "Kartnummer",
					"oldest": "Eldste først",
					"assigned": "Nylig Utlevert",
					"addresses": "Unike Adresser"
				}
			},
			"locations": {
				"title": "Område Filter",
				"types": "Område og Hustype",
				"statuses": "Område og Bostatus",
				"languages": "Område og Språk",
				"apply_list": "Legg til Listen",
				"apply_map": "Legg til Kartet"
			}
		},
		"th": {
			"form": {
				"import": "Importer Kart",
				"nosync": "Konto detaljer for Territory Helper blir ikke synkronisert mellom enheter. Du må logge deg inn på hver enhet.",
				"geocode": "Please press the locate button to the right of the address field to geocode the address with the latitude and longitude coordinates.",
				"address": "Address details can only be changed in Territory Helper.",
				"online": "You must be online to change data in Territory Helper.",
				"details": "These details come from Territory Helper.",
				"privacy": "Notes are stored in Territory Helper. Please ensure the note complies with local data privacy laws.",
				"list": "This list comes from Territory Helper.",
				"remove": "Are you sure you want to remove the Territory \"%1$s\" from ServicePlanner?"
			},
			"setup": {
				"publisher": "Getting Publisher Details",
				"congregaton": "Getting Congregation Details"
			},
			"sync": {
				"title": "Use the Refresh Button",
				"hint": "Use the Refresh button top/right to get the latest Maps data from Territory Helper.",
				"importing": "Importing Territory Maps ...",
				"wait": "Please wait while the maps are imported from Territory Helper.",
				"map": "Refresh Map Data",
				"location": "Refresh Location Data",
				"sending": "Sending changes to Territory Helper"
			},
			"assignments": {
				"status": "Assignment Status",
				"assigned": "Assigned",
				"assigned_to": "Assigned to %1$s",
				"assigned_me": "Assigned to Me",
				"assigned_date": "Assigned %1$s (%2$s days)",
				"assigned_none": "No Maps Assigned To Me",
				"not": "Not currently assigned",
				"request": "Request Map",
				"request_made": "Your map request has been submitted. Please wait for the Territory Servant to process your request.",
				"return": "Return Worked",
				"unworked": "Return Unworked"
			},
			"roles": {
				"0": "Publisher",
				"10": "Advanced",
				"30": "Elder",
				"35": "Overseer",
				"40": "Assistant",
				"50": "Administrator",
				"60": "Translator",
				"100": "System Administrator"
			},
			"permissions": {
				"reset": "Reset Permissions",
				"low": "Sorry, you do not have permission to perform this task in Territory Helper.",
				"changed": "If your permissions were recently upgraded in Territory Helper then please go to the territory settings in ServicePlanner and \"Reset Permissions\"."
			}
		}
	},
	"today": {
		"title": "Idag",
		"plugins": {
			"timer": "Stoppeklokke",
			"media": "Videoer",
			"bookshelf": "Publikasjoner",
			"territories": "Distrikt",
			"contacts": "Planlagte besøk",
			"hours": "Timer",
			"activity": "Leveringer"
		},
		"settings": {
			"title": "Idag Innstillinger",
			"plugins": "Tillegg",
			"heading": "Overskrift",
			"activity": "Leveringer - Hvilke leveringer skal vises?",
			"hours": "Timer - Hvilke timer skal vises?"
		}
	},
	"timer": {
		"stop": "Stopp",
		"start": "Start",
		"pause": "Pause",
		"resume": "Fortsett",
		"confirm": {
			"more": "Du må ha minst 5 min for å rapportere.",
			"message": "Vil du legge %1$s (%2$s) til din aktivitet for %3$s?",
			"ministry": "Legg til Tjeneste Timer",
			"other": "Legg til %1$s Timer",
			"stop": "Stoppe tidtakeren",
			"done_ministry": "%1$s (%2$s) er lagt til dine Tjeneste Timer for %3$s.",
			"done_other": "%1$s (%2$s) ble lagt til dine %3$s Timer for %4$s."
		}
	},
	"library": {
		"title": "Bibliotek"
	},
	"clipboard": {
		"cover": {
			"add": "Legg til Framside",
			"title": "Du kan legge til framside med lagrede bilder eller ved å sette inn et bilde du har kopiert...",
			"choose": "Velg Bilde",
			"clipboard": "Bruk Kopiert Bilde",
			"zoom": "Vis Framside",
			"remove": "Fjern Framside"
		},
		"paste": {
			"no_image_title": "Finner ingen Bilder",
			"no_image_message": "Det ser ikke ut til at du har kopiert noen bilder.\n\nFinn et bilde, trykk og hold for å \"Copy\" ."
		}
	},
	"bookshelf": {
		"title": "Bokhylle",
		"publications": "Publikasjoner",
		"hints": {
			"first_item": "Trykk på + i verktøylinjen for å legge til din første %1$s",
			"add_item": "Trykk på + i verktøylinjen for å legge til en %1$s",
			"no_recent": "Nylige gjenstander vises etter en hvis tid. Velg \"All\" i verktøylinjen for å velge ditt første."
		},
		"default": {
			"description": "You can use the \"+\" button in the top toolbar to add publications to this category.\n\nTo get you started, would you like to add some default publications? You can edit or delete them at any time.",
			"confirm": "Would you like to add some default publications to this category? It will try to skip duplicate entries based on the publication abbreviation.",
			"button": "Add Default %1$s"
		},
		"sections": {
			"magazines": "Blader",
			"awake": "Våkn Opp!",
			"watchtower": "Vakttårnet",
			"books": "Bøker",
			"brochures": "Brosjyrer",
			"tracts": "Traktater",
			"invites": "Invitasjoner",
			"other": "Andre"
		},
		"singular": {
			"magazines": "Blad",
			"awake": "Våkn Opp!",
			"watchtower": "Vakttårnet",
			"watchtower_public": "Vakttårnet (Offentlig)",
			"watchtower_study": "Vakttårnet (Studie)",
			"watchtower_simplified": "Vakttårnet (Forenklet)",
			"books": "Bok",
			"brochures": "Brosjyre",
			"tracts": "Traktat",
			"invites": "Invitasjon",
			"other": "Publikasjon",
			"card": "Kontaktkort",
			"letter": "Brev",
			"link": "Link til nettstedet"
		},
		"form": {
			"new": "Ny %1$s",
			"today": "Legg til Idag skjermen",
			"remove": "Ta bort fra Idag skjermen",
			"header": "Detaljer om Publikasjonen",
			"advanced": "Avanserte Detaljer",
			"abbr": "Forkortelse",
			"url": "Nettside (www)",
			"issue": "Utgave",
			"issue_number": "Nr.",
			"title": "Tittel",
			"locations": "Nedlastingsplassering",
			"pdf_url": "Nedlastingsside",
			"epub_url": "Nedlastingsside",
			"short_title": "Kort Tittel (Anbefalt)",
			"published": "Publisert",
			"count": "Tell som en Levering",
			"confirmTodayAdded": "Denne publikasjonen er nå lagt til Idag skjerm.",
			"confirmTodayRemoved": "Denne publikasjonen har nå blitt fjernet fra Idag skjermen.",
			"confirmDelete": "Ønsker du å slette %1$s \"%2$s\"?\n\nDette kan ikke angres.",
			"cannot_delete": "Denne publikasjonen er merket som levert til et besøk og kan ikke slettes.\n\nDu kan bruke Filteret for å finne Kontakter som har denne publikasjonen i deres Bibliotek, for så å slette Leveringen manuelt.",
			"tips": {
				"lookup": "Denne Finn knappen kan hjelpe til med å finne ekstra informasjon til publikasjonen. Når den ikke finner noe viser den et tomt felt. I et slikt tilfelle må du selv legge til den ekstra informasjonen du selv ønsker.",
				"no_image": "Denne knappen vil ikke lenger legge til et bilde av publikasjonens forside. Du kan bruke “Legg til Forside” knappen for å gjøre dette selv. Se Hjelp seksjonen på denne appens nettside for mer informasjon.",
				"abbr": {
					"books": "Forkortelse (bh, lv ...)",
					"brochures": "Forkortelse (fg, lc ...)",
					"tracts": "Forkortelse (T-36, T-37 ...)"
				}
			},
			"errors": {
				"abbreviation": "Det ser ikke ut til å være noe informasjon tilgjengelig for denne publikasjonen på dette språket. Prøv en annen forkortelse, eller legg til informasjonen manuelt.",
				"imported": "Denne publikasjonen ble importert og er ikke linket til noen andre publikasjoner i ditt ServicePlanner Bibliotek.\n\nDu kan legge publikasjonen til på ny blandt noen av besøkene dine for å oppdatere listen."
			}
		}
	},
	"media": {
		"title": "Mediainnhold",
		"videos": "Videoer",
		"video": "Video",
		"default": {
			"description": "You can use the \"+\" button in the top toolbar to add videos to this category.\n\nTo get you started, would you like to add some generic video placeholders? These can be used to report videos shown to householders without having to add every specific video available. You can edit or delete them at any time.",
			"confirm": "Would you like to add some generic videos to this category? It will try to skip duplicate entries.",
			"button": "Add Generic Videos",
			"section": "Section %1$s Video"
		},
		"sections": {
			"ministry": "Video - Møter og Forkynnelse",
			"study": "Bible Study",
			"children": "Video - Barn",
			"whiteboard": "Video - Tenåringer",
			"songs": "Video - Sanger",
			"other": "Video - Andre"
		},
		"singular": {
			"videos": "Video",
			"ministry": "Video - Møter og Forkynnelse",
			"study": "Study Video",
			"children": "Video - Barn",
			"whiteboard": "Video - Tenåringer",
			"songs": "Video - Sanger",
			"other": "Video - Andre"
		},
		"plural": {
			"videos": "Videoer",
			"ministry": "Video - Møter og Forkynnelse",
			"study": "Study Videos",
			"children": "Video - Barn",
			"whiteboard": "Video - Tenåringer",
			"songs": "Video - Sanger",
			"other": "Video - Andre"
		},
		"sizes": {
			"240": "240p",
			"360": "360p",
			"480": "480p",
			"720": "720p"
		},
		"form": {
			"new": "Ny %1$s",
			"today": "Legg til Idag skjermen",
			"remove": "Ta bort fra Idag skjermen",
			"header": "Video Detaljer",
			"downloaded_footer": "Nedlastede videoer vil ikke synkroniseres mot Dropbox",
			"advanced": "Avanserte Detaljer",
			"duration": "Lengde",
			"locations": "Video Lokasjon",
			"website": "Nettside",
			"website_url": "Nettsidens URL",
			"broadcast_url": "Broadcast URL",
			"no_broadcast_url": "Legg til en gyldig Broadcast URL. Gå til tv.jw.org, finn videoen du vil legge til, kopier URL'en og lim inn her.",
			"online": "Tilgjenelig på nett",
			"download_url": "URL for å laste ned",
			"download": "Last ned Video",
			"downloaded": "Lastet ned %1$s",
			"title": "Tittel",
			"short_title": "Kort Tittel (Anbefalt)",
			"play": "Spill av %1$s",
			"stream": "Stream %1$s",
			"confirm_today_added": "Denne videoen er nå lagt til Idag skjermen.",
			"confirm_today_removed": "Denne videoen er nå fjeret fra Idag skjermen.",
			"confirm_delete": "Ønsker du å slette %1$s \"%2$s\"?\n\nDette kan ikke angres.",
			"cannot_delete": "Denne videoen er registrert som vist til et besøk og kan derfor ikke slettes.\n\nDu kan bruke Filteret for å finne Kontakter som har sett denne videoen, for så å slette den manuelt.",
			"no_videos": "Du har ikke definert en plassering for denne videoen.",
			"tips": {
				"lookup": "Denne Finn knappen kan hjelpe til med å finne ekstra informasjon til videoen. Når den ikke finner noe viser den et tomt felt. I et slikt tilfelle må du selv legge til den ekstra informasjonen du selv ønsker.",
				"no_image": "Denne knappen vil ikke lenger legge til et bilde av videoen. Du kan bruke “Legg til Forside” knappen for å gjøre dette selv. Se Hjelp seksjonen på denne appens nettside for mer informasjon."
			},
			"errors": {
				"url": "Dette ser ikke ut til å være en gyldig Broadcast URL på dette språket. Prøv en annen URL, eller legg til informasjonen manuelt.",
				"imported": "Denne videoen ble importert og er ikke linket til noen andre videoer i ditt ServicePlanner Bibliotek.\n\nDu kan legge videoen til på nytt blandt noen av besøkene dine for å oppdatere listen."
			}
		}
	},
	"languages": {
		"single": "Språk",
		"multiple": "Språk",
		"available": "Tilgjengelig på %1$s",
		"selected": "Valgt %1$s",
		"other": "Andre %1$s",
		"search": "Søk etter %1$s",
		"app": {
			"title": "App Språk",
			"hint": "Brukt på knapper og merkelapper",
			"restart": "Start appen på ny for å endre språk."
		},
		"beta": {
			"title": "Ufærdige Oversettelser (Beta)",
			"hint": "Email support@serviceplanner.me for å få hjelp"
		},
		"chinese": {
			"options": "Chinese Options",
			"characters": "Characters Only",
			"pi": "Pinyin",
			"zhu": "Zhuyin",
			"lau": "Sidney Lau",
			"yale": "Yale",
			"twoline": "%1$s 2-Line",
			"oneline": "%1$s Only"
		}
	},
	"websites": {
		"tasks": {
			"bookmark": "Legg til Bokmerke",
			"video": "Legg til Video",
			"video_cat": "Hvilken kategori vil du merke denne videoen me?",
			"briefcase": "Legg til Dokumentmappen",
			"safari": "Åpne i Safari",
			"copy": "Kopier URL",
			"email": "Epost Leser"
		},
		"bookmarks": {
			"none": "Ingen lagrede Bokmerker",
			"first": "Hint: Åpne til en nettside. Bruk knappene i verktøylinjen for å lagre ett nytt bokmerke.",
			"added": "Laget Bokmerke"
		},
		"icon": {
			"add": "Legg til Ikon",
			"title": "Du kan velge et bilde fra enheten eller lime inn et bilde du har kopiert...",
			"zoom": "Vis Ikon",
			"remove": "Fjern Ikon"
		},
		"browser": {
			"search": "Søk eller nettside url",
			"reader": "Lesevisning Tilgjengelig",
			"2line": "Romanisering Tilgjengelig",
			"video": "Video Oppdaget"
		},
		"form": {
			"new": "Ny %1$s",
			"today": "Legg til Idag skjermen",
			"remove": "Ta bort fra Idag skjermen",
			"header": "Detaljer om Nettsted",
			"footer": "URL Plassholder: %Y (År), %m (måned), %d (dag)",
			"advanced": "Avanserte Detaljer",
			"share_link": "Share Link",
			"website": "Nettside",
			"website_url": "Nettsidens URL",
			"online": "Tilgjengelig på nett",
			"title": "Tittel",
			"short_title": "Kort Tittel (Anbefalt)",
			"confirm_today_added": "Denne nettsiden er lagt til Idag skjermen.",
			"confirm_today_removed": "Denne nettsiden er fjernet fra Idag skjermen.",
			"confirm_delete": "Ønsker du å slette %1$s \"%2$s\"?\n\nDette kan ikke angres.",
			"errors": {
				"url": "Dette ser ikke ut til å være en gyldig URL. Prøv igjen."
			}
		}
	},
	"activity": {
		"title": "Timeplan",
		"current": "Nå",
		"reports": "Rapporter",
		"month": "Måned",
		"year": "År",
		"other": "Annet",
		"manual": "Manuelt",
		"auto": "Utregnet",
		"planned": "Planlagt",
		"scheduled": "Påtenkt",
		"ministry": "Tjeneste",
		"theocratic": "Teokratisk",
		"personal": "Personlig",
		"actual": "Utført",
		"report": {
			"title": "Rapport for %1$s",
			"send": "Send Rapport",
			"hours": "Timer",
			"credits": "Credits",
			"minutes": "%1$s minutter",
			"hours_ministry": "Tjeneste Timer",
			"hours_other": "%1$s Timer",
			"hours_under_planned": "%1$s igjen å planlegge",
			"hours_over_planned": "%1$s over målet",
			"hours_progress": "%1$s av %2$s timer",
			"hours_under": "%1$s under",
			"hours_over": "%1$s over",
			"hours_behind": "%1$s bakpå",
			"hours_ahead": "%1$s frampå",
			"hours_ok": "Som Planlagt",
			"hours_met": "Målet er nådd!",
			"hours_projected": "%1$s prosjektert",
			"hours_projected_short": "%1$s P",
			"hours_reported": "%1$s rapportert",
			"hours_reported_short": "%1$s R",
			"hours_total": "%1$s total",
			"hours_total_short": "%1$s T",
			"hours_show": "Show Hours on Calendar",
			"hours_hide": "Hide Hours on Calendar",
			"placements": "Leveringer",
			"placements_show": "Show Placements, Videos, RVs",
			"placements_hide": "Hide Placements, Videos, RVs",
			"mileage": "Kjøring",
			"videos": "Videoer",
			"visits": "Gjenbesøk",
			"visits_all": "Alle Besøk",
			"studies": "Bibel Studier",
			"studies_unique": "Unike Bibel Studier",
			"nothing": "Ikke rapportert noe enda",
			"remove": "Fjern fra Rapporten"
		},
		"hours": {
			"target": "Månedens mål",
			"target_total": "Totalt Mål",
			"target_alert": "Sett et mål for denne måneden. Dette vil overskrive standard Mål for måneder hentet fra Innstillinger > Timeplan.",
			"carried_title": "Overførte Minutter",
			"carried_label": "Fra sist Måned",
			"planned": "Planlagte Timer",
			"planned_total": "Totalt Planlagt",
			"planned_ok": "= Mål",
			"actual": "Utførte Timer",
			"progress": "Totalt Idag",
			"future": "Planlagt Fremover",
			"summary": "Oppsumering av Timeplanen",
			"total": "Totalt antall Timer",
			"calculated": "Beregnet",
			"projected": "Prosjekterte Timer",
			"reported": "Rapporterte Timer",
			"credits": {
				"add": "Legg til Timer tilgode",
				"delete": "Slett Timer tilgode",
				"singular": "Timer tilgode",
				"plural": "Timer tilgode",
				"reason": "Grunnlag",
				"hint": "eks. Pionerskole",
				"hours": "Tilgodeskriv Timer",
				"confirmDelete": "Ønsker du å slette disse timene du har tilgode?"
			},
			"footers": {
				"goals": "Du kan selv velge målet ditt for måneden",
				"planned": {
					"over": "%1$s planlagt over målet ditt",
					"under": "%1$s å planlegge for å nå målet ditt",
					"ok": "Planlagte Timer = ditt mål for måneden"
				},
				"actual": {
					"ahead": "Så langt er du %1$s foran planen",
					"behind": "Så langt er du %1$s bak planen",
					"ok": "Du er på god vei til å klare timeplanen din"
				},
				"projected": {
					"over": "Du vil være %1$s foran denne månedens mål",
					"under": "Du vil være %1$s under denne månedens mål",
					"ok": "Du er på god vei til å nå månedens mål"
				},
				"projected_goal": {
					"over": "Du er %1$s foran denne månedens mål",
					"under": "Du er %1$s under denne månedens mål",
					"ok": "Du har oppnådd månedens mål"
				},
				"projected_planned": {
					"over": "Du vil være %1$s foran dine planlagte timer",
					"under": "Du vil være %1$s under dine planlagte timer",
					"ok": "Du vil få til dine planlagte timer"
				}
			}
		},
		"notes": {
			"none": {
				"title": "No notes to show",
				"description": "This list will show all notes from the currently selected calendar month and forward."
			}
		},
		"service_year": {
			"summary": "%1$s Oppsumering av Tjenesteåret"
		},
		"send": {
			"greeting": "Hei %1$s,",
			"intro": "Her er min rapport for %1$s:",
			"carried": "%1$s minutter ble flyttet til neste måned (km 9/88 3)",
			"credit_hours": {
				"included_hours": "Den rapporterte tiden inkluderer %1$s timer tilgode for %2$s.",
				"comment_only": "Noter %1$s timer tilgode for %2$s."
			},
			"other_hours": {
				"included_hours": "Den rapporterte tiden inkluderer %1$s %2$s.",
				"adjusted_hours": "The reported time includes some credit hours contributed from %1$s %2$s.",
				"comment_only": "Noter %1$s %2$s."
			}
		},
		"schedule": {
			"daily_apply": "Legg til Daglig Timeplan",
			"daily_confirm": "Denne vil gå igjennom hver dag for %1$s og legge til dagens mål i Planlagte Timer kolonnen.",
			"recalc_apply": "Regn om Rapportens Totalsum",
			"recalc_confirm": "Denne vil gå igjennom hver dag for %1$s og regne om rapportens totalsum for måneden."
		},
		"alerts": {
			"manual_ttl": "Manuell Levering",
			"manual_msg": "Disse leveringene er ikke tilknyttet noen Kontakter eller Besøk.",
			"videos_ttl": "Videoer Vist",
			"videos_ttl_manual": "Manuelt lagt til Viste Videoer",
			"videos_msg": "Disse videovisningene er ikke tilknyttet noen Kontakter eller Besøk."
		}
	},
	"settings": {
		"title": "Innstillinger",
		"dropbox": {
			"title": "Dropbox Synk.",
			"connect": "Koble til Dropbox",
			"connect_footer": "Koble til Dropbox for å automatisk sikkerhetskopiere din data eller for å synkronisere data mellom flere enheter.\nHvis du ikke har en Dropbox konto, kan du lage en gratis.",
			"disconnect": "Koble fra Dropbox",
			"confirm_disconnect": "Vil du koble fra Dropbox kontoen din og stoppe synkronisering av dataene dine?",
			"last_sync": "Siste Synk: %1$s",
			"sync_options": "Synk. Innstillinger",
			"auto_sync": "Auto Synk.",
			"wifi_only": "Begrens Auto Synk. til Wifi",
			"sync_now": "Synk. Alle Filer Nå",
			"sync_complete": "Synk. Fullført",
			"syncing": "Synkroniserer ...",
			"account": {
				"details": "Tilknyttet Konto",
				"name": "Navn",
				"email": "Epost"
			}
		},
		"backup": {
			"title": "Manuell Sikkerhetskopi",
			"button": "Sikkerhetskopier Filer Nå",
			"last": "Siste Sikkerhetskopi: %1$s",
			"footer": "Send sikkerhetskopierte filer på epost",
			"confirm": {
				"title": "Lag Sikkerhetskopi",
				"progress": "Lager en sikkerhetskopi ...",
				"message": "Dette vil lage en ZIP fil av innholdet. Du kan selv velge hvor/hvordan dette skal lagres.\n\nDet kan ta noen sekunder å lage sikkerhetskopien."
			},
			"reminder": {
				"enable": "Aktiver Påminnelse for Sikkerhetskopiering",
				"7day": "Hver uke (7)",
				"14day": "Annen hver uke (14)",
				"30day": "Hver måned (30)",
				"60day": "Annen hver måned (60)",
				"alert": {
					"title": "Husk å Sikkerhetskopiere",
					"message": "Det er på tide å sikkerhetskopiere filene dine. Vil du gjøre det nå?\n\nDu kan endre disse påminnelsene i Innstillinger."
				}
			},
			"restore": {
				"title": "Gjennopprett data",
				"progress": "Gjennoppretter data ...",
				"restored": "Data Gjennopprettet",
				"confirm": "Ønsker du å gjennopprette data fra ZIP filen?\n\nDette vil erstatte all nåværende data på denne enhetens ServicePlanner.",
				"complete": "Filene dine ble gjennopprettet.\n\nDu må kanskje starte appen på ny for å se alt innholdet.",
				"blocked": "Noe er galt med ZIP filen.\n\nGjennopprettingen ble blokkert og ingenting ble endret.",
				"cancelled": "Gjennopprettingen ble avbrutt og ingenting ble endret."
			}
		},
		"appearance": {
			"title": "Utseende",
			"color": "Farge Tema"
		},
		"workflow": {
			"title": "Arbeidsflyt",
			"next_visit": "Dager til Neste Besøk",
			"turn_orange": "Dager til Oransje",
			"turn_red": "Dager til Rød",
			"turn_blood": "Dager til Mørkerød",
			"default_visit_type": "Standard Besøks Type",
			"visit_time": "Bruk Planlagt Tid",
			"hints": {
				"overview": "Workflow controls what happens when you add a new visit to a contact.\n\nEach Contact Type has it's own workflow rules. For example, if you add a new visit to a Contact Type = \"Bible Study\", then you want the Visit Type to be set to \"Return Visit\" by default. And you want the next visit to be automatically scheduled for X days into the future.\n\nNormally the time of the next visit is set to the time of the visit you are currently adding, logically assuming that if you successfully contacted the person at this time today, then try the same time again next visit. However you can tell the workflow to use the \"Scheduled Time\" of the previous visit instead - i.e. re-use the planned visit time, not the time that the visit is being recorded. This is handy for Bible Studies held at the same time each week for example.\n\nThe \"Days until ...\" options let you control the number of days before the date indicators and labels change colour.\n\nFeel free to experiment and customize the rules to match your personal workflow! You can now even click on a Contact Type and rename it.",
				"visit_time": "Settes til Nåverende Tid",
				"next_visit": "Dette nummeret vil bli brukt for å automatisk tillegge Neste Besøks Dato.",
				"change_color": "Antall dager telles fra Siste Besøks Dato.",
				"default_visit_type": "Når et nytt Besøk legges til vil den automatisk legges til i denne Besøks Typen.",
				"restart": "Innstillingene vil kanskje ikke vises før appen er startet på ny."
			}
		},
		"partners": {
			"title": "Feltavtaler",
			"event": {
				"calendar": "Standard Kalender",
				"event": "Kalender Plan",
				"event_footer": "Legges til den første avtalen",
				"auto_add": "Legg automatisk til i Kalenderen",
				"tentative_title": "Denne avtalen - Planlegges",
				"tentative_event": "På felte med %n?",
				"confirmed_title": "Denne avtalen - Avtalt",
				"confirmed_event": "På felte med %n",
				"footer": "%n = Feltavtalens navn"
			},
			"name": {
				"title": "Feltpartnerens Navn",
				"full": "Fullt Navn",
				"first": "Fornavn"
			}
		},
		"schedule": {
			"title": "Timeplan",
			"form": {
				"annual_goal": "Årlig Mål",
				"monthly_goal": "Månedlig Mål",
				"daily_goals": "Faglig Mål",
				"daily_footer": "Tilbakestill til tomt (—) for å hoppe over en dag når Timeplanen for måneden legges til fra \"...\" menyen i Aktivitet skjermen."
			}
		},
		"reporting": {
			"title": "Rapportering",
			"overseer": {
				"send_to": "Send Rapport Til",
				"name": "Navn",
				"mobile": "Telefon",
				"email": "Epost"
			},
			"apps": {
				"method": "Send Rapport Med",
				"not_installed": "%1$s ser ikke ut til å være innstallert på enheten. Prøv en annen metode."
			},
			"calendar": {
				"title": "Start Ukedagen Med"
			},
			"hours": {
				"time": {
					"title": "Rapporter Timer som",
					"tick": "Shared in Ministry",
					"hours": "Hele Timer (Standard)",
					"minutes": "15 Minutt Intervaller",
					"footer": "Bare når spesielt avtalt"
				},
				"other": {
					"title": "Andre Timer",
					"enable": "Aktiver Andre Timer",
					"label": "Merk som",
					"one_word": "Merke må være i et ord.",
					"options": {
						"title": "Other Hours Options",
						"include_hours": "Inkluder i Timeplan",
						"include_report": "Inkluder i Rapporterte Timer",
						"include_comment": "Inkluder i Rapportens kommentarfelt",
						"include_breakdown": "Show Hours Breakdown",
						"maximum_hours": "Maximum Other Hours",
						"footer": "Other Hours will be reduced if monthly total exceeds maximum."
					}
				},
				"alerts": {
					"format_prompt_title": "Choose Report Format",
					"format_prompt_message": "Would you like to report your hours (if you are a pioneer) or just that you shared in the ministry?\n\nYou can change the default in Settings > Reporting at any time.\n\nOn the Activity screen you can change the report format for a specific month. You can also choose to show or hide your hours on the calendar (see the top / right menu options).",
					"format_tick": "Report Shared in Ministry ✓",
					"format_hours": "Report Full Hours",
					"month_switch_title": "Switch Report Format",
					"month_switch_hours": "Would you like to switch to reporting full hours for this month?\n\nNote: This does not affect hours displaying on the calendar which is controlled from the top / right menu.",
					"month_switch_tick": "Would you like to switch to just indicating that you shared in the ministry this month - i.e. do not share your hours?\n\nNote: This does not affect hours displaying on the calendar which is controlled from the top / right menu."
				}
			},
			"mileage": {
				"title": "Kjørebok",
				"enable": "Aktiver loggføring av Distanse",
				"units_fuel": "Enheter - Drivstoff",
				"units_distance": "Enheter - Distanse"
			},
			"options": {
				"title": "Ekstra Innstillinger",
				"notes": "Inkluder Notater i Rapport",
				"zero": "Inkluder Null-verdier",
				"footer": "Du kan velge å ikke ta med linjer med = 0. Timer er alltid inkludert."
			},
			"comment": {
				"title": "Rapportkommentarer",
				"footer": "Brukes som signatur for Rapporten"
			}
		},
		"ministry": {
			"title": "Tjeneste"
		},
		"social": {
			"website": "Nettsted",
			"facebook": "Facebook",
			"twitter": "Twitter"
		},
		"help": {
			"title": "Hjelp & Brukerstøtte"
		},
		"issues": {
			"title": "Problem Tracker"
		},
		"maps": {
			"title": "Adresser",
			"open_in": "Åpne Lokasjon i...",
			"contacts": {
				"title": "Let etter Kontaktens Adresse",
				"reformat": "Endre Adressen",
				"locality": "Autofullfør Område",
				"footer": "Område = Adresse eller Nabolag."
			},
			"address": {
				"title": "Adresse Format",
				"street": "Gatenavn",
				"no_city": "Gatenavn, Område",
				"no_country": "Gatenavn, Område, By",
				"full": "Gatenavn, Område, By, Land",
				"footer": "Gatenavn inkluderer nummer. By inkluderer vanligvis Postkode."
			},
			"locality": {
				"title": "Lokasjon Format",
				"suburb": "Utenfor byen eller i Nærheten",
				"postcode_city": "Postkode By",
				"city_postcode": "By Postkode",
				"footer": "Lokasjonen blir brukt til å gruppere kontakter etter område."
			},
			"restrictions": {
				"title": "Reversere Geokoding",
				"country": "Begrens Adresse resultater til %1$s"
			}
		},
		"timer": {
			"title": "Stoppeklokke",
			"enable": "Aktiver Stoppeklokke",
			"rounding": {
				"title": "5 Minutts Intervaller",
				"down": "Rund av Nedover",
				"nearest": "Rund av til Nærmeste",
				"footer": "Bestem om 13 minutter skal lagers som 10 eller 15 minutter."
			},
			"seconds": {
				"title": "Sekunder",
				"hide": "Ikke vis etter 00:00:59",
				"always": "Alltid vis Sekunder",
				"footer": "Å gjemme sekunder minimerer distraksjoner."
			},
			"badge": {
				"label": "Bruk App-Merke",
				"footer": "Viser \"1\" hvis Stoppeklokken er igang."
			},
			"color": {
				"title": "Farge Stoppeklokken når den på",
				"slate_gray": "Skifergrå",
				"light_blue": "Lyseblå",
				"dark_blue": "Mørkeblå",
				"light_green": "Lysegrønn",
				"dark_green": "Mørkegrønn"
			},
			"logs": {
				"title": "Logg",
				"none": "Det finnes ingen lagret tid fra Stoppeklokken på denne enheten.",
				"alert": "Å fjerne en loggført tid påvirker ikke aktiviteten eller rapportert tid.",
				"footer": "Bare de 30 nyeste loggføringene oppbevares. Stoppeklokkens Innstillinger og Loggføringer synkroniseres ikke mot andre enheter."
			}
		},
		"debug": {
			"title": "Debug Verktøy",
			"device": "Enhet Informasjon",
			"memory": "Tilgjengelig Minne",
			"network": "Internett Type",
			"email": {
				"title": "Send Debug Data på Epost",
				"footer": "Ikke send inn dette om jeg ikke spesifikt har bedt deg om det for å hjelpe deg med et problem.",
				"message": "Ikke prøv å bruke denne filen til noe - bare send den inn til %1$s.",
				"button": "Generer Epost"
			}
		},
		"beta": {
			"title": "Beta Testere",
			"gitlab": {
				"title": "Beta Tracker",
				"button": "Problem Tracker for Beta Testere",
				"footer": "Brukes for å registrere problemer og tilbakemeldinger i beta versjoner. For å få tilgang til dette lager du en gratis bruker på GitLab og sender meg brukernavnet ditt."
			},
			"report": {
				"title": "Registrer et Problem",
				"email": "Din GitLab Epost Adresse (Valgritt)",
				"button": "Send Tilbakemelding",
				"footer": "Hent din personlige epost adresse fra bunnen til listen over Problemer under GitLab Issue Tracker."
			}
		},
		"appstore": {
			"title": "App Store"
		},
		"tags": {
			"edit": "Endre Tagg Navn",
			"delete": {
				"title": "Slett Tagg",
				"warning": "Taggen \"%1$s\" vil bli fjernet fra alle Kontakter.\n\nEr du sikker på at du vil slette denne?"
			}
		},
		"notifications": {
			"title": "Notifikasjoner",
			"sync": "Innstillinger for Notifikasjoner synkroniseres ikke mot andre enheter",
			"report": {
				"title": "Rapportpåminnelse",
				"last": "På den siste dagen i Måneden",
				"first": "Den første dagen i neste Måned",
				"notification": {
					"message": "På tide å sende inn tjenesterapporten?"
				}
			},
			"visits": {
				"title": "Besøk Påminnelse",
				"tomorrow": "Natten før",
				"today": "Om morgenen",
				"notification": {
					"message": "Du har %1$s %2$s planlagt for %3$s."
				}
			},
			"partner": {
				"title": "Feltpartner",
				"tomorrow": "Natten før",
				"today": "Om morgenen",
				"notification": {
					"message": "Du har avtale med %1$s %2$s.",
					"join_middle": ",",
					"join_last": "og"
				}
			}
		},
		"gdpr": {
			"title": "GDPR Compliance",
			"footer": "Disable contact screens and data",
			"alert": "This mode enforces compliance with the GDPR for users in the UK and EU.\n\n1) It will disable the Calls tab and the Contacts section on the Today screen.\n\n2) Any existing calls will be permanently deleted.",
			"notice": "In some parts of the world users need to comply with the General Data Protection Regulation (GDPR). This means that NO contact data can be collected.\n\nIf you are affected by the GDPR in your country then please go into Settings and enable the \"GDPR Compliance\" mode.\n\nAny questions about this please ask your local elders or check the website.",
			"important": "Important Notice",
			"understand": "I Understand"
		}
	}
}
