{
	"time": {
		"format": {
			"date": {
				"day": "l",
				"full": "m/d/Y",
				"full_short": "m/d/y",
				"day_date_suffix": "l jS",
				"day_date_month": "D m/d",
				"day_month_date": "l, F j",
				"day_month_date_year": "l, F j Y",
				"month_year": "F Y",
				"date_month": "m/d",
				"date_month_year": "j F Y"
			},
			"datetime": {
				"long": "m/d/Y g:i:s a",
				"full": "l, F j Y, g:i a",
				"month": "F j, l g:i a",
				"month_short": "M d, D g:i a",
				"day_date_month_time": "D m/d \\a\\t g:i a"
			}
		}
	},
	"websites": {
		"browser": {
			"2line": "Romanization Available"
		}
	},
	"settings": {
		"appearance": {
			"color": "Theme Color"
		},
		"timer": {
			"color": {
				"title": "Timer Running Color"
			}
		},
		"workflow": {
			"hints": {
				"overview": "Workflow controls what happens when you add a new visit to a contact.\n\nEach Contact Type has it's own workflow rules. For example, if you add a new visit to a Contact Type = \"Bible Study\", then you want the Visit Type to be set to \"Return Visit\" by default. And you want the next visit to be automatically scheduled for X days into the future.\n\nNormally the time of the next visit is set to the time of the visit you are currently adding, logically assuming that if you successfully contacted the person at this time today, then try the same time again next visit. However you can tell the workflow to use the \"Scheduled Time\" of the previous visit instead - i.e. re-use the planned visit time, not the time that the visit is being recorded. This is handy for Bible Studies held at the same time each week for example.\n\nThe \"Days until ...\" options let you control the number of days before the date indicators and labels change color.\n\nFeel free to experiment and customize the rules to match your personal workflow! You can now even click on a Contact Type and rename it."
			}
		}
	}
}