[
  {
    "id": 1,
    "title": "Data Entry Of Students",
    "desc": "This app have 2 roles, admin and treasurer. admin can do data entry of students, when data of students created, the system will make BRIVA code for them automatically",
    "image": "./src/images/data-santri.png"
  },
  {
    "id": 2,
    "title": "BRIVA Menus",
    "desc": "There are 6 menus that can treasurer use to craate BRIVA account for students, check the payment report, and see list of BRIVA account.",
    "image": "./src/images/ponpes-project.png"
  },
  {
    "id": 3,
    "title": "Form To Create BRIVA Account",
    "desc":
      "when the treasurer create BRIVA account of students, it will recorded in the bank of BRI. then, fee payment notes will be automatically made 12 for 12 months.",
    "image": "./src/images/form-create-briva.png"
  },
  {
    "id": 4,
    "title": "List of BRIVA Accounts",
    "desc":
      "in this menu, treasurer can see the list of BRIVA accounts, and also see which BRIVA Account has not been created.",
    "image": "./src/images/list-briva-santri.png"
  },
  {
    "id": 5,
    "title": "Fee Payment Report",
    "desc":
      "treasurer can search for SPP payment reports on a certain date, then click the `Simpan` button to record the report, it will automatically change the fee payment status of student in a certain month to paid off.",
    "image": "./src/images/laporan-pembayaran.png"
  },
  {
    "id": 6,
    "title": "Tuition Payment Records",
    "desc":
      "on this menu the treasurer can see the tuition payment data from all students. In addition, the payment status can also be changed to paid off or not. but the payment status automatically becomes paid off when the treasurer presses the save button on the payment report menu.",
    "image": "./src/images/data-pembayaran-spp.png"
  }
]
