<?xml version="1.0" encoding="UTF-8"?>
<!DOCTYPE svg PUBLIC "-//W3C//DTD SVG 1.1//EN" "http://www.w3.org/Graphics/SVG/1.1/DTD/svg11.dtd">
<!-- Creator: CorelDRAW 2018 (64-Bit) -->
<svg xmlns="http://www.w3.org/2000/svg" xml:space="preserve" width="425px" height="425px" version="1.1" style="shape-rendering:geometricPrecision; text-rendering:geometricPrecision; image-rendering:optimizeQuality; fill-rule:evenodd; clip-rule:evenodd"
viewBox="0 0 90.74 90.74"
 xmlns:xlink="http://www.w3.org/1999/xlink">
 <defs>
  <style type="text/css">
   <![CDATA[
    .fil0 {fill:none}
    .fil1 {fill:#2F3292}
   ]]>
  </style>
 </defs>
 <g id="Layer_x0020_1">
  <metadata id="CorelCorpID_0Corel-Layer"/>
  <g id="_2839419864560">
   <rect class="fil0" width="90.74" height="90.74"/>
   <g>
    <g id="Group_3818" data-name="Group 3818">
     <g id="Group_3761" data-name="Group 3761">
      <g id="Group_3760" data-name="Group 3760">
       <path id="Path_1020" class="fil1" d="M73.38 16.64l-0.74 -0.78c-0.58,-0.64 -1.58,-0.67 -2.21,-0.08 -0.63,0.59 -0.67,1.58 -0.08,2.21l0.73 0.79c0.59,0.63 1.59,0.67 2.22,0.08 0.63,-0.59 0.67,-1.59 0.08,-2.22z" data-name="Path 1020"/>
      </g>
     </g>
     <g id="Group_3763" data-name="Group 3763">
      <g id="Group_3762" data-name="Group 3762">
       <path id="Path_1021" class="fil1" d="M78.54 22.18l-0.73 -0.78c-0.59,-0.63 -1.58,-0.67 -2.21,-0.08 -0.63,0.59 -0.67,1.58 -0.08,2.22l0.73 0.78c0.59,0.63 1.58,0.67 2.22,0.08 0.63,-0.59 0.66,-1.58 0.07,-2.22l0 0z" data-name="Path 1021"/>
      </g>
     </g>
     <g id="Group_3767" data-name="Group 3767">
      <g id="Group_3766" data-name="Group 3766">
       <path id="Path_1023" class="fil1" d="M78.76 16.07c-0.59,-0.63 -1.58,-0.67 -2.21,-0.08l-0.78 0.73c-0.63,0.59 -0.67,1.58 -0.08,2.21 0.59,0.64 1.58,0.67 2.22,0.08l0.78 -0.73c0.63,-0.59 0.66,-1.57 0.07,-2.2 0,0 0,-0.01 0,-0.01l0 0z" data-name="Path 1023"/>
      </g>
     </g>
    </g>
    <g id="Group_3819" data-name="Group 3819">
     <g id="Group_3761-2" data-name="Group 3761">
      <g id="Group_3760-2" data-name="Group 3760">
       <path id="Path_1020-2" class="fil1" d="M17.36 16.64l0.73 -0.78c0.59,-0.64 1.58,-0.67 2.21,-0.08 0.64,0.59 0.67,1.58 0.08,2.21l-0.73 0.79c-0.59,0.63 -1.58,0.67 -2.21,0.08 -0.64,-0.59 -0.67,-1.59 -0.08,-2.22l0 0z" data-name="Path 1020"/>
      </g>
     </g>
     <g id="Group_3763-2" data-name="Group 3763">
      <g id="Group_3762-2" data-name="Group 3762">
       <path id="Path_1021-2" class="fil1" d="M12.19 22.18l0.73 -0.78c0.59,-0.63 1.58,-0.67 2.22,-0.08 0.63,0.59 0.66,1.58 0.07,2.22l-0.73 0.78c-0.59,0.63 -1.58,0.67 -2.21,0.08 -0.63,-0.59 -0.67,-1.58 -0.08,-2.22l0 0z" data-name="Path 1021"/>
      </g>
     </g>
     <g id="Group_3767-2" data-name="Group 3767">
      <g id="Group_3766-2" data-name="Group 3766">
       <path id="Path_1023-2" class="fil1" d="M11.99 16.08c0.58,-0.63 1.57,-0.67 2.2,-0.08l0.79 0.73c0.63,0.59 0.66,1.58 0.07,2.22 -0.59,0.63 -1.58,0.66 -2.21,0.07l-0.78 -0.73c0,0 0,0 0,0 -0.63,-0.59 -0.67,-1.57 -0.08,-2.21 0,0 0,0 0.01,0l0 0z" data-name="Path 1023"/>
      </g>
     </g>
    </g>
    <path class="fil1" d="M37.59 74.27l-0.02 -0.01 3.24 0c0.89,0 1.72,0.66 1.72,1.59 0,0.92 -0.83,1.58 -1.72,1.58l-18.78 0c-2.02,0 -3.93,-1.48 -3.93,-3.59l0 -48.11c0,-2.11 1.91,-3.58 3.94,-3.58l8.84 0c0.89,0 1.72,0.66 1.72,1.58 0,0.93 -0.83,1.59 -1.72,1.59l-8.84 0c-0.24,0 -0.49,0.16 -0.49,0.41l0 48.12c0,0.26 0.26,0.42 0.5,0.42l15.54 0z"/>
    <g>
     <g id="Group_3799" data-name="Group 3799">
      <g id="Group_3798" data-name="Group 3798">
       <path id="Path_1039" class="fil1" d="M49.67 35.93l-8.4 0c-0.78,0 -1.4,0.63 -1.4,1.4l0 5.6c0,0.77 0.62,1.4 1.4,1.4l8.4 0c0.77,0 1.4,-0.63 1.4,-1.4l0 -5.6c0,-0.77 -0.63,-1.4 -1.4,-1.4l0 0zm0 7l-7 0 0 -2.8 5.6 0 1.4 2.8z" data-name="Path 1039"/>
      </g>
     </g>
     <g id="Group_3803" data-name="Group 3803">
      <g id="Group_3802" data-name="Group 3802">
       <path id="Path_1041" class="fil1" d="M49.67 56.93l-8.4 0c-0.78,0 -1.4,0.63 -1.4,1.4l0 5.6c0,0.78 0.62,1.4 1.4,1.4l8.4 0c0.77,0 1.4,-0.62 1.4,-1.4l0 -5.6c0,-0.77 -0.63,-1.4 -1.4,-1.4l0 0zm0 7l-7 0 0 -2.8 5.6 0 1.4 2.8z" data-name="Path 1041"/>
      </g>
     </g>
     <g id="Group_3805" data-name="Group 3805">
      <g id="Group_3804" data-name="Group 3804">
       <path id="Path_1042" class="fil1" d="M63.67 56.93l-8.4 0c-0.78,0 -1.4,0.63 -1.4,1.4l0 5.6c0,0.78 0.62,1.4 1.4,1.4l8.4 0c0.77,0 1.4,-0.62 1.4,-1.4l0 -5.6c0,-0.77 -0.63,-1.4 -1.4,-1.4l0 0zm0 7l-7 0 0 -2.8 5.6 0 1.4 2.8z" data-name="Path 1042"/>
      </g>
     </g>
     <g id="Group_3807" data-name="Group 3807">
      <g id="Group_3806" data-name="Group 3806">
       <path id="Path_1043" class="fil1" d="M35.66 56.93l-8.4 0c-0.77,0 -1.4,0.63 -1.4,1.4l0 5.6c0,0.78 0.63,1.4 1.4,1.4l8.4 0c0.78,0 1.4,-0.62 1.4,-1.4l0 -5.6c0,-0.77 -0.62,-1.4 -1.4,-1.4l0 0zm0 7l-7 0 0 -2.8 5.61 0 1.39 2.8z" data-name="Path 1043"/>
      </g>
     </g>
     <g id="Group_3809" data-name="Group 3809">
      <g id="Group_3808" data-name="Group 3808">
       <path id="Path_1044" class="fil1" d="M59.47 49.93l-12.61 0 0 -1.39c0,-0.78 -0.63,-1.41 -1.4,-1.41 -0.78,0 -1.4,0.63 -1.4,1.4l0 1.4 -12.62 0c-0.77,0 -1.4,0.63 -1.4,1.4l0 1.4c0,0.77 0.63,1.4 1.4,1.4 0.78,0 1.4,-0.63 1.4,-1.4l11.21 0c0,0.77 0.62,1.4 1.4,1.4 0.77,0 1.4,-0.63 1.4,-1.4l11.2 0c0,0.77 0.63,1.4 1.4,1.4 0.77,0 1.4,-0.63 1.4,-1.4l0 -1.4c0,0 0,0 0,0 0,-0.76 -0.61,-1.39 -1.38,-1.4l0 0z" data-name="Path 1044"/>
      </g>
     </g>
    </g>
    <path class="fil1" d="M37.81 16.92l0 -2.08c0,-0.85 0.69,-1.53 1.53,-1.53l12.25 0c0.85,0 1.53,0.68 1.53,1.53l0 2.08 1.53 0c0.85,0 1.53,0.68 1.53,1.53l0 8.64c0,0.84 -0.68,1.53 -1.53,1.53l-18.37 0c-0.85,0 -1.53,-0.69 -1.53,-1.53l0 -8.64c0,-0.84 0.68,-1.53 1.53,-1.53l1.53 0zm15.32 8.64l0 -5.58 -1.54 0c-0.84,0 -1.53,-0.69 -1.53,-1.53l0 -2.09 -9.19 0 0 2.09c0,0.84 -0.68,1.53 -1.53,1.53l-1.53 0 0 5.58 15.32 0z"/>
    <path class="fil1" d="M53.56 74.27l15.54 0c0.24,0 0.5,-0.16 0.5,-0.42l0 -48.12c0,-0.25 -0.25,-0.41 -0.49,-0.41l-8.84 0c-0.89,0 -1.72,-0.66 -1.72,-1.59 0,-0.92 0.82,-1.58 1.72,-1.58l8.84 0c2.03,0 3.94,1.47 3.94,3.58l0 48.11c0,2.11 -1.91,3.59 -3.93,3.59l-18.78 0c-0.89,0 -1.72,-0.66 -1.72,-1.58 0,-0.93 0.83,-1.59 1.72,-1.59l3.24 0 -0.02 0.01z"/>
    <path class="fil1" d="M55.9 37.68l8.63 0c0.3,0 0.54,-0.4 0.54,-0.88 0,-0.48 -0.24,-0.87 -0.54,-0.87l-8.63 0c-0.3,0 -0.54,0.39 -0.54,0.87 0,0.49 0.24,0.88 0.54,0.88z"/>
    <path class="fil1" d="M26.4 37.68l8.63 0c0.3,0 0.54,-0.4 0.54,-0.88 0,-0.48 -0.24,-0.87 -0.54,-0.87l-8.63 0c-0.29,0 -0.54,0.39 -0.54,0.87 0,0.49 0.25,0.88 0.54,0.88z"/>
   </g>
  </g>
 </g>
</svg>
