module gitlab.com/imaginadio/golang/examples/grpc/gclient

go 1.20

require (
	gitlab.com/imaginadio/golang/examples/grpc/protobuf v1.0.1
	google.golang.org/grpc v1.53.0
)

require (
	github.com/golang/protobuf v1.5.2 // indirect
	golang.org/x/net v0.8.0 // indirect
	golang.org/x/sys v0.6.0 // indirect
	golang.org/x/text v0.8.0 // indirect
	google.golang.org/genproto v0.0.0-20230303212802-e74f57abe488 // indirect
	google.golang.org/protobuf v1.28.1 // indirect
)
