389653 194593
839772 861960
42621 212052
227301 142687
180264 853467
497557 368439
647977 324325
402193 154205
33396 507709
338418 410696
259699 619653
184610 713549
580536 641789
184470 975517
39341 823463
588280 656792
133128 773017
372411 951879
66261 30397
842533 140867
68758 220325
389071 959023
353229 29673
412744 993664
307029 798364
153259 640075
286925 396683
148990 733746
940668 733217
957724 339719
148889 839271
725266 898830
552573 176064
856155 537882
805635 961115
151053 262503
975923 16448
55051 256578
542865 65609
109411 305713
133611 249066
13645 522056
764544 432584
974595 781685
532257 746854
164884 99439
633285 272259
863999 961624
376373 301502
796860 175501
644013 908870
768867 109350
661801 346183
286477 202992
164235 956225
757022 846643
799679 977654
638307 144678
94918 391496
107669 579104
765028 911110
920484 826772
99589 175494
765361 889607
378368 382329
355578 774478
368901 964742
237572 135001
331336 252229
599883 656748
447911 324942
89305 914507
884320 211255
947608 927433
227525 805853
137910 551862
210748 80744
648636 595128
524003 909869
726839 602291
913157 50896
628411 333281
453510 625195
233875 812399
772736 375193
938325 879821
759579 946668
844918 543644
593343 451741
271505 6462
682942 978297
796654 181694
607452 51282
827925 826838
890322 606573
195443 637170
734100 966585
162679 77123
628260 578539
724059 783608
936859 670824
974577 359666
555167 449047
229623 931849
10599 789634
999923 621917
84255 725441
757041 816188
620080 516348
143441 69889
285834 341650
712216 835375
354190 641822
250058 705459
940066 102343
672278 795906
774836 463126
755767 157559
693717 818154
483479 598244
37611 463558
94277 929896
375115 16059
750406 418906
700579 443446
508824 519818
331679 155127
78305 9833
967474 931998
119396 951859
136681 112284
753902 531955
960182 337994
478667 226489
363459 571534
623115 234151
184601 961472
432163 287688
259028 756611
299690 785586
29380 56201
982148 416302
354730 515128
325122 869276
344447 414915
285744 930009
914270 344326
869538 477630
871234 738572
350056 445401
336991 696624
30516 834077
838932 985800
978384 276467
521968 793152
902428 962613
245665 611401
414399 486232
99268 887384
570599 571486
365055 813860
812475 985993
759310 9304
585480 272242
288924 380683
743162 827453
479060 882073
705683 594839
193309 797928
549751 374604
620312 895423
428929 423490
656380 952348
925787 422697
166255 694692
867701 991437
363064 92741
817638 451769
49021 458995
682369 141138
228257 663779
118373 748558
837054 910930
437576 55339
429941 623984
137553 897507
392441 565961
559121 32875
929897 326480
773937 160490
764826 398347
574510 81811
334033 773910
706398 698729
359868 305877
29381 49494
551187 796610
904170 151403
693467 307179
957010 571210
618834 975100
827012 22230
556108 764649
276156 263339
738131 244457
338851 338879
19179 498249
28538 431236
9034 122819
157385 551623
222815 973989
582309 241566
436745 158586
380499 522913
629745 329637
364192 42740
743881 966765
211095 249986
508716 777204
69854 355630
148667 135645
777363 56716
646498 289285
940201 872118
165609 941877
234302 931384
184937 466387
93453 255471
196908 348119
53489 293268
28776 426508
933032 268849
119237 144321
181619 916387
102140 548056
821355 939944
533567 830743
30609 691328
571189 653058
421831 969903
289988 204466
53876 860967
900591 176947
185419 252732
226472 384467
828745 303261
212452 168571
376973 254245
31961 444772
231414 930904
