299503 380283 441
236928 482078 449
552284 517988 452
329317 452542 449
299329 371682 441
390717 416992 449
997872 319703 525
596063 634948 509
955975 529936 525
972736 303570 525
987764 416577 525
450033 804843 509
484291 752062 509
85304 26589 351
806462 870059 525
436047 515064 470
530185 781380 509
506461 803690 509
567767 313939 470
929074 882336 476
27440 623244 470
552323 36353 470
341727 290699 384
967333 858615 507
819217 141965 509
344079 467665 449
704498 242283 509
90051 172256 383
694427 61522 509
355133 463162 449
97426 116747 354
643554 150850 509
68639 494864 449
621429 112057 470
292904 54088 443
642409 91826 509
926655 814042 525
153558 475859 449
463871 993475 525
525967 696019 509
810115 316016 509
50956 886790 525
955771 931264 507
210818 687530 509
691214 339813 509
849310 929732 476
113496 550556 470
372169 953202 525
599657 666600 509
677959 947442 525
309820 921425 525
308084 800500 509
166007 754760 509
164721 313592 443
647525 501051 509
444032 626231 470
797904 103238 509
793492 699294 504
88294 552940 470
975775 804570 525
35673 474017 449
373947 653214 509
356449 903499 525
771003 101570 509
699026 501799 509
989369 647250 525
878705 364288 525
815385 520852 509
869249 846839 419
522578 475360 470
216289 3338 383
106251 238178 443
470594 177558 449
9222 972292 525
990993 740200 525
587897 561458 434
291419 577592 470
289308 983707 525
474002 12860 449
182123 785898 509
49188 522525 470
819037 821166 450
828328 140904 509
944964 282840 525
228062 264616 443
78155 271317 443
221847 613139 470
240062 500444 449
984429 815738 525
116443 455964 449
870174 282888 525
407448 872278 525
434739 749231 509
589359 629350 509
405847 971186 525
81706 486466 449
23756 261304 443
69635 811414 509
834065 313301 509
966287 247646 525
773424 481152 509
104712 340619 443
150660 35255 375
256350 425253 449
847151 323878 525
362520 444545 449
244818 507081 449
27390 275364 443
650291 422280 509
208786 168190 373
604299 865166 525
296336 271139 389
610778 582429 434
231770 813139 509
743014 420700 509
969940 411813 525
310249 158848 443
106615 937589 525
23324 154378 375
114753 608506 470
996052 892405 507
212625 862516 525
197847 506385 449
307105 645282 509
4194 897783 525
880262 230586 525
959998 414022 525
793590 736936 468
803496 619916 509
244460 808001 509
566942 879947 525
358628 937945 525
571704 707987 509
878538 54268 525
605328 696200 509
918052 101819 525
62126 501186 449
881423 486553 525
380026 591027 470
761151 852322 525
379611 272247 441
264284 381832 441
442662 649200 509
344323 107029 443
629665 732319 504
755868 880851 525
100559 658827 509
734497 92965 509
149962 924367 525
219627 246797 443
206208 183007 360
134952 131456 331
380952 997614 525
595879 608787 403
412545 64658 449
665138 930907 525
721521 785718 468
929756 87028 525
670229 161618 509
997553 220973 525
330259 578466 470
376223 403359 436
908666 121021 525
692084 148033 509
520058 567360 452
302786 865369 525
824416 437180 509
686610 344800 509
768314 14877 509
386042 44948 443
993368 129576 525
978154 639463 525
93639 134659 354
584351 547651 434
10941 153662 375
609455 903889 525
888245 223144 525
579393 767677 509
615561 253709 470
722681 885758 525
780100 489423 509
30191 129158 354
144625 538683 470
315694 614556 470
272471 39978 443
794073 452011 509
732410 677148 504
670081 448638 509
962895 9878 525
396591 160373 443
198959 487068 449
527589 736007 509
905425 928568 476
981299 897008 507
562163 511012 470
304640 394643 441
54438 994207 525
714846 579862 509
672283 910998 525
348689 281924 441
683869 334368 509
724130 791977 468
573899 329424 470
905112 1798 525
912708 697177 525
107123 426023 449
444789 872618 525
867141 874362 432
144751 188581 383
374840 115790 443
555173 351834 470
616131 989583 525
424638 140152 449
571934 255999 470
597760 120909 470
349882 442643 449
644165 539386 509
536597 88654 470
590279 250061 470
873571 377221 525
578976 202075 470
413071 808855 509
703135 899151 525
191814 576781 470
648938 596504 509
779318 25395 509
80280 306871 443
705685 930706 525
166887 128281 383
992468 611742 525
296763 113921 443
895057 717960 525
7605 872842 525
864366 752102 525
702107 88921 509
47970 997717 525
108520 8299 354
616207 179599 470
129340 345302 443
76435 80260 351
446219 1134 449
918685 345995 525
826343 941543 525
81598 260056 443
771542 682100 504
735097 283442 509
542476 69106 470
870236 730580 525
753797 171967 509
71518 427376 449
264874 578932 470
288306 578496 470
519395 105307 470
750640 836922 468
51636 286736 443
994938 50357 525
187242 620709 470
547844 435136 470
808331 309763 509
390703 270861 441
114279 432230 449
460590 438949 387
135932 288579 443
454894 108137 449
257083 637960 509
973566 556185 525
598342 169086 470
626951 883058 525
723940 669712 504
242605 598242 470
206969 109822 383
413845 590605 470
781156 598055 509
209893 395684 443
133877 478056 449
237498 362264 441
7528 18005 279
730526 886208 525
392702 651714 509
